update branch

1 job for mix-component-arma-with-one-cv in 36 seconds (queued for 2 seconds)
Status Job ID Name Coverage
  Linux
failed #790805
TestJobLinux

00:00:36

 
Name Stage Failure
failed
TestJobLinux Linux
     ballT_Object.colorConversionIn = 40;
^~~~~~~~~~~~~~~~~
make[2]: *** [src/cpp/CMakeFiles/BallTracking.dir/BallTracking.cpp.o] Error 1
src/cpp/CMakeFiles/BallTracking.dir/build.make:62: recipe for target 'src/cpp/CMakeFiles/BallTracking.dir/BallTracking.cpp.o' failed
make[1]: *** [src/cpp/CMakeFiles/BallTracking.dir/all] Error 2
CMakeFiles/Makefile2:140: recipe for target 'src/cpp/CMakeFiles/BallTracking.dir/all' failed
Makefile:83: recipe for target 'all' failed
make: *** [all] Error 2
ERROR: Job failed: exit code 1