add fie extension

1 job for mixed-component-test in 35 seconds (queued for 2 seconds)
Status Job ID Name Coverage
  Linux
failed #790260
TestJobLinux

00:00:35

 
Name Stage Failure
failed
TestJobLinux Linux
 cvtColor.src = arma.dst;
^~~
make[2]: *** [target/CMakeFiles/ba_ballTracking.dir/ba_ballTracking.cpp.o] Error 1
target/CMakeFiles/ba_ballTracking.dir/build.make:62: recipe for target 'target/CMakeFiles/ba_ballTracking.dir/ba_ballTracking.cpp.o' failed
make[1]: *** [target/CMakeFiles/ba_ballTracking.dir/all] Error 2
CMakeFiles/Makefile2:85: recipe for target 'target/CMakeFiles/ba_ballTracking.dir/all' failed
Makefile:83: recipe for target 'all' failed
make: *** [all] Error 2
ERROR: Job failed: exit code 1