update EMAM2CPP-file

contains include <>
1 job for tmp-adi-dev in 33 seconds (queued for 2 seconds)
Status Job ID Name Coverage
  Linux
failed #783619
TestJobLinux

00:00:33

 
Name Stage Failure
failed
TestJobLinux Linux
     srcCube = to_armaCube<unsigned char, 3>(srcCV);
^~~~~~~~
target/CMakeFiles/ba_ballTracking.dir/build.make:62: recipe for target 'target/CMakeFiles/ba_ballTracking.dir/ba_ballTracking.cpp.o' failed
make[2]: *** [target/CMakeFiles/ba_ballTracking.dir/ba_ballTracking.cpp.o] Error 1
make[1]: *** [target/CMakeFiles/ba_ballTracking.dir/all] Error 2
CMakeFiles/Makefile2:85: recipe for target 'target/CMakeFiles/ba_ballTracking.dir/all' failed
make: *** [all] Error 2
Makefile:83: recipe for target 'all' failed
ERROR: Job failed: exit code 1