balls are being tracked!

1 job for adi-dev in 23 seconds (queued for 1 second)
Status Job ID Name Coverage
  Linux
failed #783348
TestJobLinux

00:00:23

 
Name Stage Failure
failed
TestJobLinux Linux
                               ^
compilation terminated.
make[2]: *** [target/CMakeFiles/ba_ballTracking.dir/ba_ballTracking.cpp.o] Error 1
target/CMakeFiles/ba_ballTracking.dir/build.make:62: recipe for target 'target/CMakeFiles/ba_ballTracking.dir/ba_ballTracking.cpp.o' failed
CMakeFiles/Makefile2:85: recipe for target 'target/CMakeFiles/ba_ballTracking.dir/all' failed
make[1]: *** [target/CMakeFiles/ba_ballTracking.dir/all] Error 2
Makefile:83: recipe for target 'all' failed
make: *** [all] Error 2
ERROR: Job failed: exit code 1