update CMakeLists

2 jobs for adi-dev in 22 seconds (queued for 2 seconds)
Status Job ID Name Coverage
  Linux
failed #782353
TestJobLinux

00:00:22

failed #781919
TestJobLinux

00:00:22

 
Name Stage Failure
failed
TestJobLinux Linux
                             ^
compilation terminated.
make[2]: *** [src/cpp/CMakeFiles/BallTracking.dir/BallTracking.cpp.o] Error 1
src/cpp/CMakeFiles/BallTracking.dir/build.make:62: recipe for target 'src/cpp/CMakeFiles/BallTracking.dir/BallTracking.cpp.o' failed
CMakeFiles/Makefile2:85: recipe for target 'src/cpp/CMakeFiles/BallTracking.dir/all' failed
make[1]: *** [src/cpp/CMakeFiles/BallTracking.dir/all] Error 2
Makefile:83: recipe for target 'all' failed
make: *** [all] Error 2
ERROR: Job failed: exit code 1