\relax 
\citation{9105997}
\citation{8052891}
\citation{8052891}
\citation{IntroCNN}
\@writefile{toc}{\contentsline {section}{\numberline {I}Einf\"uhrung}{1}\protected@file@percent }
\@writefile{toc}{\contentsline {section}{\numberline {II}Related Work}{1}\protected@file@percent }
\@writefile{toc}{\contentsline {section}{\numberline {III}Grundlagen}{1}\protected@file@percent }
\newlabel{sec:grundlangen}{{III}{1}}
\@writefile{toc}{\contentsline {subsection}{\numberline {III-A}Deep Learning Algorithm}{1}\protected@file@percent }
\@writefile{toc}{\contentsline {subsubsection}{\numberline {III-A.1}Convolutional Neural Network (CNN)}{1}\protected@file@percent }
\citation{IntroCNN}
\citation{IntroCNN}
\citation{ResNet}
\citation{9431833}
\@writefile{lof}{\contentsline {figure}{\numberline {1}{\ignorespaces Eine Faltung mit einer Kernelgr\"o\IeC {\ss }e von 3, einem Stride von 1 und Zero-padding von 0}}{2}\protected@file@percent }
\newlabel{fig:Convolution}{{1}{2}}
\@writefile{toc}{\contentsline {paragraph}{\numberline {III-A.1.a}Convolutional Layers}{2}\protected@file@percent }
\@writefile{toc}{\contentsline {paragraph}{\numberline {III-A.1.b}Pooling Layers}{2}\protected@file@percent }
\@writefile{toc}{\contentsline {paragraph}{\numberline {III-A.1.c}Fully-Connected Layers}{2}\protected@file@percent }
\@writefile{toc}{\contentsline {subsection}{\numberline {III-B}Overfitting}{2}\protected@file@percent }
\@writefile{toc}{\contentsline {subsection}{\numberline {III-C}Residual Network Model}{2}\protected@file@percent }
\@writefile{toc}{\contentsline {subsection}{\numberline {III-D}AlexNet Network oder YOLO}{2}\protected@file@percent }
\citation{Kopka.1999}
\bibstyle{IEEEtran}
\bibdata{Literatur}
\bibcite{9105997}{1}
\bibcite{8052891}{2}
\bibcite{IntroCNN}{3}
\bibcite{ResNet}{4}
\bibcite{9431833}{5}
\bibcite{DFG.1998}{6}
\bibcite{Kopka.1999}{7}
\@writefile{lof}{\contentsline {figure}{\numberline {2}{\ignorespaces Residual Network Struktur}}{3}\protected@file@percent }
\newlabel{fig:ResNet}{{2}{3}}
\@writefile{toc}{\contentsline {section}{\numberline {IV}Implementation}{3}\protected@file@percent }
\newlabel{sec:Implementation}{{IV}{3}}
\@writefile{toc}{\contentsline {subsection}{\numberline {IV-A}Erkennen von Verkehrsschildern}{3}\protected@file@percent }
\newlabel{subsec:Schilder}{{IV-A}{3}}
\@writefile{toc}{\contentsline {subsection}{\numberline {IV-B}Stra\IeC {\ss }e folgen}{3}\protected@file@percent }
\newlabel{subsec:Folgen}{{IV-B}{3}}
\@writefile{toc}{\contentsline {subsection}{\numberline {IV-C}Verkehr}{3}\protected@file@percent }
\@writefile{toc}{\contentsline {subsection}{\numberline {IV-D}subsec:Verkehr}{3}\protected@file@percent }
\@writefile{toc}{\contentsline {section}{\numberline {V}Zusammenfassung}{3}\protected@file@percent }
\newlabel{sec:zus}{{V}{3}}
\@writefile{toc}{\contentsline {section}{Anhang I: Optionaler Titel}{3}\protected@file@percent }
\@writefile{toc}{\contentsline {section}{Anhang II}{3}\protected@file@percent }
\@writefile{toc}{\contentsline {section}{Literaturverzeichnis}{3}\protected@file@percent }
\@writefile{toc}{\contentsline {section}{Biographies}{3}\protected@file@percent }
\@writefile{toc}{\contentsline {subsection}{Autor A}{3}\protected@file@percent }
\@writefile{toc}{\contentsline {subsection}{Autor B}{4}\protected@file@percent }
\@writefile{toc}{\contentsline {subsection}{Autor C}{4}\protected@file@percent }
\@writefile{toc}{\contentsline {subsection}{Autor D}{4}\protected@file@percent }
\@writefile{toc}{\contentsline {subsection}{Mirko Konstantin}{4}\protected@file@percent }
