\relax 
\providecommand*\new@tpo@label[2]{}
\providecommand \oddpage@label [2]{}
\@writefile{toc}{\contentsline {chapter}{\nonumberline \hskip 1em\relax \ Preface}{3}\protected@file@percent }
\@writefile{lof}{\addvspace {10\p@ }}
\@writefile{lot}{\addvspace {10\p@ }}
\@writefile{lol}{\addvspace {10\p@ }}
\@writefile{toc}{\contentsline {chapter}{\numberline {1}System analysis}{4}\protected@file@percent }
\@writefile{lof}{\addvspace {10\p@ }}
\@writefile{lot}{\addvspace {10\p@ }}
\@writefile{lol}{\addvspace {10\p@ }}
\@writefile{toc}{\contentsline {section}{\numberline {1.1}Trimming the model}{4}\protected@file@percent }
\@writefile{toc}{\contentsline {section}{\numberline {1.2}System representation and analysis}{4}\protected@file@percent }
\@writefile{toc}{\contentsline {subsubsection}{Poles}{4}\protected@file@percent }
\@writefile{toc}{\contentsline {subsubsection}{Zeros}{4}\protected@file@percent }
\@writefile{toc}{\contentsline {subsubsection}{Pole and zero-directions}{4}\protected@file@percent }
\newlabel{task1:pol_directions}{{1.1}{4}}
\@writefile{toc}{\contentsline {subsubsection}{Minimum phase system}{5}\protected@file@percent }
\@writefile{toc}{\contentsline {subsubsection}{Non-minimum phase system}{5}\protected@file@percent }
\@writefile{toc}{\contentsline {section}{\numberline {1.3}Relative Gain Array (RGA)}{6}\protected@file@percent }
\newlabel{rga}{{1.3}{6}}
\@writefile{lof}{\contentsline {figure}{\numberline {1.1}{\ignorespaces RGA values over frequency for min and non-min phase system\relax }}{6}\protected@file@percent }
\providecommand*\caption@xref[2]{\@setref\relax\@undefined{#1}}
\newlabel{fig:rga_dynamic}{{1.1}{6}}
\@writefile{toc}{\contentsline {section}{\numberline {1.4}Parametric uncertainty for nonlinearities}{7}\protected@file@percent }
\@writefile{toc}{\contentsline {section}{\numberline {1.5}Singular values}{7}\protected@file@percent }
\@writefile{lof}{\contentsline {figure}{\numberline {1.2}{\ignorespaces \relax }}{7}\protected@file@percent }
\newlabel{fig:singular_values}{{1.2}{7}}
\citation{Sko05}
\citation{Teach_tank}
\@writefile{toc}{\contentsline {chapter}{\numberline {2}Decentralized control and uncertainty modeling}{8}\protected@file@percent }
\@writefile{lof}{\addvspace {10\p@ }}
\@writefile{lot}{\addvspace {10\p@ }}
\@writefile{lol}{\addvspace {10\p@ }}
\@writefile{lof}{\contentsline {figure}{\numberline {2.1}{\ignorespaces Decentralized controller\relax }}{8}\protected@file@percent }
\newlabel{fig:decentralized_controller}{{2.1}{8}}
\@writefile{toc}{\contentsline {section}{\numberline {2.1}Decentralized controller based on linear and nonlinear models}{8}\protected@file@percent }
\@writefile{lof}{\contentsline {figure}{\numberline {2.2}{\ignorespaces Step response of individually controlled part-systems $g_{11}$ and $g_{22}$\relax }}{9}\protected@file@percent }
\newlabel{fig:decentralized_controller_1}{{2.2}{9}}
\newlabel{eq:non-min_decentral_controller}{{2.3}{9}}
\@writefile{lof}{\contentsline {figure}{\numberline {2.3}{\ignorespaces Step response of individually controlled part-systems $g_{11_{non}}$ and $g_{22_{non}}$\relax }}{9}\protected@file@percent }
\newlabel{fig:decentralized_controller_2}{{2.3}{9}}
\@writefile{lof}{\contentsline {figure}{\numberline {2.4}{\ignorespaces Step response of minimal phase system with decentralized PI controller\relax }}{10}\protected@file@percent }
\newlabel{fig:step_response_decentral_min}{{2.4}{10}}
\@writefile{lof}{\contentsline {figure}{\numberline {2.5}{\ignorespaces Step response of non-minimal phase system with decentralized PI controller\relax }}{11}\protected@file@percent }
\newlabel{fig:step_response_decentral_non_min}{{2.5}{11}}
\@writefile{toc}{\contentsline {section}{\numberline {2.2}Model uncertainty and weighting function}{12}\protected@file@percent }
\newlabel{eq:wo}{{2.7}{12}}
\@writefile{lof}{\contentsline {figure}{\numberline {2.6}{\ignorespaces RGA values over frequency for min and non-min phase system\relax }}{12}\protected@file@percent }
\newlabel{fig:wo_uncert_min}{{2.6}{12}}
\newlabel{eq:wonon}{{2.8}{12}}
\@writefile{lof}{\contentsline {figure}{\numberline {2.7}{\ignorespaces RGA values over frequency for min and non-min phase system\relax }}{13}\protected@file@percent }
\newlabel{fig:wo_uncert_non-min}{{2.7}{13}}
\@writefile{toc}{\contentsline {section}{\numberline {2.3}Robust stability with dynamic uncertainty}{13}\protected@file@percent }
\newlabel{robust_dynamic}{{2.3}{13}}
\@writefile{toc}{\contentsline {section}{\numberline {2.4}Robust stability with parametric uncertainty}{13}\protected@file@percent }
\@writefile{toc}{\contentsline {chapter}{\numberline {3}Robust control design using mixed sensitivity approach}{14}\protected@file@percent }
\@writefile{lof}{\addvspace {10\p@ }}
\@writefile{lot}{\addvspace {10\p@ }}
\@writefile{lol}{\addvspace {10\p@ }}
\@writefile{toc}{\contentsline {section}{\numberline {3.1}$H_{\infty }$ loop-shaping}{14}\protected@file@percent }
\newlabel{eq:performance_weight_mp}{{3.1}{14}}
\newlabel{eq:performance_weight_np}{{3.2}{14}}
\@writefile{lof}{\contentsline {figure}{\numberline {3.1}{\ignorespaces Performance weights \relax }}{14}\protected@file@percent }
\newlabel{fig:performance_weights}{{3.1}{14}}
\citation{lund_insti}
\@writefile{toc}{\contentsline {section}{\numberline {3.2}$H_{\infty }$ mixed sensitivity design prerequisites }{15}\protected@file@percent }
\@writefile{lof}{\contentsline {figure}{\numberline {3.2}{\ignorespaces Generalized plant for mixed sensitivity \relax }}{15}\protected@file@percent }
\newlabel{fig:mixed_sensitivity_generalized_plant}{{3.2}{15}}
\newlabel{w1}{{3.3}{15}}
\newlabel{w2}{{3.4}{15}}
\newlabel{w11}{{3.5}{16}}
\@writefile{lof}{\contentsline {figure}{\numberline {3.3}{\ignorespaces Bode diagram of $w_1(s)$ and $w_{1_{non}}(s)$ \relax }}{16}\protected@file@percent }
\newlabel{fig:w1}{{3.3}{16}}
\newlabel{w2_non}{{3.6}{16}}
\@writefile{lof}{\contentsline {figure}{\numberline {3.4}{\ignorespaces Bode diagram of $w_2(s)$ and $w_{2_{non}}(s)$ \relax }}{16}\protected@file@percent }
\newlabel{fig:w2}{{3.4}{16}}
\@writefile{lof}{\contentsline {figure}{\numberline {3.5}{\ignorespaces Step response of the linear model in both operating points \relax }}{17}\protected@file@percent }
\newlabel{fig:mixed_sensitivity_linear}{{3.5}{17}}
\@writefile{toc}{\contentsline {section}{\numberline {3.3}Nonlinear model and a $H_{\infty }$ controller}{18}\protected@file@percent }
\@writefile{lof}{\contentsline {figure}{\numberline {3.6}{\ignorespaces Step response with sensor noise\relax }}{18}\protected@file@percent }
\newlabel{fig:sensor_noise_bad}{{3.6}{18}}
\@writefile{lof}{\contentsline {figure}{\numberline {3.7}{\ignorespaces Step response with sensor noise\relax }}{18}\protected@file@percent }
\newlabel{fig:sensor_noise_good}{{3.7}{18}}
\@writefile{toc}{\contentsline {section}{\numberline {3.4}Robust performance}{19}\protected@file@percent }
\@writefile{lof}{\contentsline {figure}{\numberline {3.8}{\ignorespaces Generalized plant\relax }}{19}\protected@file@percent }
\newlabel{fig:generalized_plant}{{3.8}{19}}
\@writefile{toc}{\contentsline {subsubsection}{Nominal Stability}{19}\protected@file@percent }
\@writefile{toc}{\contentsline {subsubsection}{Robust Stability}{20}\protected@file@percent }
\@writefile{lof}{\contentsline {figure}{\numberline {3.9}{\ignorespaces $\mu _{\Delta }(\mathbf  {N_{11}})$\relax }}{20}\protected@file@percent }
\newlabel{fig:ussv_rs}{{3.9}{20}}
\@writefile{toc}{\contentsline {subsubsection}{Nominal Performance}{20}\protected@file@percent }
\@writefile{lof}{\contentsline {figure}{\numberline {3.10}{\ignorespaces $\mu _{\Delta _P}(\mathbf  {N_{22}})$\relax }}{20}\protected@file@percent }
\newlabel{fig:ussv_np}{{3.10}{20}}
\@writefile{toc}{\contentsline {subsubsection}{Robust Performance}{21}\protected@file@percent }
\newlabel{tab:robust_perfo}{{3.4}{21}}
\@writefile{lof}{\contentsline {figure}{\numberline {3.11}{\ignorespaces $\mu _\Delta (\mathbf  {N})$\relax }}{21}\protected@file@percent }
\newlabel{fig:ussv_rp}{{3.11}{21}}
\@writefile{lot}{\contentsline {table}{\numberline {3.1}{\ignorespaces Performance table\relax }}{21}\protected@file@percent }
\newlabel{tab:robust_perf}{{3.1}{21}}
\@writefile{toc}{\contentsline {chapter}{\numberline {4}Loop/Plant modification}{22}\protected@file@percent }
\@writefile{lof}{\addvspace {10\p@ }}
\@writefile{lot}{\addvspace {10\p@ }}
\@writefile{lol}{\addvspace {10\p@ }}
\@writefile{toc}{\contentsline {section}{\numberline {4.1}Nonlinear model for leakage}{22}\protected@file@percent }
\@writefile{toc}{\contentsline {section}{\numberline {4.2}Linearization for leakage}{22}\protected@file@percent }
\@writefile{toc}{\contentsline {section}{\numberline {4.3}Controller design for leakage}{23}\protected@file@percent }
\@writefile{lof}{\contentsline {figure}{\numberline {4.1}{\ignorespaces Step response of the linear and nonlinear system with $H_\infty $ loop shaping controller\relax }}{23}\protected@file@percent }
\newlabel{fig:step_h_inf_loop_shaping}{{4.1}{23}}
\@writefile{toc}{\contentsline {section}{\numberline {4.4}Evaluation of disturbance rejection for leakage}{24}\protected@file@percent }
\@writefile{lof}{\contentsline {figure}{\numberline {4.2}{\ignorespaces $\mu _{\Delta _P}(\mathbf  {N_{22}})$\relax }}{24}\protected@file@percent }
\newlabel{fig:ussv_NP_lek}{{4.2}{24}}
\@writefile{lof}{\contentsline {figure}{\numberline {4.3}{\ignorespaces $\mu _{\Delta }(\mathbf  {N_{11}})$\relax }}{24}\protected@file@percent }
\newlabel{fig:ussv_RS_lek}{{4.3}{24}}
\@writefile{lof}{\contentsline {figure}{\numberline {4.4}{\ignorespaces $\mu _{\Delta ^*}(\mathbf  {N})$\relax }}{24}\protected@file@percent }
\newlabel{fig:ussv_RP_lek}{{4.4}{24}}
\bibstyle{abbrv}
\bibdata{literature}
\@writefile{toc}{\contentsline {section}{\numberline {4.5}Evaluation of controller based on leakage}{25}\protected@file@percent }
\@writefile{lof}{\contentsline {figure}{\numberline {4.5}{\ignorespaces Influence of sinus-disturbance over different frequencies\relax }}{25}\protected@file@percent }
\newlabel{fig:evaluation_disturb}{{4.5}{25}}
\bibcite{lund_insti}{1}
\bibcite{Teach_tank}{2}
\bibcite{Sko05}{3}
\global\@namedef{scr@dte@chapter@lastmaxnumwidth}{10.84047pt}
\global\@namedef{scr@dte@section@lastmaxnumwidth}{18.37163pt}
