This is BibTeX, Version 0.99dThe top-level auxiliary file: coursework.aux
The style file: abbrv.bst
Database file #1: literature.bib
Warning--entry type for "Teach_tank" isn't style-file defined
--line 4 of file literature.bib
Warning--entry type for "lund_insti" isn't style-file defined
--line 21 of file literature.bib
(There were 2 warnings)
