EESchema Schematic File Version 4
LIBS:RadIIS_Mainboard-cache
EELAYER 30 0
EELAYER END
$Descr A4 11693 8268
encoding utf-8
Sheet 1 11
Title "RadIIS Mainboard"
Date "2017-01-05"
Rev "1.0a"
Comp ""
Comment1 ""
Comment2 ""
Comment3 ""
Comment4 ""
$EndDescr
$Sheet
S 3250 1200 1850 1000
U 5728B046
F0 "Analog pulsehold" 60
F1 "Analog_pulsehold.sch" 60
F2 "Pulse_In1" I L 3250 1300 60 
F3 "AGND" I L 3250 2000 60 
F4 "A3V3" I L 3250 1900 60 
F5 "A-2V0" I L 3250 2100 60 
F6 "PH_Out1" I R 5100 1600 60 
F7 "GND" I R 5100 2050 60 
F8 "Pulse_In2" I L 3250 1500 60 
F9 "PH_Out2" I R 5100 1700 60 
F10 "Reset_In1" I R 5100 1900 60 
F11 "Reset_In2" I R 5100 1800 60 
F12 "3V3D" I L 3250 1800 60 
$EndSheet
$Sheet
S 9250 5400 1500 800 
U 5728B04B
F0 "Battery charger" 60
F1 "Battery_charger.sch" 60
F2 "Bat_Out" I L 9250 5500 60 
F3 "GND" I L 9250 6150 60 
F4 "USB_VCC_IN" I R 10750 5650 60 
F5 "Charger_STAT" I L 9250 5800 60 
F6 "REG_VCC_IN" I R 10750 5800 60 
F7 "Bat_SensOut" I L 9250 5700 60 
$EndSheet
$Sheet
S 3500 4500 1650 500 
U 5728B04E
F0 "Analog power" 60
F1 "Analog_power.sch" 60
F2 "SHDN" I R 5150 4600 60 
F3 "VBAT_In" I R 5150 4800 60 
F4 "GNDA_Out" I L 3500 4750 60 
F5 "A3V3_Out" I L 3500 4600 60 
F6 "A-2V0_Out" I L 3500 4900 60 
F7 "GND_In" I R 5150 4900 60 
$EndSheet
$Sheet
S 8600 1150 1050 1550
U 572C63BB
F0 "WiFi_LoRa" 60
F1 "WiFi_LoRa.sch" 60
F2 "ESP_RX" I L 8600 1450 60 
F3 "ESP_TX" I L 8600 1550 60 
F4 "ESP_PD" I L 8600 1650 60 
F5 "ESP_BOOT" I L 8600 1850 60 
F6 "ESP_RD" I L 8600 1950 60 
F7 "3.3VIn" I R 9650 1450 60 
F8 "GND" I R 9650 1600 60 
F9 "LR_Reset" I L 8600 2050 60 
F10 "LR_NSS" I L 8600 2150 60 
F11 "LR_MOSI" I L 8600 2250 60 
F12 "LR_MISO" I L 8600 2350 60 
F13 "LR_SCK" I L 8600 2450 60 
F14 "LR_PG0" I L 8600 2550 60 
F15 "Bat_In+" I R 9650 2150 60 
F16 "STM_BOOT" I L 8600 1350 60 
$EndSheet
$Comp
L RadIIS_Mainboard-rescue:GND #PWR01
U 1 1 572C8583
P 6150 5050
F 0 "#PWR01" H 6150 4800 50  0001 C CNN
F 1 "GND" H 6000 5000 50  0000 C CNN
F 2 "" H 6150 5050 50  0000 C CNN
F 3 "" H 6150 5050 50  0000 C CNN
	1    6150 5050
	1    0    0    -1  
$EndComp
$Comp
L RadIIS_Mainboard-rescue:+3.3V #PWR02
U 1 1 572C864B
P 6150 4950
F 0 "#PWR02" H 6150 4800 50  0001 C CNN
F 1 "+3.3V" H 6000 5000 50  0000 C CNN
F 2 "" H 6150 4950 50  0000 C CNN
F 3 "" H 6150 4950 50  0000 C CNN
	1    6150 4950
	1    0    0    -1  
$EndComp
$Comp
L RadIIS_Mainboard-rescue:+BATT #PWR03
U 1 1 572C8713
P 6150 5700
F 0 "#PWR03" H 6150 5550 50  0001 C CNN
F 1 "+BATT" H 6000 5750 50  0000 C CNN
F 2 "" H 6150 5700 50  0000 C CNN
F 3 "" H 6150 5700 50  0000 C CNN
	1    6150 5700
	1    0    0    -1  
$EndComp
$Comp
L RadIIS_Mainboard-rescue:GND #PWR04
U 1 1 572C9290
P 6150 5800
F 0 "#PWR04" H 6150 5550 50  0001 C CNN
F 1 "GND" H 6000 5750 50  0000 C CNN
F 2 "" H 6150 5800 50  0000 C CNN
F 3 "" H 6150 5800 50  0000 C CNN
	1    6150 5800
	1    0    0    -1  
$EndComp
$Comp
L RadIIS_Mainboard-rescue:+3.3V #PWR05
U 1 1 572C9530
P 9750 1400
F 0 "#PWR05" H 9750 1250 50  0001 C CNN
F 1 "+3.3V" H 9765 1573 50  0000 C CNN
F 2 "" H 9750 1400 50  0000 C CNN
F 3 "" H 9750 1400 50  0000 C CNN
	1    9750 1400
	-1   0    0    -1  
$EndComp
$Comp
L RadIIS_Mainboard-rescue:GND #PWR06
U 1 1 572C95EF
P 9750 1650
F 0 "#PWR06" H 9750 1400 50  0001 C CNN
F 1 "GND" H 9755 1477 50  0000 C CNN
F 2 "" H 9750 1650 50  0000 C CNN
F 3 "" H 9750 1650 50  0000 C CNN
	1    9750 1650
	-1   0    0    -1  
$EndComp
$Comp
L RadIIS_Mainboard-rescue:GND #PWR07
U 1 1 572CE336
P 9150 6200
F 0 "#PWR07" H 9150 5950 50  0001 C CNN
F 1 "GND" H 9155 6027 50  0000 C CNN
F 2 "" H 9150 6200 50  0000 C CNN
F 3 "" H 9150 6200 50  0000 C CNN
	1    9150 6200
	1    0    0    -1  
$EndComp
$Comp
L RadIIS_Mainboard-rescue:GND #PWR08
U 1 1 572D593F
P 5200 2150
F 0 "#PWR08" H 5200 1900 50  0001 C CNN
F 1 "GND" H 5205 1977 50  0000 C CNN
F 2 "" H 5200 2150 50  0000 C CNN
F 3 "" H 5200 2150 50  0000 C CNN
	1    5200 2150
	1    0    0    -1  
$EndComp
$Comp
L RadIIS_Mainboard-rescue:GNDA #PWR09
U 1 1 572D5E0E
P 3150 2000
F 0 "#PWR09" H 3150 1750 50  0001 C CNN
F 1 "GNDA" V 3155 1873 50  0000 R CNN
F 2 "" H 3150 2000 50  0000 C CNN
F 3 "" H 3150 2000 50  0000 C CNN
	1    3150 2000
	0    1    1    0   
$EndComp
$Comp
L RadIIS_Mainboard-rescue:A3V3 #PWR010
U 1 1 572D8E1E
P 3100 1750
F 0 "#PWR010" H 3100 1600 50  0001 C CNN
F 1 "A3V3" V 3100 1950 50  0000 C CNN
F 2 "" H 3100 1750 50  0000 C CNN
F 3 "" H 3100 1750 50  0000 C CNN
	1    3100 1750
	1    0    0    -1  
$EndComp
$Comp
L RadIIS_Mainboard-rescue:A-2V0 #PWR8
U 1 1 572D9D6F
P 3150 2100
F 0 "#PWR8" H 3150 2200 50  0001 C CNN
F 1 "A-2V0" H 3165 2273 50  0000 C CNN
F 2 "" H 3150 2100 50  0000 C CNN
F 3 "" H 3150 2100 50  0000 C CNN
	1    3150 2100
	-1   0    0    1   
$EndComp
$Comp
L RadIIS_Mainboard-rescue:A3V3 #PWR011
U 1 1 572DE258
P 2300 1100
F 0 "#PWR011" H 2300 950 50  0001 C CNN
F 1 "A3V3" H 2450 1100 50  0000 C CNN
F 2 "" H 2300 1100 50  0000 C CNN
F 3 "" H 2300 1100 50  0000 C CNN
	1    2300 1100
	1    0    0    -1  
$EndComp
$Comp
L RadIIS_Mainboard-rescue:GNDA #PWR012
U 1 1 572DE3B0
P 2300 1250
F 0 "#PWR012" H 2300 1000 50  0001 C CNN
F 1 "GNDA" V 2305 1122 50  0000 R CNN
F 2 "" H 2300 1250 50  0000 C CNN
F 3 "" H 2300 1250 50  0000 C CNN
	1    2300 1250
	0    -1   -1   0   
$EndComp
$Comp
L RadIIS_Mainboard-rescue:A-2V0 #PWR5
U 1 1 572DE654
P 2300 1400
F 0 "#PWR5" H 2300 1500 50  0001 C CNN
F 1 "A-2V0" H 2315 1573 50  0000 C CNN
F 2 "" H 2300 1400 50  0000 C CNN
F 3 "" H 2300 1400 50  0000 C CNN
	1    2300 1400
	-1   0    0    1   
$EndComp
$Comp
L RadIIS_Mainboard-rescue:+BATT #PWR013
U 1 1 572CCD3D
P 5250 4800
F 0 "#PWR013" H 5250 4650 50  0001 C CNN
F 1 "+BATT" H 5265 4973 50  0000 C CNN
F 2 "" H 5250 4800 50  0000 C CNN
F 3 "" H 5250 4800 50  0000 C CNN
	1    5250 4800
	1    0    0    -1  
$EndComp
$Comp
L RadIIS_Mainboard-rescue:GND #PWR014
U 1 1 572CCEB9
P 5250 4950
F 0 "#PWR014" H 5250 4700 50  0001 C CNN
F 1 "GND" H 5255 4777 50  0000 C CNN
F 2 "" H 5250 4950 50  0000 C CNN
F 3 "" H 5250 4950 50  0000 C CNN
	1    5250 4950
	1    0    0    -1  
$EndComp
$Comp
L RadIIS_Mainboard-rescue:A3V3 #PWR015
U 1 1 572CE440
P 3300 4500
F 0 "#PWR015" H 3300 4350 50  0001 C CNN
F 1 "A3V3" H 3315 4673 50  0000 C CNN
F 2 "" H 3300 4500 50  0000 C CNN
F 3 "" H 3300 4500 50  0000 C CNN
	1    3300 4500
	1    0    0    -1  
$EndComp
$Comp
L RadIIS_Mainboard-rescue:GNDA #PWR016
U 1 1 572CE5BC
P 3300 4750
F 0 "#PWR016" H 3300 4500 50  0001 C CNN
F 1 "GNDA" H 3305 4577 50  0000 C CNN
F 2 "" H 3300 4750 50  0000 C CNN
F 3 "" H 3300 4750 50  0000 C CNN
	1    3300 4750
	0    1    1    0   
$EndComp
$Comp
L RadIIS_Mainboard-rescue:A-2V0 #PWR11
U 1 1 572CE7F0
P 3300 5000
F 0 "#PWR11" H 3300 5100 50  0001 C CNN
F 1 "A-2V0" H 3315 5173 50  0000 C CNN
F 2 "" H 3300 5000 50  0000 C CNN
F 3 "" H 3300 5000 50  0000 C CNN
	1    3300 5000
	-1   0    0    1   
$EndComp
$Comp
L RadIIS_Mainboard-rescue:+BATT #PWR017
U 1 1 572D1DFF
P 5200 3700
F 0 "#PWR017" H 5200 3550 50  0001 C CNN
F 1 "+BATT" H 5215 3873 50  0000 C CNN
F 2 "" H 5200 3700 50  0000 C CNN
F 3 "" H 5200 3700 50  0000 C CNN
	1    5200 3700
	1    0    0    -1  
$EndComp
$Sheet
S 1050 750  1100 750 
U 5728B043
F0 "RadIIS Sensor Modul" 60
F1 "Sensor_Modul.sch" 60
F2 "Bias_In+" I L 1050 1150 60 
F3 "Bias_In-" I L 1050 1250 60 
F4 "Pulse_Out" I R 2150 900 60 
F5 "A-2V0" I R 2150 1350 60 
F6 "AGND" I R 2150 1250 60 
F7 "A3V3" I R 2150 1150 60 
F8 "Temp_Out" I R 2150 800 60 
$EndSheet
$Comp
L RadIIS_Mainboard-rescue:GNDA #PWR018
U 1 1 57ACEE49
P 6150 5400
F 0 "#PWR018" H 6150 5150 50  0001 C CNN
F 1 "GNDA" H 6100 5400 50  0000 R CNN
F 2 "" H 6150 5400 50  0000 C CNN
F 3 "" H 6150 5400 50  0000 C CNN
	1    6150 5400
	1    0    0    -1  
$EndComp
$Comp
L RadIIS_Mainboard-rescue:A3V3 #PWR019
U 1 1 57C7556D
P 6150 5300
F 0 "#PWR019" H 6150 5150 50  0001 C CNN
F 1 "A3V3" H 6000 5350 50  0000 C CNN
F 2 "" H 6150 5300 50  0000 C CNN
F 3 "" H 6150 5300 50  0000 C CNN
	1    6150 5300
	1    0    0    -1  
$EndComp
$Comp
L RadIIS_Mainboard-rescue:+BATT #PWR020
U 1 1 5896B272
P 9150 5450
F 0 "#PWR020" H 9150 5300 50  0001 C CNN
F 1 "+BATT" H 9165 5623 50  0000 C CNN
F 2 "" H 9150 5450 50  0000 C CNN
F 3 "" H 9150 5450 50  0000 C CNN
	1    9150 5450
	1    0    0    -1  
$EndComp
$Comp
L RadIIS_Mainboard-rescue:USB_OTG-RESCUE-RadIIS_Mainboard P5
U 1 1 58A0C5A9
P 10900 4650
F 0 "P5" H 11225 4525 50  0000 C CNN
F 1 "USB_OTG" H 10900 4850 50  0000 C CNN
F 2 "RadIIS_Mainboard:MUSBK152XX" V 10850 4550 50  0001 C CNN
F 3 "https://eu.mouser.com/datasheet/2/18/MUSBK152XX-585823.pdf" V 10850 4550 50  0001 C CNN
F 4 "MUSBK15230-ND" H 10900 4650 50  0001 C CNN "Digikey Nr"
F 5 "8.75" H 10900 4650 50  0001 C CNN "Digikey Price"
	1    10900 4650
	0    1    1    0   
$EndComp
$Comp
L RadIIS_Mainboard-rescue:CONN_01X12 P3
U 1 1 58A8D9BF
P 10950 1350
F 0 "P3" H 10950 2000 50  0000 C CNN
F 1 "CONN_01X12" V 11050 1350 50  0000 C CNN
F 2 "RadIIS_Mainboard:Hirose_FH12-12S-0.5SH_1x12-1MP_P0.50mm_Horizontal" H 10950 1350 50  0001 C CNN
F 3 "https://www.hirose.com/product/document?clcode=&productname=&series=FH12&documenttype=Catalog&lang=en&documentid=D31648_en" H 10950 1350 50  0001 C CNN
F 4 "HFJ112CT-ND " H 10950 1350 50  0001 C CNN "Digikey Nr"
F 5 "1.46" H 10950 1350 50  0001 C CNN "Digikey Price"
	1    10950 1350
	1    0    0    -1  
$EndComp
Text Label 10650 1000 2    60   ~ 0
Ext_RX
Text Label 10650 900  2    60   ~ 0
Ext_TX
Text Label 10650 800  2    60   ~ 0
Ext_Vin
Text Label 10650 1100 2    60   ~ 0
Ext_Ain
Text Label 10650 1900 2    60   ~ 0
Ext_Bout
Text Label 10650 1200 2    60   ~ 0
Ext_DGND
Text Label 10650 1700 2    60   ~ 0
Ext_AGND
Text Label 10650 1300 2    60   ~ 0
Ext_Bat
Text Label 10650 1600 2    60   ~ 0
Ext_GPIO0
Text Label 10650 1500 2    60   ~ 0
Ext_3.3Va
Text Label 10650 1800 2    60   ~ 0
Ext_-2Va
Text Label 10650 1400 2    60   ~ 0
Ext_AGND
$Comp
L RadIIS_Mainboard-rescue:A3V3 #PWR021
U 1 1 58AB4E28
P 10500 2200
F 0 "#PWR021" H 10500 2050 50  0001 C CNN
F 1 "A3V3" V 10500 2400 50  0000 C CNN
F 2 "" H 10500 2200 50  0000 C CNN
F 3 "" H 10500 2200 50  0000 C CNN
	1    10500 2200
	0    -1   -1   0   
$EndComp
$Comp
L RadIIS_Mainboard-rescue:GNDA #PWR022
U 1 1 58AB53BD
P 10500 2100
F 0 "#PWR022" H 10500 1850 50  0001 C CNN
F 1 "GNDA" V 10500 1900 50  0000 C CNN
F 2 "" H 10500 2100 50  0000 C CNN
F 3 "" H 10500 2100 50  0000 C CNN
	1    10500 2100
	0    1    1    0   
$EndComp
$Comp
L RadIIS_Mainboard-rescue:A-2V0 #PWR32
U 1 1 58AB5560
P 10500 2300
F 0 "#PWR32" H 10500 2400 50  0001 C CNN
F 1 "A-2V0" V 10500 2500 50  0000 C CNN
F 2 "" H 10500 2300 50  0000 C CNN
F 3 "" H 10500 2300 50  0000 C CNN
	1    10500 2300
	0    -1   -1   0   
$EndComp
Text Label 8400 3050 0    60   ~ 0
Ext_RX
Text Label 8400 3150 0    60   ~ 0
Ext_TX
Text Label 8400 3250 0    60   ~ 0
Ext_GPIO0
Text Label 3050 3450 2    60   ~ 0
Ext_Bout
Text Label 10600 2100 0    60   ~ 0
Ext_AGND
Text Label 3150 1500 2    60   ~ 0
Ext_Ain
Text Label 10600 2200 0    60   ~ 0
Ext_3.3Va
Text Label 10600 2300 0    60   ~ 0
Ext_-2Va
$Sheet
S 9000 3400 1000 450 
U 58B072DB
F0 "Ext_Power_protect" 60
F1 "Ext_Power_protect.sch" 60
F2 "Ext_Vin" I R 10000 3500 60 
F3 "GND" I R 10000 3650 60 
F4 "EN_DCDCin" I L 9000 3650 60 
F5 "Reg_Vout" I L 9000 3500 60 
F6 "PG_DCDCin" I L 9000 3800 60 
$EndSheet
Text Label 10100 3500 0    60   ~ 0
Ext_Vin
$Comp
L RadIIS_Mainboard-rescue:GND #PWR023
U 1 1 58B0C4E3
P 10100 3700
F 0 "#PWR023" H 10100 3450 50  0001 C CNN
F 1 "GND" H 10250 3650 50  0000 C CNN
F 2 "" H 10100 3700 50  0000 C CNN
F 3 "" H 10100 3700 50  0000 C CNN
	1    10100 3700
	1    0    0    -1  
$EndComp
Text Label 8950 3500 2    60   ~ 0
Reg_5V
Text Label 10850 5800 0    60   ~ 0
Reg_5V
$Comp
L RadIIS_Mainboard-rescue:+5VP #PWR024
U 1 1 58B0EC4E
P 8500 4350
F 0 "#PWR024" H 8500 4200 50  0001 C CNN
F 1 "+5VP" H 8500 4490 50  0000 C CNN
F 2 "" H 8500 4350 50  0000 C CNN
F 3 "" H 8500 4350 50  0000 C CNN
	1    8500 4350
	1    0    0    -1  
$EndComp
$Comp
L RadIIS_Mainboard-rescue:+5VP #PWR025
U 1 1 58B0F6CE
P 10850 5600
F 0 "#PWR025" H 10850 5450 50  0001 C CNN
F 1 "+5VP" H 10850 5740 50  0000 C CNN
F 2 "" H 10850 5600 50  0000 C CNN
F 3 "" H 10850 5600 50  0000 C CNN
	1    10850 5600
	1    0    0    -1  
$EndComp
$Comp
L RadIIS_Mainboard-rescue:GND #PWR026
U 1 1 58B08BAA
P 5200 3900
F 0 "#PWR026" H 5200 3650 50  0001 C CNN
F 1 "GND" H 5205 3727 50  0000 C CNN
F 2 "" H 5200 3900 50  0000 C CNN
F 3 "" H 5200 3900 50  0000 C CNN
	1    5200 3900
	1    0    0    -1  
$EndComp
Text Notes 10000 650  0    60   ~ 0
IO Extension Connector
$Sheet
S 8700 4350 1300 550 
U 58B1A94A
F0 "USB_Protection" 60
F1 "USB_protection.sch" 60
F2 "VBus_Out" I L 8700 4450 60 
F3 "Dout-" I L 8700 4550 60 
F4 "Dout+" I L 8700 4650 60 
F5 "ID_Out" I L 8700 4750 60 
F6 "GND" I R 10000 4850 60 
F7 "VBus_In" I R 10000 4450 60 
F8 "Din-" I R 10000 4550 60 
F9 "Din+" I R 10000 4650 60 
F10 "ID_In" I R 10000 4750 60 
$EndSheet
$Comp
L RadIIS_Mainboard-rescue:GND #PWR027
U 1 1 58B1FDA5
P 10400 5050
F 0 "#PWR027" H 10400 4800 50  0001 C CNN
F 1 "GND" H 10550 5000 50  0000 C CNN
F 2 "" H 10400 5050 50  0000 C CNN
F 3 "" H 10400 5050 50  0000 C CNN
	1    10400 5050
	1    0    0    -1  
$EndComp
Text Notes 1700 1900 1    60   ~ 0
->\n-->\n--->
$Comp
L RadIIS_Mainboard-rescue:GND #PWR029
U 1 1 58B3727E
P 2200 2300
F 0 "#PWR029" H 2200 2050 50  0001 C CNN
F 1 "GND" H 2350 2250 50  0000 C CNN
F 2 "" H 2200 2300 50  0000 C CNN
F 3 "" H 2200 2300 50  0000 C CNN
	1    2200 2300
	1    0    0    -1  
$EndComp
$Sheet
S 3250 2950 1850 1050
U 5728A85A
F0 "Biasregulation" 60
F1 "Bias_regulation.sch" 60
F2 "VBat_In" I R 5100 3750 60 
F3 "GND_In" I R 5100 3850 60 
F4 "2.048_Out" I R 5100 3300 60 
F5 "Bias_Out" I L 3250 3300 60 
F6 "AGND_Out" I L 3250 3800 60 
F7 "~SHDN" I R 5100 3200 60 
F8 "Ext_Bias" I L 3250 3450 60 
F9 "Biasreg_In_a" I R 5100 3000 60 
F10 "Biassense_Out_a" I R 5100 3100 60 
$EndSheet
Text Label 5950 2250 2    60   ~ 0
Ext_Ain
Text Label 10600 2400 0    60   ~ 0
Ext_DGND
$Comp
L RadIIS_Mainboard-rescue:GND #PWR030
U 1 1 58B9F0E6
P 10500 2400
F 0 "#PWR030" H 10500 2150 50  0001 C CNN
F 1 "GND" V 10500 2200 50  0000 C CNN
F 2 "" H 10500 2400 50  0000 C CNN
F 3 "" H 10500 2400 50  0000 C CNN
	1    10500 2400
	0    1    1    0   
$EndComp
Text Label 10650 2500 0    60   ~ 0
Ext_Bat
$Comp
L RadIIS_Mainboard-rescue:+BATT #PWR031
U 1 1 58BA169A
P 10500 2500
F 0 "#PWR031" H 10500 2350 50  0001 C CNN
F 1 "+BATT" V 10500 2750 50  0000 C CNN
F 2 "" H 10500 2500 50  0000 C CNN
F 3 "" H 10500 2500 50  0000 C CNN
	1    10500 2500
	0    -1   -1   0   
$EndComp
$Sheet
S 6250 1150 2000 4750
U 5728B03A
F0 "Nucleo" 60
F1 "Nucleo.sch" 60
F2 "3.3VOut" I L 6250 4950 60 
F3 "GND" I L 6250 5050 60 
F4 "Bat_In+" I L 6250 5700 60 
F5 "Bat_In-" I L 6250 5800 60 
F6 "AGND" I L 6250 5400 60 
F7 "A3V3_IN" I L 6250 5300 60 
F8 "PH1_In(PA0)*a" I L 6250 1600 60 
F9 "Temp_In(PA2)_a" I L 6250 1250 60 
F10 "BatSense_In(PA5)_a" I R 8250 5700 60 
F11 "Reset_PH1(PC1)*" I L 6250 1900 60 
F12 "ESP_RX(PB11)*" I R 8250 1450 60 
F13 "ESP_TX(PB10)*" I R 8250 1550 60 
F14 "ESP_PD(PD4)" I R 8250 1650 60 
F15 "ESP_BOOT(PD1)" I R 8250 1850 60 
F16 "ESP_RD(PD3)" I R 8250 1950 60 
F17 "Bias_Out(PA4)_a" I L 6250 3000 60 
F18 "SHDN_Out(PB9)" I L 6250 3200 60 
F19 "Bias_In(PA3)_a" I L 6250 3100 60 
F20 "USB_DM(PA11)=" I R 8250 4550 60 
F21 "USB_DP(PA12)=" I R 8250 4650 60 
F22 "USB_ID(PA10)" I R 8250 4750 60 
F23 "USB_VBUS(PA9)" I R 8250 4450 60 
F24 "Trigger1_In(PB2)*a" I L 6250 1450 60 
F25 "PH2_In(PA1)*a" I L 6250 1700 60 
F26 "Trigger2_In(PB4)*a" I L 6250 2250 60 
F27 "Reset_PH2(PC2)*" I L 6250 1800 60 
F28 "Ex_TX(PC12)*" I R 8250 3150 60 
F29 "Ex_RX(PD2)*" I R 8250 3050 60 
F30 "Ex_IO(PA7)?" I R 8250 3250 60 
F31 "Charger_STAT(PB15)" I R 8250 5800 60 
F32 "EN_ExDCDC(PB13)" I R 8250 3650 60 
F33 "LR_Reset(PD5)" I R 8250 2050 60 
F34 "RN_TX(PC10)*" I R 8250 4950 60 
F35 "RN_RX(PC11)*" I R 8250 5050 60 
F36 "LED_Trigger(PA8)*" I L 6250 2450 60 
F37 "VREF_Out" I L 6250 3300 60 
F38 "LR_SCK(PD1)*" I R 8250 2450 60 
F39 "LR_NSS(PD0)" I R 8250 2150 60 
F40 "LR_MISO(PD3)*" I R 8250 2350 60 
F41 "LR_MOSI(PD4)*" I R 8250 2250 60 
F42 "LR_PG0(PD6)" I R 8250 2550 60 
F43 "BLR_DS1_In(PB1)*a" I L 6250 1350 60 
F44 "BLR_DS2_In(PA6)*a" I L 6250 2150 60 
F45 "STM_BOOT" I R 8250 1350 60 
F46 "PG_ExDCDC(PB14)" I R 8250 3800 60 
$EndSheet
Wire Wire Line
	9650 1450 9750 1450
Wire Wire Line
	9750 1450 9750 1400
Wire Wire Line
	9650 1600 9750 1600
Wire Wire Line
	9750 1600 9750 1650
Wire Wire Line
	8250 1450 8600 1450
Wire Wire Line
	8600 1550 8250 1550
Wire Wire Line
	8250 1650 8600 1650
Wire Wire Line
	8250 1850 8600 1850
Wire Wire Line
	8600 1950 8250 1950
Wire Wire Line
	9250 6150 9150 6150
Wire Wire Line
	9150 6150 9150 6200
Wire Wire Line
	5100 1800 6250 1800
Wire Wire Line
	3150 2000 3250 2000
Wire Wire Line
	3250 2100 3150 2100
Wire Wire Line
	2300 1100 2300 1150
Wire Wire Line
	2300 1150 2150 1150
Wire Wire Line
	2300 1250 2150 1250
Wire Wire Line
	2150 1350 2300 1350
Wire Wire Line
	2300 1350 2300 1400
Wire Wire Line
	2150 900  2750 900 
Wire Wire Line
	5250 4950 5250 4900
Wire Wire Line
	5250 4900 5150 4900
Wire Wire Line
	5150 4800 5250 4800
Wire Wire Line
	3500 4750 3300 4750
Wire Wire Line
	3300 4500 3300 4600
Wire Wire Line
	3300 4600 3500 4600
Wire Wire Line
	3500 4900 3300 4900
Wire Wire Line
	3300 4900 3300 5000
Wire Wire Line
	800  1250 800  3800
Wire Wire Line
	5550 800  5550 1250
Wire Wire Line
	5550 1250 6250 1250
Wire Wire Line
	800  1250 1050 1250
Wire Wire Line
	650  1150 1050 1150
Wire Wire Line
	5550 800  2150 800 
Wire Wire Line
	3250 1300 2750 1300
Wire Wire Line
	2750 900  2750 1300
Wire Wire Line
	2750 2350 6250 2350
Connection ~ 2750 1300
Wire Wire Line
	9150 5450 9150 5500
Wire Wire Line
	3100 1900 3250 1900
Wire Wire Line
	6250 1600 5100 1600
Wire Wire Line
	5200 2150 5200 2050
Wire Wire Line
	5200 2050 5100 2050
Wire Wire Line
	10750 800  10650 800 
Wire Wire Line
	10650 900  10750 900 
Wire Wire Line
	10750 1000 10650 1000
Wire Wire Line
	10650 1100 10750 1100
Wire Wire Line
	10750 1200 10650 1200
Wire Wire Line
	10650 1300 10750 1300
Wire Wire Line
	10750 1400 10650 1400
Wire Wire Line
	10750 1500 10650 1500
Wire Wire Line
	10650 1600 10750 1600
Wire Wire Line
	10750 1700 10650 1700
Wire Wire Line
	10650 1800 10750 1800
Wire Wire Line
	10750 1900 10650 1900
Wire Wire Line
	3250 1500 3150 1500
Wire Wire Line
	10500 2100 10600 2100
Wire Wire Line
	10600 2200 10500 2200
Wire Wire Line
	10500 2300 10600 2300
Wire Wire Line
	10100 3500 10000 3500
Wire Wire Line
	10100 3700 10100 3650
Wire Wire Line
	10100 3650 10000 3650
Wire Wire Line
	9000 3500 8950 3500
Wire Wire Line
	9000 3650 8250 3650
Wire Wire Line
	8400 3250 8250 3250
Wire Wire Line
	8400 3150 8250 3150
Wire Wire Line
	8400 3050 8250 3050
Wire Wire Line
	5100 1700 6250 1700
Wire Wire Line
	5100 1900 6250 1900
Wire Wire Line
	8600 2150 8250 2150
Wire Wire Line
	8600 2250 8250 2250
Wire Wire Line
	8600 2350 8250 2350
Wire Wire Line
	5200 3700 5200 3750
Wire Wire Line
	5200 3750 5100 3750
Wire Wire Line
	5200 3900 5200 3850
Wire Wire Line
	5200 3850 5100 3850
Wire Wire Line
	6150 4950 6250 4950
Wire Wire Line
	6250 5050 6150 5050
Wire Wire Line
	6250 5300 6150 5300
Wire Wire Line
	6150 5400 6250 5400
Wire Wire Line
	6250 5700 6150 5700
Wire Wire Line
	6150 5800 6250 5800
Wire Wire Line
	10850 5650 10750 5650
Wire Wire Line
	10850 5650 10850 5600
Wire Wire Line
	10850 5800 10750 5800
Wire Wire Line
	650  1150 650  3300
Wire Notes Line
	9950 550  11150 550 
Wire Wire Line
	10600 4550 10000 4550
Wire Wire Line
	10600 4650 10000 4650
Wire Wire Line
	10600 4750 10000 4750
Wire Wire Line
	10000 4850 10400 4850
Wire Wire Line
	10400 4850 10400 5050
Wire Wire Line
	10400 5050 11000 5050
Connection ~ 10400 4850
Connection ~ 8500 4450
Wire Wire Line
	8700 4450 8500 4450
Wire Wire Line
	8700 4550 8250 4550
Wire Wire Line
	8700 4650 8250 4650
Wire Wire Line
	8700 4750 8250 4750
Wire Wire Line
	9250 5800 8250 5800
Wire Wire Line
	2200 2300 2200 2250
Wire Wire Line
	2200 2250 2100 2250
Wire Wire Line
	650  3300 3250 3300
Wire Wire Line
	800  3800 3250 3800
Wire Wire Line
	3250 3450 3050 3450
Wire Wire Line
	5100 3000 6250 3000
Wire Wire Line
	5100 3100 6250 3100
Wire Wire Line
	5100 3200 5700 3200
Wire Wire Line
	5100 3300 6250 3300
Wire Wire Line
	2100 2450 6250 2450
Wire Wire Line
	6250 2250 6050 2250
Wire Wire Line
	9250 5700 8250 5700
Wire Wire Line
	5700 3200 5700 4600
Connection ~ 5700 3200
Wire Wire Line
	5700 4600 5150 4600
Wire Wire Line
	10600 2400 10500 2400
Wire Wire Line
	10650 2500 10500 2500
Wire Wire Line
	9150 5500 9250 5500
Wire Wire Line
	3100 1800 3250 1800
Wire Wire Line
	3100 1750 3100 1800
Connection ~ 3100 1800
Wire Notes Line
	9950 550  9950 2600
Wire Notes Line
	9950 2600 11150 2600
Wire Notes Line
	11150 2600 11150 550 
Wire Wire Line
	5350 900  5350 1450
Wire Wire Line
	5350 1450 6050 1450
Connection ~ 2750 900 
Wire Wire Line
	6250 1350 6050 1350
Wire Wire Line
	6050 1350 6050 1450
Connection ~ 6050 1450
Wire Wire Line
	6050 2250 6050 2150
Wire Wire Line
	6050 2150 6250 2150
Connection ~ 6050 2250
Wire Wire Line
	8600 2050 8250 2050
Wire Wire Line
	8250 2450 8600 2450
Wire Wire Line
	8600 2550 8250 2550
$Comp
L RadIIS_Mainboard-rescue:+BATT #PWR032
U 1 1 5B491F5A
P 9750 2100
F 0 "#PWR032" H 9750 1950 50  0001 C CNN
F 1 "+BATT" H 9600 2150 50  0000 C CNN
F 2 "" H 9750 2100 50  0000 C CNN
F 3 "" H 9750 2100 50  0000 C CNN
	1    9750 2100
	1    0    0    -1  
$EndComp
Wire Wire Line
	9750 2100 9750 2150
Wire Wire Line
	9750 2150 9650 2150
$Sheet
S 1100 2050 1000 600 
U 58B43EB4
F0 "LED_Calibration" 60
F1 "LED_Calibration.sch" 60
F2 "GND" I R 2100 2250 60 
F3 "~LED_Trigger*" I R 2100 2450 60 
$EndSheet
Wire Wire Line
	2750 1300 2750 2350
Wire Wire Line
	10400 4850 10600 4850
Wire Wire Line
	5700 3200 6250 3200
Wire Wire Line
	3100 1800 3100 1900
Wire Wire Line
	2750 900  5350 900 
Wire Wire Line
	6050 1450 6250 1450
Wire Wire Line
	6050 2250 5950 2250
Wire Wire Line
	8500 4450 8500 4350
Wire Wire Line
	8500 4450 8250 4450
Wire Wire Line
	10000 4450 10600 4450
Wire Wire Line
	8600 1350 8250 1350
Wire Wire Line
	9000 3800 8250 3800
$EndSCHEMATC
