G04 #@! TF.FileFunction,Copper,L1,Top,Signal*
%FSLAX46Y46*%
G04 Gerber Fmt 4.6, Leading zero omitted, Abs format (unit mm)*
G04 Created by KiCad (PCBNEW 4.0.6-e0-6349~53~ubuntu16.04.1) date Mon Mar 13 19:01:04 2017*
%MOMM*%
%LPD*%
G01*
G04 APERTURE LIST*
%ADD10C,0.100000*%
%ADD11C,0.300000*%
%ADD12C,0.150000*%
%ADD13C,0.600000*%
%ADD14R,2.400000X1.900000*%
%ADD15R,0.599440X1.049020*%
%ADD16R,1.049020X1.501140*%
%ADD17R,1.500000X0.280000*%
%ADD18R,0.280000X1.500000*%
%ADD19R,1.250000X1.000000*%
%ADD20R,0.750000X0.800000*%
%ADD21R,1.000000X1.250000*%
%ADD22R,0.800000X0.750000*%
%ADD23R,1.000000X1.800000*%
%ADD24R,0.500000X0.900000*%
%ADD25R,0.900000X0.500000*%
%ADD26R,1.550000X0.600000*%
%ADD27R,1.060000X0.650000*%
%ADD28R,0.650000X1.060000*%
%ADD29R,0.900000X0.800000*%
%ADD30R,1.016000X1.524000*%
%ADD31R,1.524000X1.016000*%
%ADD32R,0.600000X1.550000*%
%ADD33R,2.500000X1.100000*%
%ADD34O,2.500000X1.100000*%
%ADD35O,1.100000X2.400000*%
%ADD36R,0.800000X0.800000*%
%ADD37R,1.900000X5.300000*%
%ADD38R,1.500000X2.200000*%
%ADD39R,1.050000X1.000000*%
%ADD40R,2.200000X1.050000*%
%ADD41R,0.800000X0.900000*%
%ADD42R,1.300000X0.700000*%
%ADD43R,0.700000X1.300000*%
%ADD44R,0.400000X1.350000*%
%ADD45R,0.400000X0.250000*%
%ADD46R,0.800000X1.300000*%
%ADD47C,1.500000*%
%ADD48R,1.800000X1.000000*%
%ADD49O,4.150000X1.950000*%
%ADD50O,1.400000X1.000000*%
%ADD51R,1.000000X1.000000*%
%ADD52O,1.000000X1.000000*%
%ADD53R,10.000000X2.500000*%
%ADD54O,0.300000X0.750000*%
%ADD55O,0.750000X0.300000*%
%ADD56R,0.900000X0.900000*%
%ADD57R,1.700000X1.700000*%
%ADD58O,1.700000X1.700000*%
%ADD59C,0.550000*%
%ADD60C,0.250000*%
%ADD61C,0.500000*%
%ADD62C,1.000000*%
%ADD63C,0.254000*%
G04 APERTURE END LIST*
D10*
D11*
X130435714Y-118478571D02*
X131292857Y-118478571D01*
X130864286Y-119978571D02*
X130864286Y-118478571D01*
X132078571Y-118478571D02*
X132364285Y-118478571D01*
X132507143Y-118550000D01*
X132650000Y-118692857D01*
X132721428Y-118978571D01*
X132721428Y-119478571D01*
X132650000Y-119764286D01*
X132507143Y-119907143D01*
X132364285Y-119978571D01*
X132078571Y-119978571D01*
X131935714Y-119907143D01*
X131792857Y-119764286D01*
X131721428Y-119478571D01*
X131721428Y-118978571D01*
X131792857Y-118692857D01*
X131935714Y-118550000D01*
X132078571Y-118478571D01*
X133364286Y-119978571D02*
X133364286Y-118478571D01*
X133935714Y-118478571D01*
X134078572Y-118550000D01*
X134150000Y-118621429D01*
X134221429Y-118764286D01*
X134221429Y-118978571D01*
X134150000Y-119121429D01*
X134078572Y-119192857D01*
X133935714Y-119264286D01*
X133364286Y-119264286D01*
X132528572Y-122678571D02*
X131671429Y-122678571D01*
X132100001Y-122678571D02*
X132100001Y-121178571D01*
X131957144Y-121392857D01*
X131814286Y-121535714D01*
X131671429Y-121607143D01*
D12*
X87000000Y-75000000D02*
X86000000Y-75000000D01*
X182000000Y-74500000D02*
X182000000Y-118000000D01*
X95002409Y-113501020D02*
X95002409Y-118001020D01*
X90000000Y-75000000D02*
G75*
G03X95000000Y-70000000I0J5000000D01*
G01*
X90000000Y-75000000D02*
X87000000Y-75000000D01*
X83400000Y-77600000D02*
X86000000Y-75000000D01*
X83400000Y-97201020D02*
X83400000Y-77600000D01*
X87000000Y-100001020D02*
X86200000Y-100001020D01*
X83400000Y-97201020D02*
X86200000Y-100001020D01*
X87000000Y-100001020D02*
X95002409Y-100001020D01*
X95002409Y-100001020D02*
X96902409Y-101901020D01*
X96902409Y-101901020D02*
X96902409Y-111601020D01*
X95002409Y-113501020D02*
X96902409Y-111601020D01*
X182000000Y-70000000D02*
X182000000Y-70000000D01*
X182000000Y-74500000D02*
X182000000Y-70000000D01*
X95000000Y-122000000D02*
G75*
G03X97000000Y-124000000I2000000J0D01*
G01*
X140000000Y-124000000D02*
G75*
G03X142000000Y-122000000I0J2000000D01*
G01*
X152000000Y-122000000D02*
G75*
G03X154000000Y-124000000I2000000J0D01*
G01*
X180000000Y-124000000D02*
G75*
G03X182000000Y-122000000I0J2000000D01*
G01*
X182000000Y-66000000D02*
G75*
G03X180000000Y-64000000I-2000000J0D01*
G01*
X154000000Y-64000000D02*
G75*
G03X152000000Y-66000000I0J-2000000D01*
G01*
X142000000Y-66000000D02*
G75*
G03X140000000Y-64000000I-2000000J0D01*
G01*
X97000000Y-64000000D02*
G75*
G03X95000000Y-66000000I0J-2000000D01*
G01*
X95000000Y-122000000D02*
X95000000Y-118000000D01*
X140000000Y-124000000D02*
X97000000Y-124000000D01*
X142000000Y-118000000D02*
X142000000Y-122000000D01*
X152000000Y-122000000D02*
X152000000Y-118000000D01*
X180000000Y-124000000D02*
X154000000Y-124000000D01*
X182000000Y-118000000D02*
X182000000Y-122000000D01*
X152000000Y-118000000D02*
G75*
G03X142000000Y-118000000I-5000000J0D01*
G01*
X182000000Y-66000000D02*
X182000000Y-70000000D01*
X154000000Y-64000000D02*
X180000000Y-64000000D01*
X152000000Y-70000000D02*
X152000000Y-66000000D01*
X142000000Y-66000000D02*
X142000000Y-70000000D01*
X97000000Y-64000000D02*
X140000000Y-64000000D01*
X95000000Y-70000000D02*
X95000000Y-66000000D01*
X142000000Y-70000000D02*
G75*
G03X152000000Y-70000000I5000000J0D01*
G01*
D13*
X105750000Y-118800000D03*
X100250000Y-115000000D03*
X99000000Y-115000000D03*
X97750000Y-115000000D03*
X97750000Y-116000000D03*
X99000000Y-116000000D03*
X100250000Y-116000000D03*
X101500000Y-116000000D03*
X101500000Y-114750000D03*
X101500000Y-113500000D03*
X97500000Y-113500000D03*
X104500000Y-118800000D03*
X103250000Y-118800000D03*
X102000000Y-118800000D03*
X105000000Y-117750000D03*
X106250000Y-117750000D03*
X106250000Y-116500000D03*
X105000000Y-116500000D03*
X105000000Y-115250000D03*
X106250000Y-115250000D03*
X106250000Y-114000000D03*
X105000000Y-114000000D03*
X105000000Y-112750000D03*
X106250000Y-112750000D03*
X106250000Y-111500000D03*
X105000000Y-111500000D03*
X106250000Y-110250000D03*
X105000000Y-110250000D03*
X106250000Y-109000000D03*
X105000000Y-109000000D03*
X101500000Y-109500000D03*
X100500000Y-109000000D03*
X99250000Y-109000000D03*
X98000000Y-109000000D03*
X98000000Y-107750000D03*
X99250000Y-107750000D03*
X100500000Y-107750000D03*
X101750000Y-107750000D03*
X103000000Y-107750000D03*
X104250000Y-107750000D03*
X105500000Y-107750000D03*
X97750000Y-110750000D03*
X104250000Y-106500000D03*
X103000000Y-106500000D03*
X101500000Y-110750000D03*
X101750000Y-106500000D03*
X100500000Y-106500000D03*
X99250000Y-106500000D03*
X98000000Y-106500000D03*
X155100000Y-89425000D03*
X154225000Y-89425000D03*
X166700000Y-95700000D03*
X166700000Y-94300000D03*
X159175000Y-110100000D03*
X169000000Y-116700000D03*
X169000000Y-115650000D03*
X169000000Y-114650000D03*
X157800000Y-113600000D03*
X157800000Y-114350000D03*
X160300000Y-109200000D03*
X160300000Y-110100000D03*
X161300000Y-110100000D03*
X161300000Y-109200000D03*
X161300000Y-108300000D03*
X124000000Y-85200000D03*
X123000000Y-85200000D03*
X122000000Y-85200000D03*
X128500000Y-83000000D03*
X122000000Y-83800000D03*
X123000000Y-83800000D03*
X124000000Y-83800000D03*
X128500000Y-84000000D03*
X124000000Y-82300000D03*
X123000000Y-82300000D03*
X166700000Y-92900000D03*
X122000000Y-82300000D03*
D14*
X155675000Y-101100000D03*
X155675000Y-97000000D03*
D15*
X130924100Y-73975000D03*
X129824280Y-73975000D03*
X128724460Y-73975000D03*
X127624640Y-73975000D03*
X126524820Y-73975000D03*
X125425000Y-73975000D03*
X124325180Y-73975000D03*
X123225360Y-73975000D03*
D16*
X134480100Y-76504840D03*
X121028260Y-76504840D03*
X134480100Y-68105060D03*
X121028260Y-68105060D03*
D17*
X149100000Y-106000000D03*
X149100000Y-105500000D03*
X149100000Y-105000000D03*
X149100000Y-104500000D03*
X149100000Y-104000000D03*
X149100000Y-103500000D03*
X149100000Y-103000000D03*
X149100000Y-102500000D03*
X149100000Y-102000000D03*
X149100000Y-101500000D03*
X149100000Y-101000000D03*
X149100000Y-100500000D03*
X149100000Y-100000000D03*
X149100000Y-99500000D03*
X149100000Y-99000000D03*
X149100000Y-98500000D03*
X149100000Y-98000000D03*
X149100000Y-97500000D03*
X149100000Y-97000000D03*
X149100000Y-96500000D03*
X149100000Y-96000000D03*
X149100000Y-95500000D03*
X149100000Y-95000000D03*
X149100000Y-94500000D03*
X149100000Y-94000000D03*
D18*
X147200000Y-92100000D03*
X146700000Y-92100000D03*
X146200000Y-92100000D03*
X145700000Y-92100000D03*
X145200000Y-92100000D03*
X144700000Y-92100000D03*
X144200000Y-92100000D03*
X143700000Y-92100000D03*
X143200000Y-92100000D03*
X142700000Y-92100000D03*
X142200000Y-92100000D03*
X141700000Y-92100000D03*
X141200000Y-92100000D03*
X140700000Y-92100000D03*
X140200000Y-92100000D03*
X139700000Y-92100000D03*
X139200000Y-92100000D03*
X138700000Y-92100000D03*
X138200000Y-92100000D03*
X137700000Y-92100000D03*
X137200000Y-92100000D03*
X136700000Y-92100000D03*
X136200000Y-92100000D03*
X135700000Y-92100000D03*
X135200000Y-92100000D03*
D17*
X133300000Y-94000000D03*
X133300000Y-94500000D03*
X133300000Y-95000000D03*
X133300000Y-95500000D03*
X133300000Y-96000000D03*
X133300000Y-96500000D03*
X133300000Y-97000000D03*
X133300000Y-97500000D03*
X133300000Y-98000000D03*
X133300000Y-98500000D03*
X133300000Y-99000000D03*
X133300000Y-99500000D03*
X133300000Y-100000000D03*
X133300000Y-100500000D03*
X133300000Y-101000000D03*
X133300000Y-101500000D03*
X133300000Y-102000000D03*
X133300000Y-102500000D03*
X133300000Y-103000000D03*
X133300000Y-103500000D03*
X133300000Y-104000000D03*
X133300000Y-104500000D03*
X133300000Y-105000000D03*
X133300000Y-105500000D03*
X133300000Y-106000000D03*
D18*
X135200000Y-107900000D03*
X135700000Y-107900000D03*
X136200000Y-107900000D03*
X136700000Y-107900000D03*
X137200000Y-107900000D03*
X137700000Y-107900000D03*
X138200000Y-107900000D03*
X138700000Y-107900000D03*
X139200000Y-107900000D03*
X139700000Y-107900000D03*
X140200000Y-107900000D03*
X140700000Y-107900000D03*
X141200000Y-107900000D03*
X141700000Y-107900000D03*
X142200000Y-107900000D03*
X142700000Y-107900000D03*
X143200000Y-107900000D03*
X143700000Y-107900000D03*
X144200000Y-107900000D03*
X144700000Y-107900000D03*
X145200000Y-107900000D03*
X145700000Y-107900000D03*
X146200000Y-107900000D03*
X146700000Y-107900000D03*
X147200000Y-107900000D03*
D19*
X158900000Y-116350000D03*
X158900000Y-114350000D03*
X162750000Y-110700000D03*
X162750000Y-108700000D03*
D20*
X155050000Y-86800000D03*
X155050000Y-88300000D03*
X155050000Y-67550000D03*
X155050000Y-66050000D03*
X162250000Y-67700000D03*
X162250000Y-66200000D03*
X160500000Y-76300000D03*
X160500000Y-74800000D03*
D21*
X171100000Y-100350000D03*
X173100000Y-100350000D03*
X171150000Y-102700000D03*
X173150000Y-102700000D03*
X168250000Y-88500000D03*
X166250000Y-88500000D03*
X163500000Y-93250000D03*
X165500000Y-93250000D03*
X163500000Y-95350000D03*
X165500000Y-95350000D03*
X168550000Y-82600000D03*
X166550000Y-82600000D03*
X172550000Y-82550000D03*
X170550000Y-82550000D03*
X100700000Y-101300000D03*
X98700000Y-101300000D03*
D19*
X96700000Y-99250000D03*
X96700000Y-97250000D03*
X164950000Y-110700000D03*
X164950000Y-108700000D03*
D22*
X101000000Y-73100000D03*
X99500000Y-73100000D03*
D20*
X158400000Y-101250000D03*
X158400000Y-99750000D03*
X158400000Y-96750000D03*
X158400000Y-98250000D03*
D22*
X136500000Y-80450000D03*
X135000000Y-80450000D03*
X153075000Y-101725000D03*
X151575000Y-101725000D03*
X148450000Y-108925000D03*
X149950000Y-108925000D03*
D20*
X131000000Y-107650000D03*
X131000000Y-106150000D03*
X151650000Y-95550000D03*
X151650000Y-97050000D03*
D21*
X125650000Y-92200000D03*
X127650000Y-92200000D03*
D19*
X126800000Y-85350000D03*
X126800000Y-83350000D03*
D23*
X142000000Y-76600000D03*
X142000000Y-82700000D03*
X144000000Y-76600000D03*
X144000000Y-82700000D03*
X146000000Y-76600000D03*
X146000000Y-82700000D03*
X148000000Y-76600000D03*
X148000000Y-82700000D03*
X150000000Y-76600000D03*
X150000000Y-82700000D03*
X152000000Y-76600000D03*
X152000000Y-82700000D03*
D24*
X158900000Y-89700000D03*
X157400000Y-89700000D03*
D25*
X153000000Y-86050000D03*
X153000000Y-84550000D03*
X154900000Y-82150000D03*
X154900000Y-83650000D03*
X153000000Y-88750000D03*
X153000000Y-87250000D03*
D24*
X156400000Y-82400000D03*
X157900000Y-82400000D03*
D25*
X98100000Y-73600000D03*
X98100000Y-75100000D03*
D24*
X156450000Y-65050000D03*
X157950000Y-65050000D03*
X160800000Y-65050000D03*
X159300000Y-65050000D03*
X100650000Y-95550000D03*
X99150000Y-95550000D03*
D25*
X161600000Y-100750000D03*
X161600000Y-102250000D03*
X161600000Y-97900000D03*
X161600000Y-99400000D03*
D24*
X171500000Y-89700000D03*
X173000000Y-89700000D03*
X171500000Y-87950000D03*
X173000000Y-87950000D03*
D25*
X160625000Y-111100000D03*
X160625000Y-112600000D03*
X159075000Y-112600000D03*
X159075000Y-111100000D03*
D24*
X166000000Y-112600000D03*
X164500000Y-112600000D03*
X99600000Y-74900000D03*
X101100000Y-74900000D03*
X107850000Y-91300000D03*
X106350000Y-91300000D03*
X102800000Y-90350000D03*
X104300000Y-90350000D03*
D25*
X120050000Y-71350000D03*
X120050000Y-69850000D03*
D24*
X109850000Y-91300000D03*
X111350000Y-91300000D03*
D25*
X143500000Y-110550000D03*
X143500000Y-112050000D03*
D26*
X157000000Y-84245000D03*
X157000000Y-85515000D03*
X157000000Y-86785000D03*
X157000000Y-88055000D03*
X162400000Y-88055000D03*
X162400000Y-86785000D03*
X162400000Y-85515000D03*
X162400000Y-84245000D03*
X169050000Y-101105000D03*
X169050000Y-99835000D03*
X169050000Y-98565000D03*
X169050000Y-97295000D03*
X163650000Y-97295000D03*
X163650000Y-98565000D03*
X163650000Y-99835000D03*
X163650000Y-101105000D03*
D27*
X170450000Y-84300000D03*
X170450000Y-85250000D03*
X170450000Y-86200000D03*
X172650000Y-86200000D03*
X172650000Y-84300000D03*
D28*
X166650000Y-86550000D03*
X167600000Y-86550000D03*
X168550000Y-86550000D03*
X168550000Y-84350000D03*
X166650000Y-84350000D03*
D22*
X113050000Y-102700000D03*
X114550000Y-102700000D03*
D29*
X164550000Y-114350000D03*
X164550000Y-116250000D03*
X166550000Y-115300000D03*
D28*
X162800000Y-114100000D03*
X161850000Y-114100000D03*
X160900000Y-114100000D03*
X160900000Y-116300000D03*
X162800000Y-116300000D03*
X161850000Y-116300000D03*
D30*
X128510000Y-122280000D03*
X127240000Y-122280000D03*
X125970000Y-122280000D03*
X124700000Y-122280000D03*
X123430000Y-122280000D03*
X122160000Y-122280000D03*
X120890000Y-122280000D03*
X119620000Y-122280000D03*
X118350000Y-122280000D03*
X117080000Y-122280000D03*
X115810000Y-122280000D03*
X114540000Y-122280000D03*
X113270000Y-122280000D03*
X112000000Y-122280000D03*
X110730000Y-122280000D03*
X109460000Y-122280000D03*
X108190000Y-122280000D03*
X106920000Y-122280000D03*
X105650000Y-122280000D03*
X104380000Y-122280000D03*
X104380000Y-104500000D03*
D31*
X103110000Y-117200000D03*
X103110000Y-115930000D03*
X103110000Y-114660000D03*
X103110000Y-113390000D03*
X103110000Y-112120000D03*
X103110000Y-110850000D03*
X103110000Y-109580000D03*
D30*
X105650000Y-104500000D03*
X106920000Y-104500000D03*
X108190000Y-104500000D03*
X109460000Y-104500000D03*
X110730000Y-104500000D03*
X112000000Y-104500000D03*
X113270000Y-104500000D03*
X114540000Y-104500000D03*
X115810000Y-104500000D03*
X117080000Y-104500000D03*
X118350000Y-104500000D03*
X119620000Y-104500000D03*
X120890000Y-104500000D03*
X122160000Y-104500000D03*
X123430000Y-104500000D03*
X124700000Y-104500000D03*
X125970000Y-104500000D03*
X127240000Y-104500000D03*
X128510000Y-104500000D03*
D32*
X156695000Y-72950000D03*
X157965000Y-72950000D03*
X159235000Y-72950000D03*
X160505000Y-72950000D03*
X160505000Y-67550000D03*
X159235000Y-67550000D03*
X157965000Y-67550000D03*
X156695000Y-67550000D03*
D27*
X98700000Y-97350000D03*
X98700000Y-98300000D03*
X98700000Y-99250000D03*
X100900000Y-99250000D03*
X100900000Y-97350000D03*
D28*
X126700000Y-90400000D03*
X127650000Y-90400000D03*
X128600000Y-90400000D03*
X128600000Y-88200000D03*
X126700000Y-88200000D03*
D33*
X103100000Y-73300000D03*
D34*
X103100000Y-75300000D03*
X103100000Y-77300000D03*
X103100000Y-79300000D03*
X103100000Y-81300000D03*
X103100000Y-83300000D03*
X103100000Y-85300000D03*
X103100000Y-87300000D03*
X118500000Y-87300000D03*
X118400000Y-85300000D03*
X118500000Y-83300000D03*
X118500000Y-81300000D03*
X118500000Y-79300000D03*
X118500000Y-77300000D03*
X118500000Y-75300000D03*
X118500000Y-73300000D03*
D35*
X105790000Y-89050000D03*
X107790000Y-89050000D03*
X109790000Y-89050000D03*
X111790000Y-89050000D03*
X113790000Y-89050000D03*
X115790000Y-89050000D03*
D20*
X165200000Y-84900000D03*
X165200000Y-86400000D03*
X165300000Y-67550000D03*
X165300000Y-66050000D03*
X170650000Y-76250000D03*
X170650000Y-74750000D03*
X172250000Y-67200000D03*
X172250000Y-65700000D03*
D22*
X125500000Y-80800000D03*
X127000000Y-80800000D03*
X118900000Y-101800000D03*
X117400000Y-101800000D03*
D21*
X118550000Y-100150000D03*
X120550000Y-100150000D03*
D22*
X115300000Y-95100000D03*
X116800000Y-95100000D03*
D19*
X104650000Y-94650000D03*
X104650000Y-96650000D03*
D21*
X103400000Y-102150000D03*
X105400000Y-102150000D03*
D20*
X134200000Y-92100000D03*
X134200000Y-90600000D03*
D10*
G36*
X146801992Y-90228338D02*
X146271662Y-89698008D01*
X146837348Y-89132322D01*
X147367678Y-89662652D01*
X146801992Y-90228338D01*
X146801992Y-90228338D01*
G37*
G36*
X147862652Y-89167678D02*
X147332322Y-88637348D01*
X147898008Y-88071662D01*
X148428338Y-88601992D01*
X147862652Y-89167678D01*
X147862652Y-89167678D01*
G37*
D20*
X90300000Y-83450000D03*
X90300000Y-84950000D03*
D22*
X156925000Y-105775000D03*
X158425000Y-105775000D03*
X156925000Y-103225000D03*
X158425000Y-103225000D03*
D21*
X172500000Y-114800000D03*
X170500000Y-114800000D03*
X172500000Y-116600000D03*
X170500000Y-116600000D03*
D22*
X165700000Y-106650000D03*
X164200000Y-106650000D03*
X170750000Y-110450000D03*
X169250000Y-110450000D03*
X175050000Y-122200000D03*
X176550000Y-122200000D03*
D20*
X164350000Y-76300000D03*
X164350000Y-77800000D03*
D29*
X102750000Y-98300000D03*
X102750000Y-100200000D03*
X104750000Y-99250000D03*
D36*
X177500000Y-109500000D03*
X177500000Y-107900000D03*
D37*
X161950000Y-120300000D03*
X165350000Y-120300000D03*
D38*
X112990000Y-98250000D03*
X106750000Y-98250000D03*
D39*
X97925000Y-112100000D03*
X100975000Y-112100000D03*
D40*
X99450000Y-110625000D03*
X99450000Y-113575000D03*
D41*
X88075000Y-78975000D03*
X89975000Y-78975000D03*
X89025000Y-76975000D03*
D29*
X169200000Y-108850000D03*
X169200000Y-106950000D03*
X167200000Y-107900000D03*
X170700000Y-106950000D03*
X170700000Y-108850000D03*
X172700000Y-107900000D03*
X157950000Y-76800000D03*
X157950000Y-74900000D03*
X155950000Y-75850000D03*
X168200000Y-76900000D03*
X168200000Y-75000000D03*
X166200000Y-75950000D03*
D24*
X170850000Y-65250000D03*
X169350000Y-65250000D03*
X166650000Y-65250000D03*
X168150000Y-65250000D03*
D42*
X90900000Y-95700000D03*
X90900000Y-97600000D03*
D24*
X152825000Y-110900000D03*
X154325000Y-110900000D03*
X154325000Y-108050000D03*
X152825000Y-108050000D03*
D43*
X114150000Y-100950000D03*
X116050000Y-100950000D03*
D25*
X121050000Y-98600000D03*
X121050000Y-97100000D03*
X121050000Y-94500000D03*
X121050000Y-96000000D03*
X119450000Y-95700000D03*
X119450000Y-97200000D03*
D24*
X93500000Y-88450000D03*
X95000000Y-88450000D03*
X93500000Y-90350000D03*
X95000000Y-90350000D03*
D25*
X90300000Y-81900000D03*
X90300000Y-80400000D03*
D43*
X170950000Y-112900000D03*
X169050000Y-112900000D03*
X174250000Y-112900000D03*
X172350000Y-112900000D03*
X177450000Y-112900000D03*
X175550000Y-112900000D03*
D24*
X172550000Y-105300000D03*
X171050000Y-105300000D03*
X168500000Y-105350000D03*
X167000000Y-105350000D03*
X177450000Y-114700000D03*
X175950000Y-114700000D03*
X171250000Y-118400000D03*
X172750000Y-118400000D03*
X161700000Y-82350000D03*
X163200000Y-82350000D03*
X160550000Y-82350000D03*
X159050000Y-82350000D03*
D44*
X164325000Y-74300000D03*
X164325000Y-70000000D03*
X163675000Y-74300000D03*
X163675000Y-70000000D03*
X163025000Y-74300000D03*
X163025000Y-70000000D03*
X162375000Y-74300000D03*
X162375000Y-70000000D03*
D32*
X166845000Y-72950000D03*
X168115000Y-72950000D03*
X169385000Y-72950000D03*
X170655000Y-72950000D03*
X170655000Y-67550000D03*
X169385000Y-67550000D03*
X168115000Y-67550000D03*
X166845000Y-67550000D03*
D45*
X92100000Y-89200000D03*
X90650000Y-89200000D03*
X92100000Y-89700000D03*
X90650000Y-89700000D03*
X92100000Y-90200000D03*
X90650000Y-90200000D03*
D46*
X91375000Y-89700000D03*
D28*
X173450000Y-120000000D03*
X172500000Y-120000000D03*
X171550000Y-120000000D03*
X171550000Y-122200000D03*
X173450000Y-122200000D03*
D47*
X141700000Y-87200000D03*
X153750000Y-69350000D03*
X163500000Y-90950000D03*
X148000000Y-85450000D03*
X141100000Y-73100000D03*
X99800000Y-104250000D03*
X102500000Y-95550000D03*
X124700000Y-87600000D03*
X169150000Y-121100000D03*
X167200000Y-111300000D03*
X153750000Y-74350000D03*
D48*
X155000000Y-103225000D03*
X155000000Y-105725000D03*
D49*
X86950000Y-85800000D03*
D50*
X86150000Y-89400000D03*
X87750000Y-90050000D03*
X87750000Y-91350000D03*
X87750000Y-88750000D03*
X86150000Y-90700000D03*
D49*
X86950000Y-94300000D03*
D51*
X179970000Y-74530000D03*
D52*
X179970000Y-75800000D03*
X178700000Y-74530000D03*
X178700000Y-75800000D03*
X177430000Y-74530000D03*
X177430000Y-75800000D03*
X176160000Y-74530000D03*
X176160000Y-75800000D03*
X174890000Y-74530000D03*
X174890000Y-75800000D03*
X173620000Y-74530000D03*
X173620000Y-75800000D03*
D53*
X96200000Y-84500000D03*
X96200000Y-77500000D03*
D54*
X115550000Y-99425000D03*
X116050000Y-99425000D03*
X116550000Y-99425000D03*
X117050000Y-99425000D03*
D55*
X117775000Y-98700000D03*
X117775000Y-98200000D03*
X117775000Y-97700000D03*
X117775000Y-97200000D03*
D54*
X117050000Y-96475000D03*
X116550000Y-96475000D03*
X116050000Y-96475000D03*
X115550000Y-96475000D03*
D55*
X114825000Y-97200000D03*
X114825000Y-97700000D03*
X114825000Y-98200000D03*
X114825000Y-98700000D03*
D56*
X116750000Y-97500000D03*
X115850000Y-97500000D03*
X116750000Y-98400000D03*
X115850000Y-98400000D03*
D51*
X131960000Y-82800000D03*
D52*
X133230000Y-82800000D03*
X134500000Y-82800000D03*
X135770000Y-82800000D03*
X137040000Y-82800000D03*
X138310000Y-82800000D03*
D20*
X123950000Y-90750000D03*
X123950000Y-92250000D03*
X128550000Y-86650000D03*
X128550000Y-85150000D03*
X125050000Y-85400000D03*
X125050000Y-83900000D03*
D22*
X127600000Y-99050000D03*
X126100000Y-99050000D03*
X154300000Y-109475000D03*
X152800000Y-109475000D03*
D51*
X128820000Y-96950000D03*
D52*
X127550000Y-96950000D03*
X126280000Y-96950000D03*
X125010000Y-96950000D03*
D24*
X158950000Y-91250000D03*
X157450000Y-91250000D03*
D25*
X131100000Y-97600000D03*
X131100000Y-99100000D03*
D57*
X93600000Y-97590000D03*
D58*
X93600000Y-95050000D03*
D59*
X151800000Y-109700000D03*
X96200000Y-85710002D03*
X168600000Y-89750000D03*
X159750000Y-118300000D03*
X170050000Y-102700000D03*
X169300000Y-102700000D03*
X168550000Y-102700000D03*
X90900000Y-95025000D03*
X159750000Y-117600000D03*
X159775000Y-119000000D03*
X159050000Y-119000000D03*
X159025000Y-118300000D03*
X159025000Y-117600000D03*
X116750000Y-97500000D03*
X115850000Y-97500000D03*
X105800000Y-95150000D03*
X151675000Y-102400000D03*
X152350000Y-97050000D03*
X162100000Y-68700000D03*
X163700000Y-68700000D03*
X120200000Y-75300000D03*
X176525000Y-120700000D03*
X142725000Y-112050000D03*
X149950000Y-108175000D03*
X111925000Y-91300000D03*
X146000000Y-77800000D03*
X163775000Y-88050000D03*
X165200000Y-87100000D03*
X91375000Y-91125000D03*
X125500000Y-80100000D03*
X172950000Y-65700000D03*
X162900000Y-66200000D03*
X165300000Y-88500000D03*
X89050000Y-76200000D03*
X133525000Y-90600000D03*
X169600000Y-84300000D03*
X148375000Y-88125000D03*
X163650000Y-101750000D03*
X169050000Y-105350000D03*
X173950000Y-103100000D03*
X173950000Y-102300000D03*
X120050000Y-71900000D03*
X98000000Y-101300000D03*
X127650000Y-93150000D03*
X123950000Y-92950000D03*
X152275000Y-108050000D03*
X162800000Y-113225000D03*
X161850000Y-113225000D03*
X99150000Y-94750000D03*
X96700000Y-96450000D03*
X158400000Y-98975000D03*
X158425000Y-103800000D03*
X158425000Y-105200000D03*
X170150000Y-98550000D03*
X128500000Y-103400000D03*
X130300000Y-106150000D03*
X119600000Y-103400000D03*
X115800000Y-103400000D03*
X103400000Y-103400000D03*
X120900000Y-121150000D03*
X115850000Y-98400000D03*
X120525000Y-101100000D03*
X173550000Y-89700000D03*
X173600000Y-118350000D03*
X112250000Y-102700000D03*
X116750000Y-98400000D03*
X110750000Y-121150000D03*
X99475000Y-72400000D03*
X128500000Y-121200000D03*
X103550000Y-122300000D03*
X90275000Y-85700000D03*
X125450000Y-75075000D03*
X154400000Y-66150000D03*
X165750000Y-82600000D03*
X170550000Y-81650000D03*
X160500000Y-77000000D03*
X165050000Y-77800000D03*
X164600000Y-66050000D03*
X157930979Y-81675010D03*
X170650000Y-77400000D03*
X152350000Y-95550000D03*
X168550000Y-81700000D03*
X148000000Y-77800000D03*
X154550000Y-67900000D03*
X165050000Y-76300000D03*
X165300000Y-68250000D03*
X171350000Y-74750000D03*
X161200000Y-74800000D03*
X142025000Y-75425000D03*
X172550000Y-81650000D03*
X153100000Y-102400000D03*
X175050000Y-120700000D03*
X127000000Y-80100000D03*
X127700000Y-80800000D03*
X133500000Y-92075000D03*
X146375000Y-89225000D03*
X102800000Y-88600000D03*
X150250000Y-103475000D03*
X97350000Y-75100000D03*
X127625000Y-75025000D03*
X150700000Y-106975000D03*
X115250000Y-102400000D03*
X130300000Y-107650000D03*
X150650000Y-99350000D03*
X134100000Y-110000000D03*
X139100000Y-85000000D03*
X131000000Y-105100000D03*
X141700000Y-109950000D03*
X157200000Y-111950000D03*
X170450000Y-87050000D03*
X166650000Y-87350000D03*
X160500000Y-98650000D03*
X139800000Y-89800000D03*
X101700000Y-73150000D03*
X138800000Y-89800000D03*
X101800000Y-76300000D03*
X137800000Y-89800000D03*
X108300000Y-91200000D03*
X137000000Y-89800000D03*
X109100000Y-91250000D03*
X137925000Y-109975000D03*
X109450000Y-121250000D03*
X135300000Y-110000000D03*
X123050000Y-107850000D03*
X131500000Y-95650000D03*
X98300000Y-91050000D03*
X136000000Y-89800000D03*
X113800000Y-90800000D03*
X124325000Y-75075000D03*
X120300000Y-81300000D03*
X167200000Y-111300000D03*
X163315000Y-85075000D03*
X117450000Y-106075000D03*
X121350000Y-113250000D03*
X117450000Y-102800000D03*
X119750000Y-98450000D03*
X116050000Y-94050000D03*
X118400000Y-96450000D03*
X105800000Y-96950000D03*
X131000000Y-101700000D03*
X102800000Y-93900000D03*
X137925000Y-110925000D03*
X138700000Y-109950000D03*
X144175000Y-88525000D03*
X143550000Y-109300000D03*
X169350000Y-74450000D03*
X150650000Y-98600000D03*
X163250000Y-76350000D03*
X162950000Y-68700000D03*
X150650000Y-97850000D03*
X131000000Y-102550000D03*
X89900000Y-90400000D03*
X151250000Y-93000000D03*
X155150000Y-69350000D03*
X153575000Y-94700000D03*
X167550000Y-66150000D03*
X150000000Y-85300000D03*
X150000000Y-93100000D03*
X145700000Y-88550000D03*
X149250000Y-90300000D03*
X144825000Y-89850000D03*
X154875000Y-108050000D03*
X131500000Y-94900000D03*
X88075000Y-79700000D03*
X136500000Y-110000000D03*
X122200000Y-106550000D03*
X135000000Y-89800000D03*
X115800000Y-90800000D03*
X143975000Y-89850000D03*
X169150000Y-119975000D03*
X89900000Y-88800000D03*
X92850000Y-88900000D03*
X89900000Y-89600000D03*
X92850000Y-89700000D03*
X131000000Y-103400000D03*
X97500000Y-93100000D03*
X131000000Y-104250000D03*
X96700000Y-93150000D03*
D60*
X138250000Y-120850000D02*
X140750000Y-120850000D01*
X135750000Y-120850000D02*
X138250000Y-120850000D01*
X140750000Y-123100000D02*
X138250000Y-123100000D01*
X138250000Y-123100000D02*
X135750000Y-123100000D01*
X138250000Y-120850000D02*
X138250000Y-123100000D01*
X133250000Y-120850000D02*
X135750000Y-120850000D01*
X135750000Y-123100000D02*
X133250000Y-123100000D01*
X135750000Y-120850000D02*
X135750000Y-123100000D01*
X131000000Y-120850000D02*
X133250000Y-120850000D01*
X133250000Y-123100000D02*
X131000000Y-123100000D01*
X133250000Y-120850000D02*
X133250000Y-123100000D01*
X140750000Y-120850000D02*
X140750000Y-123100000D01*
X131000000Y-123100000D02*
X131000000Y-120850000D01*
D61*
X93600000Y-97590000D02*
X90910000Y-97590000D01*
X90910000Y-97590000D02*
X90900000Y-97600000D01*
X93815000Y-97590000D02*
X95475000Y-99250000D01*
X95475000Y-99250000D02*
X96700000Y-99250000D01*
X93600000Y-97590000D02*
X93815000Y-97590000D01*
X98700000Y-99250000D02*
X96700000Y-99250000D01*
D60*
X152825000Y-110900000D02*
X152300000Y-110900000D01*
X152300000Y-110900000D02*
X151800000Y-110400000D01*
X151800000Y-110400000D02*
X151800000Y-109700000D01*
D61*
X96200000Y-84500000D02*
X96200000Y-85710002D01*
X90300000Y-83450000D02*
X95150000Y-83450000D01*
X95150000Y-83450000D02*
X96200000Y-84500000D01*
X168600000Y-89750000D02*
X168250000Y-89400000D01*
X168250000Y-89400000D02*
X168250000Y-88500000D01*
X170050000Y-102700000D02*
X171150000Y-102700000D01*
X169300000Y-102700000D02*
X170050000Y-102700000D01*
X168550000Y-102700000D02*
X169300000Y-102700000D01*
D60*
X168550000Y-102700000D02*
X167900000Y-103350000D01*
X167900000Y-103350000D02*
X162700000Y-103350000D01*
X162700000Y-103350000D02*
X161600000Y-102250000D01*
D61*
X169050000Y-101105000D02*
X169555000Y-101105000D01*
X169555000Y-101105000D02*
X171150000Y-102700000D01*
D62*
X96200000Y-85710002D02*
X103339998Y-92850000D01*
X103339998Y-92850000D02*
X116600000Y-92850000D01*
X116600000Y-92850000D02*
X118900000Y-90550000D01*
X118900000Y-90550000D02*
X123750000Y-90550000D01*
X123750000Y-90550000D02*
X123950000Y-90750000D01*
D60*
X126000000Y-93900000D02*
X125650000Y-93550000D01*
X125650000Y-93550000D02*
X125650000Y-92200000D01*
X128300000Y-93900000D02*
X126000000Y-93900000D01*
X128600000Y-93600000D02*
X128300000Y-93900000D01*
X128600000Y-90400000D02*
X128600000Y-93600000D01*
D61*
X125900000Y-90400000D02*
X125650000Y-90650000D01*
X125650000Y-90650000D02*
X125650000Y-91450000D01*
X126700000Y-90400000D02*
X125900000Y-90400000D01*
D62*
X125650000Y-91450000D02*
X124950000Y-90750000D01*
X124950000Y-90750000D02*
X123950000Y-90750000D01*
X125650000Y-92200000D02*
X125650000Y-91450000D01*
D61*
X128700000Y-90500000D02*
X128600000Y-90400000D01*
X90900000Y-95025000D02*
X90900000Y-95700000D01*
X159750000Y-117600000D02*
X159025000Y-117600000D01*
X159025000Y-117600000D02*
X159025000Y-118300000D01*
D60*
X159025000Y-117600000D02*
X158900000Y-117475000D01*
X158900000Y-117475000D02*
X158900000Y-116350000D01*
D61*
X90300000Y-81900000D02*
X90300000Y-83450000D01*
D62*
X161850000Y-120200000D02*
X161950000Y-120300000D01*
D61*
X158900000Y-116350000D02*
X159025000Y-116350000D01*
X159025000Y-116350000D02*
X161950000Y-119275000D01*
X161950000Y-119275000D02*
X161950000Y-120300000D01*
X161950000Y-120300000D02*
X161950000Y-116400000D01*
X161950000Y-116400000D02*
X161850000Y-116300000D01*
X168250000Y-88500000D02*
X168550000Y-88200000D01*
X168550000Y-88200000D02*
X168550000Y-86550000D01*
X105800000Y-95150000D02*
X105150000Y-95150000D01*
X105150000Y-95150000D02*
X104650000Y-94650000D01*
X105800000Y-95150000D02*
X105850000Y-95100000D01*
X105850000Y-95100000D02*
X105850000Y-94650000D01*
X105850000Y-94650000D02*
X104650000Y-94650000D01*
X105800000Y-95150000D02*
X105300000Y-94650000D01*
X105300000Y-94650000D02*
X104650000Y-94650000D01*
X151675000Y-102400000D02*
X151675000Y-101825000D01*
X151675000Y-101825000D02*
X151575000Y-101725000D01*
X152350000Y-97050000D02*
X151650000Y-97050000D01*
D60*
X162375000Y-70000000D02*
X162375000Y-68975000D01*
X162375000Y-68975000D02*
X162100000Y-68700000D01*
X163675000Y-70000000D02*
X163675000Y-68725000D01*
X163675000Y-68725000D02*
X163700000Y-68700000D01*
D61*
X117800000Y-75300000D02*
X120200000Y-75300000D01*
X176525000Y-120700000D02*
X176550000Y-120725000D01*
X176550000Y-120725000D02*
X176550000Y-122200000D01*
D60*
X142725000Y-112050000D02*
X143500000Y-112050000D01*
D61*
X149950000Y-108175000D02*
X149950000Y-108925000D01*
D60*
X111350000Y-91250000D02*
X111875000Y-91250000D01*
X111875000Y-91250000D02*
X111925000Y-91300000D01*
D61*
X111925000Y-91300000D02*
X111350000Y-91300000D01*
X146000000Y-76600000D02*
X146000000Y-77800000D01*
X162400000Y-88055000D02*
X163770000Y-88055000D01*
X163770000Y-88055000D02*
X163775000Y-88050000D01*
X165200000Y-86400000D02*
X165200000Y-87100000D01*
X125500000Y-80800000D02*
X125500000Y-80100000D01*
X125500000Y-82200000D02*
X125400000Y-82300000D01*
X125400000Y-82300000D02*
X124000000Y-82300000D01*
X125500000Y-80800000D02*
X125500000Y-82200000D01*
X172950000Y-65700000D02*
X172250000Y-65700000D01*
X162250000Y-66200000D02*
X162900000Y-66200000D01*
D60*
X162250000Y-65550000D02*
X162250000Y-65050000D01*
D61*
X165300000Y-88500000D02*
X166250000Y-88500000D01*
X131000000Y-106150000D02*
X130300000Y-106150000D01*
X89025000Y-76975000D02*
X89025000Y-76225000D01*
X89025000Y-76225000D02*
X89050000Y-76200000D01*
X134200000Y-90600000D02*
X133525000Y-90600000D01*
X134200000Y-90600000D02*
X133625000Y-90600000D01*
X170450000Y-84300000D02*
X169600000Y-84300000D01*
D60*
X147880330Y-88619670D02*
X148375000Y-88125000D01*
X148150000Y-89600000D02*
X146700000Y-91050000D01*
X146700000Y-91050000D02*
X146700000Y-92100000D01*
X148150000Y-88900000D02*
X148150000Y-89600000D01*
X147880330Y-88630330D02*
X148150000Y-88900000D01*
X147880330Y-88619670D02*
X147880330Y-88630330D01*
D61*
X165500000Y-93250000D02*
X165500000Y-95350000D01*
X115810000Y-104500000D02*
X115810000Y-103410000D01*
X115810000Y-103410000D02*
X115800000Y-103400000D01*
X119620000Y-104500000D02*
X119620000Y-103420000D01*
X119620000Y-103420000D02*
X119600000Y-103400000D01*
X128510000Y-104500000D02*
X128510000Y-103410000D01*
X128510000Y-103410000D02*
X128500000Y-103400000D01*
X173950000Y-102300000D02*
X173950000Y-103100000D01*
X163650000Y-101105000D02*
X163650000Y-101750000D01*
X168500000Y-105350000D02*
X169050000Y-105350000D01*
X168250000Y-108600000D02*
X168250000Y-105600000D01*
X168250000Y-105600000D02*
X168500000Y-105350000D01*
X168500000Y-108850000D02*
X168250000Y-108600000D01*
X169200000Y-108850000D02*
X168500000Y-108850000D01*
X170700000Y-108850000D02*
X169200000Y-108850000D01*
X173950000Y-103100000D02*
X173550000Y-102700000D01*
X173950000Y-102300000D02*
X173550000Y-102700000D01*
X173550000Y-102700000D02*
X173150000Y-102700000D01*
X134500000Y-82800000D02*
X134500000Y-80600000D01*
X134500000Y-80600000D02*
X134650000Y-80450000D01*
X135000000Y-80450000D02*
X134650000Y-80450000D01*
X120050000Y-71900000D02*
X120050000Y-71350000D01*
X98000000Y-101300000D02*
X98700000Y-101300000D01*
X127650000Y-92200000D02*
X127650000Y-93150000D01*
X127650000Y-90400000D02*
X127650000Y-92200000D01*
X123950000Y-92250000D02*
X123950000Y-92950000D01*
X152825000Y-108050000D02*
X152275000Y-108050000D01*
X152800000Y-109475000D02*
X152800000Y-108075000D01*
X152800000Y-108075000D02*
X152825000Y-108050000D01*
D60*
X150775000Y-97050000D02*
X150725000Y-97000000D01*
X150725000Y-97000000D02*
X149100000Y-97000000D01*
X151650000Y-97050000D02*
X150775000Y-97050000D01*
X162800000Y-113225000D02*
X162800000Y-114100000D01*
X161850000Y-114100000D02*
X161850000Y-113225000D01*
D61*
X99150000Y-95550000D02*
X99150000Y-94750000D01*
X96700000Y-97250000D02*
X96700000Y-96450000D01*
X158400000Y-98975000D02*
X158400000Y-99750000D01*
X158400000Y-98250000D02*
X158400000Y-98975000D01*
D60*
X158425000Y-103225000D02*
X158425000Y-103800000D01*
X158425000Y-105775000D02*
X158425000Y-105200000D01*
X149100000Y-101500000D02*
X151350000Y-101500000D01*
X151350000Y-101500000D02*
X151575000Y-101725000D01*
D61*
X162800000Y-114100000D02*
X162800000Y-114305000D01*
X170500000Y-114800000D02*
X169250000Y-114800000D01*
D60*
X166430000Y-88500000D02*
X166250000Y-88500000D01*
X167600000Y-87330000D02*
X166430000Y-88500000D01*
X97000000Y-98300000D02*
X96700000Y-98000000D01*
D61*
X172750000Y-118400000D02*
X173550000Y-118400000D01*
D60*
X99450000Y-109850000D02*
X99450000Y-110625000D01*
X99720000Y-109580000D02*
X99450000Y-109850000D01*
X103110000Y-109580000D02*
X99720000Y-109580000D01*
X101030000Y-115930000D02*
X99450000Y-114350000D01*
X102098000Y-117200000D02*
X101030000Y-116132000D01*
D61*
X172500000Y-118650000D02*
X172500000Y-120000000D01*
D62*
X93685553Y-95135553D02*
X93600000Y-95050000D01*
D61*
X91375000Y-89700000D02*
X91375000Y-91125000D01*
D60*
X114825000Y-97700000D02*
X115650000Y-97700000D01*
X116550000Y-98200000D02*
X116750000Y-98400000D01*
X117050000Y-98700000D02*
X116750000Y-98400000D01*
X117050000Y-99425000D02*
X117050000Y-98700000D01*
X114825000Y-97700000D02*
X115150000Y-97700000D01*
X115650000Y-97700000D02*
X115850000Y-97500000D01*
X135100000Y-90600000D02*
X134200000Y-90600000D01*
X135700000Y-91200000D02*
X135100000Y-90600000D01*
X135700000Y-92100000D02*
X135700000Y-91200000D01*
D61*
X170500000Y-116600000D02*
X170500000Y-114800000D01*
X173000000Y-89700000D02*
X173550000Y-89700000D01*
X170150000Y-98550000D02*
X170135000Y-98565000D01*
D60*
X98700000Y-98300000D02*
X97000000Y-98300000D01*
D61*
X126280000Y-96950000D02*
X126280000Y-98220000D01*
D60*
X131650000Y-105500000D02*
X131000000Y-106150000D01*
D61*
X103400000Y-102150000D02*
X103400000Y-103400000D01*
X103900000Y-104500000D02*
X103400000Y-104000000D01*
X110730000Y-121170000D02*
X110750000Y-121150000D01*
X110730000Y-122280000D02*
X110730000Y-121170000D01*
X113050000Y-102700000D02*
X112250000Y-102700000D01*
X173550000Y-118400000D02*
X173600000Y-118350000D01*
X103570000Y-122280000D02*
X103550000Y-122300000D01*
D60*
X114825000Y-98200000D02*
X116550000Y-98200000D01*
D61*
X104380000Y-122280000D02*
X103570000Y-122280000D01*
X98100000Y-113575000D02*
X97925000Y-113400000D01*
X103110000Y-117200000D02*
X101725000Y-117200000D01*
X101725000Y-117200000D02*
X101725000Y-118525000D01*
X104380000Y-104500000D02*
X103900000Y-104500000D01*
D62*
X105150000Y-110800000D02*
X104825000Y-110800000D01*
X104825000Y-110800000D02*
X104650000Y-110975000D01*
X104650000Y-110975000D02*
X104650000Y-113300000D01*
X105100000Y-110850000D02*
X105150000Y-110800000D01*
X99675000Y-110850000D02*
X99450000Y-110625000D01*
D61*
X126100000Y-99050000D02*
X126100000Y-98400000D01*
D60*
X103110000Y-115930000D02*
X101030000Y-115930000D01*
D62*
X99635000Y-113390000D02*
X99450000Y-113575000D01*
D60*
X99450000Y-110625000D02*
X99450000Y-109000000D01*
D62*
X103110000Y-110850000D02*
X105100000Y-110850000D01*
D61*
X103400000Y-104000000D02*
X103400000Y-103400000D01*
X120890000Y-121160000D02*
X120900000Y-121150000D01*
X120890000Y-122280000D02*
X120890000Y-121160000D01*
X128510000Y-121210000D02*
X128500000Y-121200000D01*
X120550000Y-101075000D02*
X120525000Y-101100000D01*
D60*
X103110000Y-117200000D02*
X102098000Y-117200000D01*
D61*
X99450000Y-113575000D02*
X98100000Y-113575000D01*
X120550000Y-100150000D02*
X120550000Y-101075000D01*
X99450000Y-110625000D02*
X97925000Y-110625000D01*
D62*
X104650000Y-113300000D02*
X105150000Y-113800000D01*
D61*
X120000000Y-101800000D02*
X120075000Y-101725000D01*
X126280000Y-98220000D02*
X126100000Y-98400000D01*
X118900000Y-101800000D02*
X120000000Y-101800000D01*
D60*
X120450000Y-101350000D02*
X120550000Y-101250000D01*
D61*
X120525000Y-101100000D02*
X120525000Y-101275000D01*
D60*
X99450000Y-114350000D02*
X99450000Y-113575000D01*
D61*
X121050000Y-98600000D02*
X121050000Y-99650000D01*
D60*
X101030000Y-116132000D02*
X101030000Y-115930000D01*
X146700000Y-107900000D02*
X146700000Y-109300000D01*
D61*
X101725000Y-118525000D02*
X102000000Y-118800000D01*
D60*
X146700000Y-109300000D02*
X147275000Y-109875000D01*
X147275000Y-109875000D02*
X149475000Y-109875000D01*
D61*
X97925000Y-112100000D02*
X97925000Y-110625000D01*
X170135000Y-98565000D02*
X169050000Y-98565000D01*
D60*
X149950000Y-109400000D02*
X149950000Y-108925000D01*
X149475000Y-109875000D02*
X149950000Y-109400000D01*
X120550000Y-101250000D02*
X120550000Y-100150000D01*
X167600000Y-86550000D02*
X167600000Y-87330000D01*
D61*
X97925000Y-112100000D02*
X97925000Y-113400000D01*
X120075000Y-101725000D02*
X120450000Y-101350000D01*
X128510000Y-122280000D02*
X128510000Y-121210000D01*
X121050000Y-99650000D02*
X120550000Y-100150000D01*
X120525000Y-101275000D02*
X120450000Y-101350000D01*
D60*
X96700000Y-98000000D02*
X96700000Y-97250000D01*
D61*
X125425000Y-75050000D02*
X125450000Y-75075000D01*
D62*
X103110000Y-113390000D02*
X104560000Y-113390000D01*
D61*
X99500000Y-72425000D02*
X99475000Y-72400000D01*
X99500000Y-73100000D02*
X99500000Y-72425000D01*
X90300000Y-85675000D02*
X90275000Y-85700000D01*
D60*
X133300000Y-105500000D02*
X131650000Y-105500000D01*
D62*
X104560000Y-113390000D02*
X105150000Y-112800000D01*
X103110000Y-110850000D02*
X99675000Y-110850000D01*
X103110000Y-113390000D02*
X99635000Y-113390000D01*
D61*
X172750000Y-118400000D02*
X172500000Y-118650000D01*
X125425000Y-73975000D02*
X125425000Y-75050000D01*
X90300000Y-84950000D02*
X90300000Y-85675000D01*
X155025000Y-88325000D02*
X155050000Y-88300000D01*
X155050000Y-66050000D02*
X154500000Y-66050000D01*
X154500000Y-66050000D02*
X154400000Y-66150000D01*
X166550000Y-82600000D02*
X165750000Y-82600000D01*
X170550000Y-82550000D02*
X170550000Y-81650000D01*
D60*
X163025000Y-75125000D02*
X162600000Y-75550000D01*
D61*
X160500000Y-76300000D02*
X161850000Y-76300000D01*
X161850000Y-76300000D02*
X162600000Y-75550000D01*
X160500000Y-76300000D02*
X160500000Y-77000000D01*
X164350000Y-77800000D02*
X165050000Y-77800000D01*
X164600000Y-66050000D02*
X164600006Y-66050006D01*
X164600006Y-66050006D02*
X165299994Y-66050006D01*
X165299994Y-66050006D02*
X165300000Y-66050000D01*
D60*
X149850000Y-96500000D02*
X149100000Y-96500000D01*
X149100000Y-97000000D02*
X149100000Y-96500000D01*
D61*
X162250000Y-65050000D02*
X162200002Y-65050000D01*
X160800000Y-65050000D02*
X162250000Y-65050000D01*
X162250000Y-66200000D02*
X162250000Y-65050000D01*
X162200002Y-65050000D02*
X162200000Y-65050002D01*
X157930979Y-82099274D02*
X157930979Y-81675010D01*
X157930979Y-82369021D02*
X157930979Y-82099274D01*
X157900000Y-82400000D02*
X157930979Y-82369021D01*
X155050000Y-88300000D02*
X153450000Y-88300000D01*
X153450000Y-88300000D02*
X153000000Y-88750000D01*
X157000000Y-88055000D02*
X155295000Y-88055000D01*
X155295000Y-88055000D02*
X155050000Y-88300000D01*
X170650000Y-76250000D02*
X170650000Y-77400000D01*
X172250000Y-65700000D02*
X171300000Y-65700000D01*
X171300000Y-65700000D02*
X170850000Y-65250000D01*
D60*
X163025000Y-74300000D02*
X163025000Y-75125000D01*
D61*
X162750000Y-110700000D02*
X162750000Y-111200000D01*
X162750000Y-111200000D02*
X162750000Y-111850000D01*
X160625000Y-111100000D02*
X162650000Y-111100000D01*
X162650000Y-111100000D02*
X162750000Y-111200000D01*
X162750000Y-111850000D02*
X163500000Y-112600000D01*
X163500000Y-112600000D02*
X164500000Y-112600000D01*
X164500000Y-112600000D02*
X164500000Y-114300000D01*
X164500000Y-114300000D02*
X164550000Y-114350000D01*
X158900000Y-89700000D02*
X158900000Y-91200000D01*
X158900000Y-91200000D02*
X158950000Y-91250000D01*
X158900000Y-89700000D02*
X158900000Y-87410000D01*
X158900000Y-87410000D02*
X158275000Y-86785000D01*
X158275000Y-86785000D02*
X157000000Y-86785000D01*
X157000000Y-86785000D02*
X155065000Y-86785000D01*
X155065000Y-86785000D02*
X155050000Y-86800000D01*
X152350000Y-95550000D02*
X151650000Y-95550000D01*
D60*
X149100000Y-95500000D02*
X151600000Y-95500000D01*
X151600000Y-95500000D02*
X151650000Y-95550000D01*
D61*
X168550000Y-81700000D02*
X168550000Y-82600000D01*
D60*
X164350000Y-75550000D02*
X164350000Y-74325000D01*
X164350000Y-74325000D02*
X164325000Y-74300000D01*
D61*
X164350000Y-76300000D02*
X164350000Y-75550000D01*
X168550000Y-84350000D02*
X168550000Y-82600000D01*
X148000000Y-76600000D02*
X148000000Y-77800000D01*
X148000000Y-76600000D02*
X148000000Y-77700000D01*
X151700000Y-95500000D02*
X151650000Y-95550000D01*
X164325000Y-76275000D02*
X164350000Y-76300000D01*
X155050000Y-67550000D02*
X156695000Y-67550000D01*
X155050000Y-67550000D02*
X154900000Y-67550000D01*
X154900000Y-67550000D02*
X154550000Y-67900000D01*
X164350000Y-76300000D02*
X165050000Y-76300000D01*
X165300000Y-67550000D02*
X165300000Y-68250000D01*
X166845000Y-67550000D02*
X165300000Y-67550000D01*
D60*
X148000000Y-85450000D02*
X148000000Y-82700000D01*
X164250000Y-74375000D02*
X164325000Y-74300000D01*
D61*
X170650000Y-74750000D02*
X171350000Y-74750000D01*
X161200000Y-74800000D02*
X160500000Y-74800000D01*
X160505000Y-73905000D02*
X160505000Y-72950000D01*
X142025000Y-75425000D02*
X142000000Y-75450000D01*
X142000000Y-75450000D02*
X142000000Y-76600000D01*
D60*
X142025000Y-75425000D02*
X142025000Y-74025000D01*
X142025000Y-74025000D02*
X141100000Y-73100000D01*
D61*
X172550000Y-81650000D02*
X172550000Y-82550000D01*
X172650000Y-84300000D02*
X172855000Y-84300000D01*
X172855000Y-84300000D02*
X173750000Y-85195000D01*
X173750000Y-85195000D02*
X173750000Y-87000000D01*
X173750000Y-87000000D02*
X173000000Y-87750000D01*
X173000000Y-87750000D02*
X173000000Y-87950000D01*
D60*
X170805000Y-73100000D02*
X170655000Y-72950000D01*
D61*
X172650000Y-84300000D02*
X172650000Y-82650000D01*
X172650000Y-82650000D02*
X172550000Y-82550000D01*
X170650000Y-74750000D02*
X170650000Y-72955000D01*
X170650000Y-72955000D02*
X170655000Y-72950000D01*
X160500000Y-74800000D02*
X160500000Y-72955000D01*
X160500000Y-72955000D02*
X160505000Y-72950000D01*
X169050000Y-99835000D02*
X170585000Y-99835000D01*
X170585000Y-99835000D02*
X171100000Y-100350000D01*
X173100000Y-99600000D02*
X170795000Y-97295000D01*
X170795000Y-97295000D02*
X169050000Y-97295000D01*
X173100000Y-100350000D02*
X173100000Y-99600000D01*
X170450000Y-85250000D02*
X169650000Y-85250000D01*
X169469999Y-85430001D02*
X169469999Y-90780001D01*
X169650000Y-85250000D02*
X169469999Y-85430001D01*
X169469999Y-90780001D02*
X169300000Y-90950000D01*
X169300000Y-90950000D02*
X163500000Y-90950000D01*
X163500000Y-93250000D02*
X163500000Y-90950000D01*
X163500000Y-95350000D02*
X163500000Y-93250000D01*
X163650000Y-97295000D02*
X163650000Y-95500000D01*
X163650000Y-95500000D02*
X163500000Y-95350000D01*
X163905000Y-97295000D02*
X163650000Y-97295000D01*
X161600000Y-97900000D02*
X162205000Y-97295000D01*
X162205000Y-97295000D02*
X163650000Y-97295000D01*
X166650000Y-84350000D02*
X165750000Y-84350000D01*
X165750000Y-84350000D02*
X165200000Y-84900000D01*
D60*
X149100000Y-100500000D02*
X152700000Y-100500000D01*
X153875000Y-99325000D02*
X154975000Y-99325000D01*
X152700000Y-100500000D02*
X153875000Y-99325000D01*
X154975000Y-99325000D02*
X155675000Y-100025000D01*
X155675000Y-100025000D02*
X155675000Y-101100000D01*
X155675000Y-100550000D02*
X155675000Y-101100000D01*
D61*
X158400000Y-101250000D02*
X155825000Y-101250000D01*
X155825000Y-101250000D02*
X155675000Y-101100000D01*
D60*
X155675000Y-97000000D02*
X155675000Y-98050000D01*
X155675000Y-98050000D02*
X154925000Y-98800000D01*
X154925000Y-98800000D02*
X153675000Y-98800000D01*
X153675000Y-98800000D02*
X152475000Y-100000000D01*
X152475000Y-100000000D02*
X151475000Y-100000000D01*
X151475000Y-100000000D02*
X149100000Y-100000000D01*
D61*
X155675000Y-97000000D02*
X158150000Y-97000000D01*
X158150000Y-97000000D02*
X158400000Y-96750000D01*
X153100000Y-102400000D02*
X153100000Y-101750000D01*
X153100000Y-101750000D02*
X153075000Y-101725000D01*
D60*
X153075000Y-101725000D02*
X153075000Y-102375000D01*
X153075000Y-102375000D02*
X153100000Y-102400000D01*
D61*
X175050000Y-120700000D02*
X175050000Y-122200000D01*
X127000000Y-80800000D02*
X127000000Y-80100000D01*
X127000000Y-80800000D02*
X127700000Y-80800000D01*
X131000000Y-107650000D02*
X130300000Y-107650000D01*
X134200000Y-92100000D02*
X133525000Y-92100000D01*
X133525000Y-92100000D02*
X133500000Y-92075000D01*
D60*
X146819670Y-89680330D02*
X146819670Y-89669670D01*
X146819670Y-89669670D02*
X146375000Y-89225000D01*
X146200000Y-92100000D02*
X146200000Y-90300000D01*
X146200000Y-90300000D02*
X146819670Y-89680330D01*
D61*
X102800000Y-88600000D02*
X102800000Y-88300000D01*
X102800000Y-90350000D02*
X102800000Y-88600000D01*
X98100000Y-75100000D02*
X99400000Y-75100000D01*
X99400000Y-75100000D02*
X99600000Y-74900000D01*
X102800000Y-88300000D02*
X103800000Y-87300000D01*
X126800000Y-85350000D02*
X125100000Y-85350000D01*
X125100000Y-85350000D02*
X125050000Y-85400000D01*
X126700000Y-88200000D02*
X126700000Y-85450000D01*
X126700000Y-85450000D02*
X126800000Y-85350000D01*
D60*
X149100000Y-101000000D02*
X152350000Y-101000000D01*
X152350000Y-101000000D02*
X153075000Y-101725000D01*
X150250000Y-103475000D02*
X150225000Y-103500000D01*
X150225000Y-103500000D02*
X149100000Y-103500000D01*
X133300000Y-105000000D02*
X134425000Y-105000000D01*
X134425000Y-105000000D02*
X134575000Y-105150000D01*
X134575000Y-105150000D02*
X134575000Y-105850000D01*
X134575000Y-105850000D02*
X134425000Y-106000000D01*
X134425000Y-106000000D02*
X133300000Y-106000000D01*
D61*
X98100000Y-75100000D02*
X97350000Y-75100000D01*
X127624640Y-73975000D02*
X127624640Y-75024640D01*
X127624640Y-75024640D02*
X127625000Y-75025000D01*
X150700000Y-106975000D02*
X149025000Y-106975000D01*
X149025000Y-106975000D02*
X148425000Y-107575000D01*
X148425000Y-107575000D02*
X148425000Y-108900000D01*
X148425000Y-108900000D02*
X148450000Y-108925000D01*
D60*
X147200000Y-108900000D02*
X147225000Y-108925000D01*
X147225000Y-108925000D02*
X148450000Y-108925000D01*
X147200000Y-107900000D02*
X147200000Y-108900000D01*
D61*
X115250000Y-102400000D02*
X114700000Y-102400000D01*
X114700000Y-102400000D02*
X114550000Y-102550000D01*
X114550000Y-102550000D02*
X114550000Y-102700000D01*
X114550000Y-102700000D02*
X114550000Y-104490000D01*
X114550000Y-104490000D02*
X114540000Y-104500000D01*
X114540000Y-117660000D02*
X112000000Y-120200000D01*
X112000000Y-120200000D02*
X112000000Y-122280000D01*
X114540000Y-104500000D02*
X114540000Y-117660000D01*
D60*
X132050000Y-107250000D02*
X131650000Y-107650000D01*
X131650000Y-107650000D02*
X131000000Y-107650000D01*
X132050000Y-106400000D02*
X132050000Y-107250000D01*
X132450000Y-106000000D02*
X132050000Y-106400000D01*
X133300000Y-106000000D02*
X132450000Y-106000000D01*
X135200000Y-92100000D02*
X134200000Y-92100000D01*
D61*
X174400000Y-122200000D02*
X175050000Y-122200000D01*
X173450000Y-122200000D02*
X174400000Y-122200000D01*
D60*
X106350000Y-91200000D02*
X103450000Y-91200000D01*
X103450000Y-91200000D02*
X102800000Y-90550000D01*
X102800000Y-90550000D02*
X102800000Y-90350000D01*
X150425000Y-99500000D02*
X149100000Y-99500000D01*
X150650000Y-99350000D02*
X150575000Y-99350000D01*
X150575000Y-99350000D02*
X150425000Y-99500000D01*
D61*
X137040000Y-82800000D02*
X137040000Y-80660000D01*
X137040000Y-80660000D02*
X137050000Y-80650000D01*
X136850000Y-80450000D02*
X136500000Y-80450000D01*
X137050000Y-80650000D02*
X136850000Y-80450000D01*
X128550000Y-86650000D02*
X128550000Y-88150000D01*
X128550000Y-88150000D02*
X128600000Y-88200000D01*
X128500000Y-88100000D02*
X128600000Y-88200000D01*
D60*
X134100000Y-110000000D02*
X135200000Y-108900000D01*
X135200000Y-108900000D02*
X135200000Y-107900000D01*
X139100000Y-85000000D02*
X134900000Y-85000000D01*
X134900000Y-85000000D02*
X133230000Y-83330000D01*
X133230000Y-83330000D02*
X133230000Y-82800000D01*
X133300000Y-104500000D02*
X131600000Y-104500000D01*
X131600000Y-104500000D02*
X131000000Y-105100000D01*
X141700000Y-109950000D02*
X141700000Y-107900000D01*
D61*
X162400000Y-86785000D02*
X161185000Y-86785000D01*
X161185000Y-86785000D02*
X159050000Y-84650000D01*
X159050000Y-84650000D02*
X159050000Y-83300000D01*
X159050000Y-83300000D02*
X159050000Y-82350000D01*
X155700000Y-80800000D02*
X154900000Y-81600000D01*
X154900000Y-81600000D02*
X154900000Y-82150000D01*
X158800000Y-80800000D02*
X155700000Y-80800000D01*
X159050000Y-81050000D02*
X158800000Y-80800000D01*
X159050000Y-82350000D02*
X159050000Y-81050000D01*
X152450000Y-84550000D02*
X152000000Y-84100000D01*
X152000000Y-84100000D02*
X152000000Y-82700000D01*
X152950000Y-84550000D02*
X152450000Y-84550000D01*
X152950000Y-82700000D02*
X153500000Y-82150000D01*
X153500000Y-82150000D02*
X154900000Y-82150000D01*
X152000000Y-82700000D02*
X152950000Y-82700000D01*
X153750000Y-74350000D02*
X153750000Y-74850000D01*
X153750000Y-74850000D02*
X152000000Y-76600000D01*
D60*
X149100000Y-96000000D02*
X150000000Y-96000000D01*
X150000000Y-96000000D02*
X150300000Y-96300000D01*
X150300000Y-96300000D02*
X153275000Y-96300000D01*
X153275000Y-96300000D02*
X157350000Y-92225000D01*
X157350000Y-92225000D02*
X157350000Y-91350000D01*
X157350000Y-91350000D02*
X157450000Y-91250000D01*
X155800000Y-84790000D02*
X155800000Y-83700000D01*
X155800000Y-83700000D02*
X155800000Y-82750000D01*
X154900000Y-83650000D02*
X155750000Y-83650000D01*
X155750000Y-83650000D02*
X155800000Y-83700000D01*
X157000000Y-85515000D02*
X156525000Y-85515000D01*
X156525000Y-85515000D02*
X155800000Y-84790000D01*
X155800000Y-82750000D02*
X156150000Y-82400000D01*
X156150000Y-82400000D02*
X156400000Y-82400000D01*
D61*
X159300000Y-65050000D02*
X157950000Y-65050000D01*
X159235000Y-67550000D02*
X159235000Y-65115000D01*
X159235000Y-65115000D02*
X159300000Y-65050000D01*
X100650000Y-96125000D02*
X100900000Y-96375000D01*
X100900000Y-96375000D02*
X100900000Y-97350000D01*
X100650000Y-95550000D02*
X100650000Y-96125000D01*
X162115000Y-99835000D02*
X161600000Y-100350000D01*
X161600000Y-100350000D02*
X161600000Y-100750000D01*
X163650000Y-99835000D02*
X162115000Y-99835000D01*
X163650000Y-99835000D02*
X162035000Y-99835000D01*
X162035000Y-99835000D02*
X161600000Y-99400000D01*
X171500000Y-87950000D02*
X171500000Y-89700000D01*
X172650000Y-86200000D02*
X172650000Y-86800000D01*
X172650000Y-86800000D02*
X171500000Y-87950000D01*
X160900000Y-114100000D02*
X160900000Y-112875000D01*
X160900000Y-112875000D02*
X160625000Y-112600000D01*
X159075000Y-112600000D02*
X160625000Y-112600000D01*
X105790000Y-89810000D02*
X105250000Y-90350000D01*
X105250000Y-90350000D02*
X104300000Y-90350000D01*
X105790000Y-89050000D02*
X105790000Y-89810000D01*
D60*
X144200000Y-107900000D02*
X144200000Y-109850000D01*
X144200000Y-109850000D02*
X143500000Y-110550000D01*
X156300000Y-112000000D02*
X156125000Y-112000000D01*
X156125000Y-112000000D02*
X148250000Y-112000000D01*
X156300000Y-112175000D02*
X156125000Y-112000000D01*
X156300000Y-112175000D02*
X156300000Y-112000000D01*
X156300000Y-114300000D02*
X156300000Y-112175000D01*
X157150000Y-112000000D02*
X156475000Y-112000000D01*
X156475000Y-112000000D02*
X156300000Y-112000000D01*
X156300000Y-112175000D02*
X156475000Y-112000000D01*
X160900000Y-116300000D02*
X159925000Y-115325000D01*
X159925000Y-115325000D02*
X157325000Y-115325000D01*
X157325000Y-115325000D02*
X156300000Y-114300000D01*
X157200000Y-111950000D02*
X157150000Y-112000000D01*
X148250000Y-112000000D02*
X145200000Y-108950000D01*
X145200000Y-108950000D02*
X145200000Y-107900000D01*
X170450000Y-87050000D02*
X170450000Y-86200000D01*
X166650000Y-87350000D02*
X166650000Y-86550000D01*
X160500000Y-98650000D02*
X163565000Y-98650000D01*
X163565000Y-98650000D02*
X163650000Y-98565000D01*
X138700000Y-92100000D02*
X138700000Y-90900000D01*
X138700000Y-90900000D02*
X139800000Y-89800000D01*
X98100000Y-73600000D02*
X98300000Y-73600000D01*
X100975000Y-73100000D02*
X101000000Y-73100000D01*
X98300000Y-73600000D02*
X98700000Y-74000000D01*
X98700000Y-74000000D02*
X100075000Y-74000000D01*
X100075000Y-74000000D02*
X100975000Y-73100000D01*
X101650000Y-73100000D02*
X101700000Y-73150000D01*
X103800000Y-73300000D02*
X101850000Y-73300000D01*
X101850000Y-73300000D02*
X101700000Y-73150000D01*
X101000000Y-73100000D02*
X101650000Y-73100000D01*
D61*
X164550000Y-116250000D02*
X162850000Y-116250000D01*
X162850000Y-116250000D02*
X162800000Y-116300000D01*
X165350000Y-120300000D02*
X165350000Y-117050000D01*
X165350000Y-117050000D02*
X164550000Y-116250000D01*
D60*
X138200000Y-92100000D02*
X138200000Y-90400000D01*
X138200000Y-90400000D02*
X138800000Y-89800000D01*
X101100000Y-75600000D02*
X101800000Y-76300000D01*
X103800000Y-77300000D02*
X102800000Y-77300000D01*
X102800000Y-77300000D02*
X101800000Y-76300000D01*
X101100000Y-74900000D02*
X101100000Y-75600000D01*
X137700000Y-92100000D02*
X137700000Y-89900000D01*
X137700000Y-89900000D02*
X137800000Y-89800000D01*
D61*
X107850000Y-91200000D02*
X108300000Y-91200000D01*
X107790000Y-89050000D02*
X107790000Y-91140000D01*
X107790000Y-91140000D02*
X107850000Y-91200000D01*
D60*
X107850000Y-91550000D02*
X107850000Y-89110000D01*
X107850000Y-89110000D02*
X107790000Y-89050000D01*
X137200000Y-92100000D02*
X137200000Y-90000000D01*
X137200000Y-90000000D02*
X137000000Y-89800000D01*
D61*
X109850000Y-91250000D02*
X109100000Y-91250000D01*
X109790000Y-89050000D02*
X109790000Y-91190000D01*
X109790000Y-91190000D02*
X109850000Y-91250000D01*
D60*
X137700000Y-109750000D02*
X137700000Y-107900000D01*
X137925000Y-109975000D02*
X137700000Y-109750000D01*
X109460000Y-121260000D02*
X109460000Y-122280000D01*
X109450000Y-121250000D02*
X109460000Y-121260000D01*
X109460000Y-122280000D02*
X109460000Y-121610000D01*
X136200000Y-107900000D02*
X136200000Y-109100000D01*
X136200000Y-109100000D02*
X135300000Y-110000000D01*
X120890000Y-106540000D02*
X122200000Y-107850000D01*
X122200000Y-107850000D02*
X123050000Y-107850000D01*
X120890000Y-104500000D02*
X120890000Y-106540000D01*
X133300000Y-95500000D02*
X131650000Y-95500000D01*
X131650000Y-95500000D02*
X131500000Y-95650000D01*
X98300000Y-91050000D02*
X98400000Y-91150000D01*
X98400000Y-91150000D02*
X98400000Y-96500000D01*
X98400000Y-96500000D02*
X98700000Y-96800000D01*
X98700000Y-96800000D02*
X98700000Y-97350000D01*
X103550000Y-79900000D02*
X103550000Y-79750000D01*
X136000000Y-89800000D02*
X136700000Y-90500000D01*
X136700000Y-90500000D02*
X136700000Y-92100000D01*
X113800000Y-90800000D02*
X113790000Y-90790000D01*
X113790000Y-90790000D02*
X113790000Y-89050000D01*
D61*
X121950000Y-69850000D02*
X122250000Y-69850000D01*
X121950000Y-70225000D02*
X121950000Y-70150000D01*
X122250000Y-69850000D02*
X128175000Y-69850000D01*
X121950000Y-70150000D02*
X122250000Y-69850000D01*
X121950000Y-70225000D02*
X121950000Y-69850000D01*
X121950000Y-72025000D02*
X121950000Y-70225000D01*
X120050000Y-69850000D02*
X121625000Y-69850000D01*
X121625000Y-69850000D02*
X121950000Y-69850000D01*
X121950000Y-70225000D02*
X121950000Y-70175000D01*
X121950000Y-70175000D02*
X121625000Y-69850000D01*
X120675000Y-73300000D02*
X121950000Y-72025000D01*
X117800000Y-73300000D02*
X120675000Y-73300000D01*
X128175000Y-69850000D02*
X129824280Y-71499280D01*
X129824280Y-71499280D02*
X129824280Y-73975000D01*
D60*
X119850000Y-69850000D02*
X120050000Y-69850000D01*
D61*
X128175000Y-76600000D02*
X128724460Y-76050540D01*
X128724460Y-76050540D02*
X128724460Y-73975000D01*
X127025000Y-76600000D02*
X128175000Y-76600000D01*
X124325000Y-79300000D02*
X127025000Y-76600000D01*
X117800000Y-79300000D02*
X124325000Y-79300000D01*
X124075000Y-78125000D02*
X126524820Y-75675180D01*
X126524820Y-75675180D02*
X126524820Y-73975000D01*
X119925000Y-78125000D02*
X124075000Y-78125000D01*
X119100000Y-77300000D02*
X119925000Y-78125000D01*
X117800000Y-77300000D02*
X119100000Y-77300000D01*
X124325000Y-75075000D02*
X124325000Y-73975180D01*
X124325000Y-73975180D02*
X124325180Y-73975000D01*
X117800000Y-81300000D02*
X120300000Y-81300000D01*
D62*
X103110000Y-112120000D02*
X100995000Y-112120000D01*
X100995000Y-112120000D02*
X100975000Y-112100000D01*
D61*
X93200000Y-77500000D02*
X91725000Y-78975000D01*
X91725000Y-78975000D02*
X89975000Y-78975000D01*
X90300000Y-80400000D02*
X90300000Y-79300000D01*
X90300000Y-79300000D02*
X89975000Y-78975000D01*
X96200000Y-77500000D02*
X93200000Y-77500000D01*
D60*
X164325000Y-68275000D02*
X164325000Y-70000000D01*
D61*
X157965000Y-73935000D02*
X157965000Y-72950000D01*
D60*
X160505000Y-68520000D02*
X157965000Y-71060000D01*
X157965000Y-71060000D02*
X157965000Y-72950000D01*
X160505000Y-67550000D02*
X160505000Y-68520000D01*
D61*
X162250000Y-67700000D02*
X163750000Y-67700000D01*
X163750000Y-67700000D02*
X164325000Y-68275000D01*
X162250000Y-67700000D02*
X161250000Y-67700000D01*
X161250000Y-67700000D02*
X160655000Y-67700000D01*
X157950000Y-74900000D02*
X157950000Y-73950000D01*
D60*
X157965000Y-73935000D02*
X157950000Y-73950000D01*
D61*
X160655000Y-67700000D02*
X160505000Y-67550000D01*
X157950000Y-74900000D02*
X157950000Y-76800000D01*
X100900000Y-99250000D02*
X100900000Y-101100000D01*
X100900000Y-101100000D02*
X100700000Y-101300000D01*
D60*
X104750000Y-99250000D02*
X100900000Y-99250000D01*
D61*
X166000000Y-111750000D02*
X165700000Y-111450000D01*
X165700000Y-111450000D02*
X164950000Y-110700000D01*
X167200000Y-111300000D02*
X165850000Y-111300000D01*
X165850000Y-111300000D02*
X165700000Y-111450000D01*
X169050000Y-112900000D02*
X167250000Y-112900000D01*
X167250000Y-112900000D02*
X166300000Y-112900000D01*
X166000000Y-112600000D02*
X166000000Y-111750000D01*
X166300000Y-112900000D02*
X166000000Y-112600000D01*
X163315000Y-85075000D02*
X163625001Y-84764999D01*
X162400000Y-85515000D02*
X162875000Y-85515000D01*
X162875000Y-85515000D02*
X163315000Y-85075000D01*
X163625001Y-83725001D02*
X163200000Y-83300000D01*
X163625001Y-84764999D02*
X163625001Y-83725001D01*
X163200000Y-83300000D02*
X163200000Y-82350000D01*
D60*
X168125000Y-71275000D02*
X165775000Y-71275000D01*
X165775000Y-71275000D02*
X164850000Y-72200000D01*
X164850000Y-72200000D02*
X163550000Y-72200000D01*
X163550000Y-72200000D02*
X162375000Y-73375000D01*
X162375000Y-73375000D02*
X162375000Y-74300000D01*
D61*
X168115000Y-72950000D02*
X168115000Y-71210000D01*
X168115000Y-71210000D02*
X170655000Y-68670000D01*
X170655000Y-68670000D02*
X170655000Y-67550000D01*
D60*
X170655000Y-67550000D02*
X170655000Y-68085000D01*
X168115000Y-72475000D02*
X168115000Y-72950000D01*
D61*
X172250000Y-67200000D02*
X171005000Y-67200000D01*
X171005000Y-67200000D02*
X170655000Y-67550000D01*
X168200000Y-75000000D02*
X168200000Y-76900000D01*
X168115000Y-72950000D02*
X168115000Y-74915000D01*
X168115000Y-74915000D02*
X168200000Y-75000000D01*
D60*
X116550000Y-99575000D02*
X116500000Y-99625000D01*
X116500000Y-99625000D02*
X116500000Y-101100000D01*
X116550000Y-99425000D02*
X116550000Y-99575000D01*
X116550000Y-99425000D02*
X116550000Y-101050000D01*
X116550000Y-101050000D02*
X116500000Y-101100000D01*
X116275000Y-99425000D02*
X116050000Y-99425000D01*
X116550000Y-99425000D02*
X116275000Y-99425000D01*
X116275000Y-99425000D02*
X116275000Y-100725000D01*
X116275000Y-100725000D02*
X116050000Y-100950000D01*
D62*
X117450000Y-106075000D02*
X117475000Y-106100000D01*
X117475000Y-106100000D02*
X117475000Y-109375000D01*
X117475000Y-109375000D02*
X121350000Y-113250000D01*
X121375000Y-113250000D02*
X121350000Y-113250000D01*
D61*
X117450000Y-101850000D02*
X117400000Y-101800000D01*
X117450000Y-102800000D02*
X117450000Y-101850000D01*
X117400000Y-101100000D02*
X116500000Y-101100000D01*
X116500000Y-101100000D02*
X116200000Y-101100000D01*
D60*
X116050000Y-99425000D02*
X116050000Y-100950000D01*
D61*
X116200000Y-101100000D02*
X116050000Y-100950000D01*
D60*
X119750000Y-98450000D02*
X119750000Y-98950000D01*
X119750000Y-98950000D02*
X118550000Y-100150000D01*
X118350000Y-100150000D02*
X117400000Y-101100000D01*
X117400000Y-101100000D02*
X117400000Y-101800000D01*
X118550000Y-100150000D02*
X118350000Y-100150000D01*
X116050000Y-96475000D02*
X116050000Y-94050000D01*
X113875000Y-96475000D02*
X112990000Y-97360000D01*
X112990000Y-97360000D02*
X112990000Y-98250000D01*
X115550000Y-96475000D02*
X113875000Y-96475000D01*
X115550000Y-99425000D02*
X114165000Y-99425000D01*
X114165000Y-99425000D02*
X112990000Y-98250000D01*
X114825000Y-98700000D02*
X113440000Y-98700000D01*
X113440000Y-98700000D02*
X112990000Y-98250000D01*
X114825000Y-97200000D02*
X114040000Y-97200000D01*
X114040000Y-97200000D02*
X112990000Y-98250000D01*
X115550000Y-96475000D02*
X115550000Y-95350000D01*
X115550000Y-95350000D02*
X115300000Y-95100000D01*
X113165000Y-98075000D02*
X112990000Y-98250000D01*
X116550000Y-96475000D02*
X116550000Y-95350000D01*
X116550000Y-95350000D02*
X116800000Y-95100000D01*
X119450000Y-95700000D02*
X119150000Y-95700000D01*
X119150000Y-95700000D02*
X118400000Y-96450000D01*
D61*
X106750000Y-98250000D02*
X106750000Y-99850000D01*
X106750000Y-99850000D02*
X106750000Y-100175000D01*
X106350000Y-100200000D02*
X106400000Y-100200000D01*
X106400000Y-100200000D02*
X106750000Y-99850000D01*
X106350000Y-100200000D02*
X106725000Y-100200000D01*
X102750000Y-100200000D02*
X106350000Y-100200000D01*
X106350000Y-100200000D02*
X106750000Y-100600000D01*
X107000000Y-100950000D02*
X107000000Y-100850000D01*
X107000000Y-100850000D02*
X106750000Y-100600000D01*
X114150000Y-100950000D02*
X107000000Y-100950000D01*
X107000000Y-100950000D02*
X106750000Y-101200000D01*
D60*
X102750000Y-100200000D02*
X102700000Y-100200000D01*
X102075000Y-100825000D02*
X102075000Y-102625000D01*
X102700000Y-100200000D02*
X102075000Y-100825000D01*
X102075000Y-102625000D02*
X100450000Y-104250000D01*
X100450000Y-104250000D02*
X99800000Y-104250000D01*
D61*
X119450000Y-95700000D02*
X119450000Y-95050000D01*
D60*
X119450000Y-95050000D02*
X119475000Y-95025000D01*
D61*
X121050000Y-94500000D02*
X120000000Y-94500000D01*
X120000000Y-94500000D02*
X119475000Y-95025000D01*
X106750000Y-100175000D02*
X106750000Y-100600000D01*
X106750000Y-100600000D02*
X106750000Y-101200000D01*
X104650000Y-96650000D02*
X105500000Y-96650000D01*
X105500000Y-96650000D02*
X105800000Y-96950000D01*
X106750000Y-98250000D02*
X106750000Y-97900000D01*
X106750000Y-97900000D02*
X105800000Y-96950000D01*
X106725000Y-100200000D02*
X106750000Y-100175000D01*
X106750000Y-101200000D02*
X106750000Y-101800000D01*
X106750000Y-101800000D02*
X106400000Y-102150000D01*
X106400000Y-102150000D02*
X105400000Y-102150000D01*
D60*
X155000000Y-105725000D02*
X155000000Y-105125000D01*
X155000000Y-105125000D02*
X154575000Y-104700000D01*
X154575000Y-104700000D02*
X153225000Y-104700000D01*
X153225000Y-104700000D02*
X152200000Y-103675000D01*
X152200000Y-103675000D02*
X151400000Y-103675000D01*
X151400000Y-103675000D02*
X150225000Y-102500000D01*
X150225000Y-102500000D02*
X149100000Y-102500000D01*
D61*
X156925000Y-105775000D02*
X155050000Y-105775000D01*
X155050000Y-105775000D02*
X155000000Y-105725000D01*
D60*
X155000000Y-103225000D02*
X155000000Y-103725000D01*
X155000000Y-103725000D02*
X154575000Y-104150000D01*
X154575000Y-104150000D02*
X153375000Y-104150000D01*
X153375000Y-104150000D02*
X152350000Y-103125000D01*
X152350000Y-103125000D02*
X151500000Y-103125000D01*
X151500000Y-103125000D02*
X150375000Y-102000000D01*
X150375000Y-102000000D02*
X149100000Y-102000000D01*
D61*
X156925000Y-103225000D02*
X155000000Y-103225000D01*
X172350000Y-112900000D02*
X170950000Y-112900000D01*
X172500000Y-114800000D02*
X172500000Y-113050000D01*
X172500000Y-113050000D02*
X172350000Y-112900000D01*
X174250000Y-114850000D02*
X172500000Y-116600000D01*
X174250000Y-112900000D02*
X174250000Y-114850000D01*
X174250000Y-112900000D02*
X175550000Y-112900000D01*
X167200000Y-107900000D02*
X167200000Y-106800000D01*
X167200000Y-106800000D02*
X167200000Y-106500000D01*
X166800000Y-106500000D02*
X166900000Y-106500000D01*
X166900000Y-106500000D02*
X167200000Y-106800000D01*
X166800000Y-106500000D02*
X165850000Y-106500000D01*
X167200000Y-106500000D02*
X166800000Y-106500000D01*
X167200000Y-106500000D02*
X167200000Y-106200000D01*
X167200000Y-106200000D02*
X167200000Y-105550000D01*
X166900000Y-106500000D02*
X167200000Y-106200000D01*
X167200000Y-107900000D02*
X167200000Y-109050000D01*
X167200000Y-109050000D02*
X168600000Y-110450000D01*
X168600000Y-110450000D02*
X169250000Y-110450000D01*
X165850000Y-106500000D02*
X165700000Y-106650000D01*
X167200000Y-105550000D02*
X167000000Y-105350000D01*
X177500000Y-109500000D02*
X177200000Y-109500000D01*
X177200000Y-109500000D02*
X176350000Y-108650000D01*
X176350000Y-108650000D02*
X173625000Y-108650000D01*
X173625000Y-108650000D02*
X173350000Y-108925000D01*
X173350000Y-108925000D02*
X172375000Y-108925000D01*
X172375000Y-108925000D02*
X170850000Y-110450000D01*
X170850000Y-110450000D02*
X170750000Y-110450000D01*
X177450000Y-112900000D02*
X177450000Y-114700000D01*
D60*
X177450000Y-112900000D02*
X177450000Y-109550000D01*
X177450000Y-109550000D02*
X177500000Y-109500000D01*
X133300000Y-102500000D02*
X131800000Y-102500000D01*
X131800000Y-102500000D02*
X131000000Y-101700000D01*
X92075000Y-88475000D02*
X92100000Y-88500000D01*
X92100000Y-88500000D02*
X92100000Y-89200000D01*
D61*
X92075000Y-87425000D02*
X95850000Y-87425000D01*
X90025000Y-87425000D02*
X92075000Y-87425000D01*
X92075000Y-87425000D02*
X92075000Y-88475000D01*
X102800000Y-93900000D02*
X102475000Y-93900000D01*
X102475000Y-93900000D02*
X102400000Y-93975000D01*
X102400000Y-93975000D02*
X102400000Y-95450000D01*
X102400000Y-95450000D02*
X102500000Y-95550000D01*
D60*
X102400000Y-94300000D02*
X102400000Y-95450000D01*
D61*
X88700000Y-88750000D02*
X90025000Y-87425000D01*
X95850000Y-87425000D02*
X102400000Y-93975000D01*
X102400000Y-93975000D02*
X102400000Y-94300000D01*
X89700000Y-87750000D02*
X88700000Y-88750000D01*
X87750000Y-88750000D02*
X88700000Y-88750000D01*
X102500000Y-95550000D02*
X102500000Y-98050000D01*
X102500000Y-98050000D02*
X102750000Y-98300000D01*
D60*
X102800000Y-93900000D02*
X102400000Y-94300000D01*
D61*
X172700000Y-107900000D02*
X177500000Y-107900000D01*
X172550000Y-105300000D02*
X172550000Y-107750000D01*
X172550000Y-107750000D02*
X172700000Y-107900000D01*
X144650000Y-78950000D02*
X144000000Y-78300000D01*
X144000000Y-78300000D02*
X144000000Y-76600000D01*
X158850000Y-78950000D02*
X144650000Y-78950000D01*
X159235000Y-78565000D02*
X158850000Y-78950000D01*
X159235000Y-72950000D02*
X159235000Y-78565000D01*
D60*
X141700000Y-87200000D02*
X144000000Y-84900000D01*
X144000000Y-84900000D02*
X144000000Y-82700000D01*
X141700000Y-92100000D02*
X141700000Y-87200000D01*
X144000000Y-83400000D02*
X144000000Y-82700000D01*
X144000000Y-82700000D02*
X144000000Y-83650000D01*
X144000000Y-76600000D02*
X144000000Y-76300000D01*
D61*
X159235000Y-72475000D02*
X159235000Y-72950000D01*
D60*
X137925000Y-110925000D02*
X137200000Y-110200000D01*
X137200000Y-110200000D02*
X137200000Y-107900000D01*
X138700000Y-109950000D02*
X138700000Y-107900000D01*
X144200000Y-92100000D02*
X144200000Y-91000000D01*
X144200000Y-91000000D02*
X143350000Y-90150000D01*
X143350000Y-90150000D02*
X143350000Y-89350000D01*
X143350000Y-89350000D02*
X144175000Y-88525000D01*
X144175000Y-88525000D02*
X144200000Y-88550000D01*
D61*
X176160000Y-75800000D02*
X176160000Y-77590000D01*
X176160000Y-77590000D02*
X174250000Y-79500000D01*
X174250000Y-79500000D02*
X163850000Y-79500000D01*
X163850000Y-79500000D02*
X161700000Y-81650000D01*
X161700000Y-81650000D02*
X161700000Y-82350000D01*
X161700000Y-82350000D02*
X160550000Y-82350000D01*
D60*
X143550000Y-109300000D02*
X142350000Y-109300000D01*
X142350000Y-109300000D02*
X142200000Y-109150000D01*
X142200000Y-109150000D02*
X142200000Y-107900000D01*
D61*
X169385000Y-72950000D02*
X169385000Y-74415000D01*
X169385000Y-74415000D02*
X169350000Y-74450000D01*
X174890000Y-74530000D02*
X174890000Y-72740000D01*
X174890000Y-72740000D02*
X173450000Y-71300000D01*
X173450000Y-71300000D02*
X170000000Y-71300000D01*
X169385000Y-71915000D02*
X170000000Y-71300000D01*
X169385000Y-72950000D02*
X169385000Y-71915000D01*
X169385000Y-71915000D02*
X169400000Y-71900000D01*
D60*
X169350000Y-74450000D02*
X169400000Y-74400000D01*
X169400000Y-74400000D02*
X169400000Y-71900000D01*
X169400000Y-71900000D02*
X170000000Y-71300000D01*
D61*
X169200000Y-106950000D02*
X170700000Y-106950000D01*
X171050000Y-105300000D02*
X171050000Y-106600000D01*
X171050000Y-106600000D02*
X170700000Y-106950000D01*
X156050000Y-74870000D02*
X156030000Y-74870000D01*
X156030000Y-74870000D02*
X155950000Y-74950000D01*
X155950000Y-74950000D02*
X155950000Y-75850000D01*
X156695000Y-72950000D02*
X156695000Y-74225000D01*
X156695000Y-74225000D02*
X156050000Y-74870000D01*
X166150000Y-74920000D02*
X166200000Y-74970000D01*
X166200000Y-74970000D02*
X166200000Y-75950000D01*
X166845000Y-72950000D02*
X166845000Y-74225000D01*
X166845000Y-74225000D02*
X166150000Y-74920000D01*
X169350000Y-65250000D02*
X168150000Y-65250000D01*
X169385000Y-67550000D02*
X169385000Y-65285000D01*
X169385000Y-65285000D02*
X169350000Y-65250000D01*
X121050000Y-96000000D02*
X121050000Y-97100000D01*
D60*
X117775000Y-98700000D02*
X118550000Y-98700000D01*
X118550000Y-98700000D02*
X119450000Y-97800000D01*
X119450000Y-97800000D02*
X120850000Y-97800000D01*
X120850000Y-97800000D02*
X121050000Y-97600000D01*
X121050000Y-97600000D02*
X121050000Y-97100000D01*
X119450000Y-97200000D02*
X117775000Y-97200000D01*
X173299999Y-117550001D02*
X173600000Y-117250000D01*
X175400000Y-114700000D02*
X173600000Y-116500000D01*
X173600000Y-116500000D02*
X173600000Y-117250000D01*
X175950000Y-114700000D02*
X175400000Y-114700000D01*
X171250000Y-118200000D02*
X171899999Y-117550001D01*
X171250000Y-118400000D02*
X171250000Y-118200000D01*
X171899999Y-117550001D02*
X173299999Y-117550001D01*
D61*
X171550000Y-120000000D02*
X171550000Y-118700000D01*
X171550000Y-118700000D02*
X171250000Y-118400000D01*
D60*
X149100000Y-98500000D02*
X150550000Y-98500000D01*
X150550000Y-98500000D02*
X150650000Y-98600000D01*
X163250000Y-75850000D02*
X163675000Y-75425000D01*
X163675000Y-75425000D02*
X163675000Y-74300000D01*
X163250000Y-76350000D02*
X163250000Y-75850000D01*
X163025000Y-70000000D02*
X163025000Y-68775000D01*
X163025000Y-68775000D02*
X162950000Y-68700000D01*
X150500000Y-98000000D02*
X149100000Y-98000000D01*
X150650000Y-97850000D02*
X150500000Y-98000000D01*
X117775000Y-97700000D02*
X117775000Y-98200000D01*
X133300000Y-94500000D02*
X132175000Y-94500000D01*
X132175000Y-94500000D02*
X131900000Y-94225000D01*
X131900000Y-94225000D02*
X130925000Y-94225000D01*
X130925000Y-94225000D02*
X130650000Y-94500000D01*
X130650000Y-94500000D02*
X123050000Y-94500000D01*
X123050000Y-94500000D02*
X122150000Y-93600000D01*
X117050000Y-96450000D02*
X117050000Y-96550000D01*
X122150000Y-93600000D02*
X119900000Y-93600000D01*
X119900000Y-93600000D02*
X117050000Y-96450000D01*
X133300000Y-103000000D02*
X131450000Y-103000000D01*
X131450000Y-103000000D02*
X131000000Y-102550000D01*
X89900000Y-90400000D02*
X90375000Y-90400000D01*
X90375000Y-90400000D02*
X90575000Y-90200000D01*
X90575000Y-90200000D02*
X90650000Y-90200000D01*
D61*
X155150000Y-69350000D02*
X153750000Y-69350000D01*
X157700000Y-69350000D02*
X155150000Y-69350000D01*
X157965000Y-67550000D02*
X157965000Y-69085000D01*
X157965000Y-69085000D02*
X157700000Y-69350000D01*
D60*
X151250000Y-93000000D02*
X151250000Y-93400000D01*
X150150000Y-94500000D02*
X149100000Y-94500000D01*
X151250000Y-93400000D02*
X150150000Y-94500000D01*
D61*
X157965000Y-67550000D02*
X157965000Y-68025000D01*
X157965000Y-67550000D02*
X157965000Y-66565000D01*
X157965000Y-66565000D02*
X156450000Y-65050000D01*
D60*
X153575000Y-94700000D02*
X151000000Y-94700000D01*
X151000000Y-94700000D02*
X150700000Y-95000000D01*
X150700000Y-95000000D02*
X149100000Y-95000000D01*
D61*
X168115000Y-66715000D02*
X167550000Y-66150000D01*
X167550000Y-66150000D02*
X166650000Y-65250000D01*
D60*
X168150000Y-67585000D02*
X168115000Y-67550000D01*
D61*
X168115000Y-67550000D02*
X168115000Y-66715000D01*
X168115000Y-67550000D02*
X168115000Y-67075000D01*
D60*
X150000000Y-85300000D02*
X150000000Y-82700000D01*
X150000000Y-93100000D02*
X149100000Y-94000000D01*
X147200000Y-92100000D02*
X147200000Y-91500000D01*
X147200000Y-91500000D02*
X150200000Y-88500000D01*
X150200000Y-88500000D02*
X151750000Y-88500000D01*
X151750000Y-88500000D02*
X153000000Y-87250000D01*
X153000000Y-87250000D02*
X153000000Y-86100000D01*
X145700000Y-88550000D02*
X145700000Y-92100000D01*
X149500000Y-90300000D02*
X155500000Y-90300000D01*
X149500000Y-90300000D02*
X149250000Y-90300000D01*
X155500000Y-90300000D02*
X156100000Y-89700000D01*
X156100000Y-89700000D02*
X157400000Y-89700000D01*
X145200000Y-90225000D02*
X145200000Y-92100000D01*
X144825000Y-89850000D02*
X145200000Y-90225000D01*
X154325000Y-108050000D02*
X154875000Y-108050000D01*
D61*
X154300000Y-109475000D02*
X154300000Y-110875000D01*
X154300000Y-110875000D02*
X154325000Y-110900000D01*
X154325000Y-108050000D02*
X154325000Y-110900000D01*
D60*
X133300000Y-95000000D02*
X131600000Y-95000000D01*
X131600000Y-95000000D02*
X131500000Y-94900000D01*
X88075000Y-78975000D02*
X88075000Y-79700000D01*
X136700000Y-107900000D02*
X136700000Y-109800000D01*
X136700000Y-109800000D02*
X136500000Y-110000000D01*
X122200000Y-106550000D02*
X122200000Y-104540000D01*
X122200000Y-104540000D02*
X122160000Y-104500000D01*
X135000000Y-89800000D02*
X136200000Y-91000000D01*
X136200000Y-91000000D02*
X136200000Y-92100000D01*
X115800000Y-90800000D02*
X115790000Y-90790000D01*
X115790000Y-90790000D02*
X115790000Y-89050000D01*
X115865000Y-88975000D02*
X115790000Y-89050000D01*
X143975000Y-89850000D02*
X144700000Y-90575000D01*
X144700000Y-90575000D02*
X144700000Y-92100000D01*
X169150000Y-119975000D02*
X169150000Y-121100000D01*
D61*
X171550000Y-122200000D02*
X170250000Y-122200000D01*
X170250000Y-122200000D02*
X169150000Y-121100000D01*
D60*
X173450000Y-120000000D02*
X173450000Y-120900000D01*
X173450000Y-120900000D02*
X173250000Y-121100000D01*
X173250000Y-121100000D02*
X172700000Y-121100000D01*
X172700000Y-121100000D02*
X172450000Y-121350000D01*
X172450000Y-121350000D02*
X172450000Y-121850000D01*
X172450000Y-121850000D02*
X172100000Y-122200000D01*
X172100000Y-122200000D02*
X171550000Y-122200000D01*
X169150000Y-121100000D02*
X169200000Y-121150000D01*
X164200000Y-106650000D02*
X163400000Y-106650000D01*
X163400000Y-106650000D02*
X163125000Y-106925000D01*
X163125000Y-106925000D02*
X152175000Y-106925000D01*
X152175000Y-106925000D02*
X151250000Y-106000000D01*
X151250000Y-106000000D02*
X149100000Y-106000000D01*
D61*
X127550000Y-96950000D02*
X127550000Y-99000000D01*
X127550000Y-99000000D02*
X127600000Y-99050000D01*
D60*
X129200000Y-99050000D02*
X131650000Y-101500000D01*
X131650000Y-101500000D02*
X133300000Y-101500000D01*
X127600000Y-99050000D02*
X129200000Y-99050000D01*
D61*
X128820000Y-96950000D02*
X130300000Y-96950000D01*
X131100000Y-97600000D02*
X130950000Y-97600000D01*
X130950000Y-97600000D02*
X130300000Y-96950000D01*
D60*
X132100000Y-101000000D02*
X131100000Y-100000000D01*
X131100000Y-100000000D02*
X131100000Y-99100000D01*
X133300000Y-101000000D02*
X132100000Y-101000000D01*
X90500000Y-89200000D02*
X90100000Y-88800000D01*
X90100000Y-88800000D02*
X89900000Y-88800000D01*
X90650000Y-89200000D02*
X90500000Y-89200000D01*
X92850000Y-88900000D02*
X93050000Y-88900000D01*
X93050000Y-88900000D02*
X93500000Y-88450000D01*
X90650000Y-89700000D02*
X90000000Y-89700000D01*
X90000000Y-89700000D02*
X89900000Y-89600000D01*
X92850000Y-89700000D02*
X93500000Y-90350000D01*
X133300000Y-103500000D02*
X131100000Y-103500000D01*
X131100000Y-103500000D02*
X131000000Y-103400000D01*
X97500000Y-93100000D02*
X97325000Y-92925000D01*
X97325000Y-92925000D02*
X97325000Y-90500000D01*
X97325000Y-90500000D02*
X96000000Y-89175000D01*
X96000000Y-89175000D02*
X95300000Y-89175000D01*
X95300000Y-89175000D02*
X95000000Y-88875000D01*
X95000000Y-88875000D02*
X95000000Y-88450000D01*
X95000000Y-88450000D02*
X95050000Y-88450000D01*
X133300000Y-104000000D02*
X131250000Y-104000000D01*
X131250000Y-104000000D02*
X131000000Y-104250000D01*
X95275000Y-89650000D02*
X95000000Y-89925000D01*
X96700000Y-93150000D02*
X96700000Y-90550000D01*
X96700000Y-90550000D02*
X95800000Y-89650000D01*
X95800000Y-89650000D02*
X95275000Y-89650000D01*
X95000000Y-89925000D02*
X95000000Y-90350000D01*
D63*
G36*
X106848000Y-108127606D02*
X106848000Y-118022394D01*
X105497394Y-119373000D01*
X101080406Y-119373000D01*
X101470004Y-118984082D01*
X101734699Y-118346627D01*
X101735099Y-117887661D01*
X101809673Y-118067698D01*
X101988301Y-118246327D01*
X102221690Y-118343000D01*
X102824250Y-118343000D01*
X102983000Y-118184250D01*
X102983000Y-117327000D01*
X103237000Y-117327000D01*
X103237000Y-118184250D01*
X103395750Y-118343000D01*
X103998310Y-118343000D01*
X104231699Y-118246327D01*
X104410327Y-118067698D01*
X104507000Y-117834309D01*
X104507000Y-117485750D01*
X104348250Y-117327000D01*
X103237000Y-117327000D01*
X102983000Y-117327000D01*
X101871750Y-117327000D01*
X101713000Y-117485750D01*
X101713000Y-117602429D01*
X101471719Y-117018485D01*
X100984082Y-116529996D01*
X100346627Y-116265301D01*
X99656401Y-116264699D01*
X99018485Y-116528281D01*
X98529996Y-117015918D01*
X98497876Y-117093270D01*
X97620356Y-116215750D01*
X101713000Y-116215750D01*
X101713000Y-116564309D01*
X101713286Y-116565000D01*
X101713000Y-116565691D01*
X101713000Y-116914250D01*
X101871750Y-117073000D01*
X102983000Y-117073000D01*
X102983000Y-116057000D01*
X103237000Y-116057000D01*
X103237000Y-117073000D01*
X104348250Y-117073000D01*
X104507000Y-116914250D01*
X104507000Y-116565691D01*
X104506714Y-116565000D01*
X104507000Y-116564309D01*
X104507000Y-116215750D01*
X104348250Y-116057000D01*
X103237000Y-116057000D01*
X102983000Y-116057000D01*
X101871750Y-116057000D01*
X101713000Y-116215750D01*
X97620356Y-116215750D01*
X97027000Y-115622394D01*
X97027000Y-113860750D01*
X97715000Y-113860750D01*
X97715000Y-114226310D01*
X97811673Y-114459699D01*
X97990302Y-114638327D01*
X98223691Y-114735000D01*
X99164250Y-114735000D01*
X99323000Y-114576250D01*
X99323000Y-113702000D01*
X99577000Y-113702000D01*
X99577000Y-114576250D01*
X99735750Y-114735000D01*
X100676309Y-114735000D01*
X100909698Y-114638327D01*
X101088327Y-114459699D01*
X101185000Y-114226310D01*
X101185000Y-114152000D01*
X101700560Y-114152000D01*
X101700560Y-115168000D01*
X101720967Y-115276456D01*
X101713000Y-115295691D01*
X101713000Y-115644250D01*
X101871750Y-115803000D01*
X102286569Y-115803000D01*
X102348000Y-115815440D01*
X103872000Y-115815440D01*
X103938113Y-115803000D01*
X104348250Y-115803000D01*
X104507000Y-115644250D01*
X104507000Y-115295691D01*
X104497988Y-115273934D01*
X104519440Y-115168000D01*
X104519440Y-114152000D01*
X104499033Y-114043544D01*
X104507000Y-114024309D01*
X104507000Y-113675750D01*
X104348250Y-113517000D01*
X103933431Y-113517000D01*
X103872000Y-113504560D01*
X102348000Y-113504560D01*
X102281887Y-113517000D01*
X101871750Y-113517000D01*
X101713000Y-113675750D01*
X101713000Y-114024309D01*
X101722012Y-114046066D01*
X101700560Y-114152000D01*
X101185000Y-114152000D01*
X101185000Y-113860750D01*
X101026250Y-113702000D01*
X99577000Y-113702000D01*
X99323000Y-113702000D01*
X97873750Y-113702000D01*
X97715000Y-113860750D01*
X97027000Y-113860750D01*
X97027000Y-113125025D01*
X97040302Y-113138327D01*
X97273691Y-113235000D01*
X97639250Y-113235000D01*
X97715000Y-113159250D01*
X97715000Y-113289250D01*
X97873750Y-113448000D01*
X99323000Y-113448000D01*
X99323000Y-113428000D01*
X99577000Y-113428000D01*
X99577000Y-113448000D01*
X101026250Y-113448000D01*
X101122250Y-113352000D01*
X103600000Y-113352000D01*
X103646159Y-113343315D01*
X103688553Y-113316035D01*
X103716290Y-113275440D01*
X103872000Y-113275440D01*
X103938113Y-113263000D01*
X104348250Y-113263000D01*
X104507000Y-113104250D01*
X104507000Y-112755691D01*
X104497988Y-112733934D01*
X104519440Y-112628000D01*
X104519440Y-111612000D01*
X104499033Y-111503544D01*
X104507000Y-111484309D01*
X104507000Y-111135750D01*
X104348250Y-110977000D01*
X103933431Y-110977000D01*
X103872000Y-110964560D01*
X103720332Y-110964560D01*
X103718315Y-110953841D01*
X103691035Y-110911447D01*
X103649410Y-110883006D01*
X103600000Y-110873000D01*
X101147250Y-110873000D01*
X101026250Y-110752000D01*
X99577000Y-110752000D01*
X99577000Y-110772000D01*
X99323000Y-110772000D01*
X99323000Y-110752000D01*
X97873750Y-110752000D01*
X97715000Y-110910750D01*
X97715000Y-111040750D01*
X97639250Y-110965000D01*
X97612409Y-110965000D01*
X97612409Y-109973690D01*
X97715000Y-109973690D01*
X97715000Y-110339250D01*
X97873750Y-110498000D01*
X99323000Y-110498000D01*
X99323000Y-109623750D01*
X99577000Y-109623750D01*
X99577000Y-110498000D01*
X101026250Y-110498000D01*
X101185000Y-110339250D01*
X101185000Y-109973690D01*
X101140290Y-109865750D01*
X101713000Y-109865750D01*
X101713000Y-110214309D01*
X101713286Y-110215000D01*
X101713000Y-110215691D01*
X101713000Y-110564250D01*
X101871750Y-110723000D01*
X102983000Y-110723000D01*
X102983000Y-109707000D01*
X103237000Y-109707000D01*
X103237000Y-110723000D01*
X104348250Y-110723000D01*
X104507000Y-110564250D01*
X104507000Y-110215691D01*
X104506714Y-110215000D01*
X104507000Y-110214309D01*
X104507000Y-109865750D01*
X104348250Y-109707000D01*
X103237000Y-109707000D01*
X102983000Y-109707000D01*
X101871750Y-109707000D01*
X101713000Y-109865750D01*
X101140290Y-109865750D01*
X101088327Y-109740301D01*
X100909698Y-109561673D01*
X100676309Y-109465000D01*
X99735750Y-109465000D01*
X99577000Y-109623750D01*
X99323000Y-109623750D01*
X99164250Y-109465000D01*
X98223691Y-109465000D01*
X97990302Y-109561673D01*
X97811673Y-109740301D01*
X97715000Y-109973690D01*
X97612409Y-109973690D01*
X97612409Y-108945691D01*
X101713000Y-108945691D01*
X101713000Y-109294250D01*
X101871750Y-109453000D01*
X102983000Y-109453000D01*
X102983000Y-108595750D01*
X103237000Y-108595750D01*
X103237000Y-109453000D01*
X104348250Y-109453000D01*
X104507000Y-109294250D01*
X104507000Y-108945691D01*
X104410327Y-108712302D01*
X104231699Y-108533673D01*
X103998310Y-108437000D01*
X103395750Y-108437000D01*
X103237000Y-108595750D01*
X102983000Y-108595750D01*
X102824250Y-108437000D01*
X102221690Y-108437000D01*
X101988301Y-108533673D01*
X101809673Y-108712302D01*
X101713000Y-108945691D01*
X97612409Y-108945691D01*
X97612409Y-106177000D01*
X104897394Y-106177000D01*
X106848000Y-108127606D01*
X106848000Y-108127606D01*
G37*
X106848000Y-108127606D02*
X106848000Y-118022394D01*
X105497394Y-119373000D01*
X101080406Y-119373000D01*
X101470004Y-118984082D01*
X101734699Y-118346627D01*
X101735099Y-117887661D01*
X101809673Y-118067698D01*
X101988301Y-118246327D01*
X102221690Y-118343000D01*
X102824250Y-118343000D01*
X102983000Y-118184250D01*
X102983000Y-117327000D01*
X103237000Y-117327000D01*
X103237000Y-118184250D01*
X103395750Y-118343000D01*
X103998310Y-118343000D01*
X104231699Y-118246327D01*
X104410327Y-118067698D01*
X104507000Y-117834309D01*
X104507000Y-117485750D01*
X104348250Y-117327000D01*
X103237000Y-117327000D01*
X102983000Y-117327000D01*
X101871750Y-117327000D01*
X101713000Y-117485750D01*
X101713000Y-117602429D01*
X101471719Y-117018485D01*
X100984082Y-116529996D01*
X100346627Y-116265301D01*
X99656401Y-116264699D01*
X99018485Y-116528281D01*
X98529996Y-117015918D01*
X98497876Y-117093270D01*
X97620356Y-116215750D01*
X101713000Y-116215750D01*
X101713000Y-116564309D01*
X101713286Y-116565000D01*
X101713000Y-116565691D01*
X101713000Y-116914250D01*
X101871750Y-117073000D01*
X102983000Y-117073000D01*
X102983000Y-116057000D01*
X103237000Y-116057000D01*
X103237000Y-117073000D01*
X104348250Y-117073000D01*
X104507000Y-116914250D01*
X104507000Y-116565691D01*
X104506714Y-116565000D01*
X104507000Y-116564309D01*
X104507000Y-116215750D01*
X104348250Y-116057000D01*
X103237000Y-116057000D01*
X102983000Y-116057000D01*
X101871750Y-116057000D01*
X101713000Y-116215750D01*
X97620356Y-116215750D01*
X97027000Y-115622394D01*
X97027000Y-113860750D01*
X97715000Y-113860750D01*
X97715000Y-114226310D01*
X97811673Y-114459699D01*
X97990302Y-114638327D01*
X98223691Y-114735000D01*
X99164250Y-114735000D01*
X99323000Y-114576250D01*
X99323000Y-113702000D01*
X99577000Y-113702000D01*
X99577000Y-114576250D01*
X99735750Y-114735000D01*
X100676309Y-114735000D01*
X100909698Y-114638327D01*
X101088327Y-114459699D01*
X101185000Y-114226310D01*
X101185000Y-114152000D01*
X101700560Y-114152000D01*
X101700560Y-115168000D01*
X101720967Y-115276456D01*
X101713000Y-115295691D01*
X101713000Y-115644250D01*
X101871750Y-115803000D01*
X102286569Y-115803000D01*
X102348000Y-115815440D01*
X103872000Y-115815440D01*
X103938113Y-115803000D01*
X104348250Y-115803000D01*
X104507000Y-115644250D01*
X104507000Y-115295691D01*
X104497988Y-115273934D01*
X104519440Y-115168000D01*
X104519440Y-114152000D01*
X104499033Y-114043544D01*
X104507000Y-114024309D01*
X104507000Y-113675750D01*
X104348250Y-113517000D01*
X103933431Y-113517000D01*
X103872000Y-113504560D01*
X102348000Y-113504560D01*
X102281887Y-113517000D01*
X101871750Y-113517000D01*
X101713000Y-113675750D01*
X101713000Y-114024309D01*
X101722012Y-114046066D01*
X101700560Y-114152000D01*
X101185000Y-114152000D01*
X101185000Y-113860750D01*
X101026250Y-113702000D01*
X99577000Y-113702000D01*
X99323000Y-113702000D01*
X97873750Y-113702000D01*
X97715000Y-113860750D01*
X97027000Y-113860750D01*
X97027000Y-113125025D01*
X97040302Y-113138327D01*
X97273691Y-113235000D01*
X97639250Y-113235000D01*
X97715000Y-113159250D01*
X97715000Y-113289250D01*
X97873750Y-113448000D01*
X99323000Y-113448000D01*
X99323000Y-113428000D01*
X99577000Y-113428000D01*
X99577000Y-113448000D01*
X101026250Y-113448000D01*
X101122250Y-113352000D01*
X103600000Y-113352000D01*
X103646159Y-113343315D01*
X103688553Y-113316035D01*
X103716290Y-113275440D01*
X103872000Y-113275440D01*
X103938113Y-113263000D01*
X104348250Y-113263000D01*
X104507000Y-113104250D01*
X104507000Y-112755691D01*
X104497988Y-112733934D01*
X104519440Y-112628000D01*
X104519440Y-111612000D01*
X104499033Y-111503544D01*
X104507000Y-111484309D01*
X104507000Y-111135750D01*
X104348250Y-110977000D01*
X103933431Y-110977000D01*
X103872000Y-110964560D01*
X103720332Y-110964560D01*
X103718315Y-110953841D01*
X103691035Y-110911447D01*
X103649410Y-110883006D01*
X103600000Y-110873000D01*
X101147250Y-110873000D01*
X101026250Y-110752000D01*
X99577000Y-110752000D01*
X99577000Y-110772000D01*
X99323000Y-110772000D01*
X99323000Y-110752000D01*
X97873750Y-110752000D01*
X97715000Y-110910750D01*
X97715000Y-111040750D01*
X97639250Y-110965000D01*
X97612409Y-110965000D01*
X97612409Y-109973690D01*
X97715000Y-109973690D01*
X97715000Y-110339250D01*
X97873750Y-110498000D01*
X99323000Y-110498000D01*
X99323000Y-109623750D01*
X99577000Y-109623750D01*
X99577000Y-110498000D01*
X101026250Y-110498000D01*
X101185000Y-110339250D01*
X101185000Y-109973690D01*
X101140290Y-109865750D01*
X101713000Y-109865750D01*
X101713000Y-110214309D01*
X101713286Y-110215000D01*
X101713000Y-110215691D01*
X101713000Y-110564250D01*
X101871750Y-110723000D01*
X102983000Y-110723000D01*
X102983000Y-109707000D01*
X103237000Y-109707000D01*
X103237000Y-110723000D01*
X104348250Y-110723000D01*
X104507000Y-110564250D01*
X104507000Y-110215691D01*
X104506714Y-110215000D01*
X104507000Y-110214309D01*
X104507000Y-109865750D01*
X104348250Y-109707000D01*
X103237000Y-109707000D01*
X102983000Y-109707000D01*
X101871750Y-109707000D01*
X101713000Y-109865750D01*
X101140290Y-109865750D01*
X101088327Y-109740301D01*
X100909698Y-109561673D01*
X100676309Y-109465000D01*
X99735750Y-109465000D01*
X99577000Y-109623750D01*
X99323000Y-109623750D01*
X99164250Y-109465000D01*
X98223691Y-109465000D01*
X97990302Y-109561673D01*
X97811673Y-109740301D01*
X97715000Y-109973690D01*
X97612409Y-109973690D01*
X97612409Y-108945691D01*
X101713000Y-108945691D01*
X101713000Y-109294250D01*
X101871750Y-109453000D01*
X102983000Y-109453000D01*
X102983000Y-108595750D01*
X103237000Y-108595750D01*
X103237000Y-109453000D01*
X104348250Y-109453000D01*
X104507000Y-109294250D01*
X104507000Y-108945691D01*
X104410327Y-108712302D01*
X104231699Y-108533673D01*
X103998310Y-108437000D01*
X103395750Y-108437000D01*
X103237000Y-108595750D01*
X102983000Y-108595750D01*
X102824250Y-108437000D01*
X102221690Y-108437000D01*
X101988301Y-108533673D01*
X101809673Y-108712302D01*
X101713000Y-108945691D01*
X97612409Y-108945691D01*
X97612409Y-106177000D01*
X104897394Y-106177000D01*
X106848000Y-108127606D01*
G36*
X98052000Y-111973000D02*
X98072000Y-111973000D01*
X98072000Y-112227000D01*
X98052000Y-112227000D01*
X98052000Y-112247000D01*
X97798000Y-112247000D01*
X97798000Y-112227000D01*
X97778000Y-112227000D01*
X97778000Y-111973000D01*
X97798000Y-111973000D01*
X97798000Y-111953000D01*
X98052000Y-111953000D01*
X98052000Y-111973000D01*
X98052000Y-111973000D01*
G37*
X98052000Y-111973000D02*
X98072000Y-111973000D01*
X98072000Y-112227000D01*
X98052000Y-112227000D01*
X98052000Y-112247000D01*
X97798000Y-112247000D01*
X97798000Y-112227000D01*
X97778000Y-112227000D01*
X97778000Y-111973000D01*
X97798000Y-111973000D01*
X97798000Y-111953000D01*
X98052000Y-111953000D01*
X98052000Y-111973000D01*
D10*
G36*
X115621000Y-96111016D02*
X115596000Y-96236698D01*
X115596000Y-96713302D01*
X115601320Y-96740045D01*
X115400000Y-96740045D01*
X115287345Y-96761243D01*
X115183877Y-96827822D01*
X115114465Y-96929410D01*
X115090045Y-97050000D01*
X115090045Y-97251320D01*
X115063302Y-97246000D01*
X114586698Y-97246000D01*
X114412960Y-97280559D01*
X114265672Y-97378974D01*
X114167257Y-97526262D01*
X114132698Y-97700000D01*
X114167257Y-97873738D01*
X114218214Y-97950000D01*
X114167257Y-98026262D01*
X114132698Y-98200000D01*
X114167257Y-98373738D01*
X114265672Y-98521026D01*
X114412960Y-98619441D01*
X114586698Y-98654000D01*
X115063302Y-98654000D01*
X115090045Y-98648680D01*
X115090045Y-98850000D01*
X115111243Y-98962655D01*
X115177822Y-99066123D01*
X115279410Y-99135535D01*
X115400000Y-99159955D01*
X115601320Y-99159955D01*
X115596000Y-99186698D01*
X115596000Y-99663302D01*
X115603300Y-99700000D01*
X112645710Y-99700000D01*
X112300000Y-99354290D01*
X112300000Y-97170710D01*
X113445710Y-96025000D01*
X115621000Y-96025000D01*
X115621000Y-96111016D01*
X115621000Y-96111016D01*
G37*
X115621000Y-96111016D02*
X115596000Y-96236698D01*
X115596000Y-96713302D01*
X115601320Y-96740045D01*
X115400000Y-96740045D01*
X115287345Y-96761243D01*
X115183877Y-96827822D01*
X115114465Y-96929410D01*
X115090045Y-97050000D01*
X115090045Y-97251320D01*
X115063302Y-97246000D01*
X114586698Y-97246000D01*
X114412960Y-97280559D01*
X114265672Y-97378974D01*
X114167257Y-97526262D01*
X114132698Y-97700000D01*
X114167257Y-97873738D01*
X114218214Y-97950000D01*
X114167257Y-98026262D01*
X114132698Y-98200000D01*
X114167257Y-98373738D01*
X114265672Y-98521026D01*
X114412960Y-98619441D01*
X114586698Y-98654000D01*
X115063302Y-98654000D01*
X115090045Y-98648680D01*
X115090045Y-98850000D01*
X115111243Y-98962655D01*
X115177822Y-99066123D01*
X115279410Y-99135535D01*
X115400000Y-99159955D01*
X115601320Y-99159955D01*
X115596000Y-99186698D01*
X115596000Y-99663302D01*
X115603300Y-99700000D01*
X112645710Y-99700000D01*
X112300000Y-99354290D01*
X112300000Y-97170710D01*
X113445710Y-96025000D01*
X115621000Y-96025000D01*
X115621000Y-96111016D01*
G36*
X119025000Y-100900000D02*
X118075000Y-100900000D01*
X118055547Y-100903939D01*
X118039160Y-100915136D01*
X118028419Y-100931827D01*
X118025000Y-100950000D01*
X118025000Y-102075000D01*
X116423550Y-102075000D01*
X115975000Y-101532019D01*
X115975000Y-100175000D01*
X119025000Y-100175000D01*
X119025000Y-100900000D01*
X119025000Y-100900000D01*
G37*
X119025000Y-100900000D02*
X118075000Y-100900000D01*
X118055547Y-100903939D01*
X118039160Y-100915136D01*
X118028419Y-100931827D01*
X118025000Y-100950000D01*
X118025000Y-102075000D01*
X116423550Y-102075000D01*
X115975000Y-101532019D01*
X115975000Y-100175000D01*
X119025000Y-100175000D01*
X119025000Y-100900000D01*
G36*
X160265045Y-116271743D02*
X160265045Y-116830000D01*
X160286243Y-116942655D01*
X160352822Y-117046123D01*
X160454410Y-117115535D01*
X160575000Y-117139955D01*
X161225000Y-117139955D01*
X161337655Y-117118757D01*
X161441123Y-117052178D01*
X161510535Y-116950590D01*
X161534955Y-116830000D01*
X161534955Y-115850000D01*
X162165045Y-115850000D01*
X162165045Y-116830000D01*
X162186243Y-116942655D01*
X162252822Y-117046123D01*
X162354410Y-117115535D01*
X162475000Y-117139955D01*
X163100000Y-117139955D01*
X163100000Y-122900000D01*
X159720710Y-122900000D01*
X157575000Y-120754290D01*
X157575000Y-116145710D01*
X157870710Y-115850000D01*
X159843302Y-115850000D01*
X160265045Y-116271743D01*
X160265045Y-116271743D01*
G37*
X160265045Y-116271743D02*
X160265045Y-116830000D01*
X160286243Y-116942655D01*
X160352822Y-117046123D01*
X160454410Y-117115535D01*
X160575000Y-117139955D01*
X161225000Y-117139955D01*
X161337655Y-117118757D01*
X161441123Y-117052178D01*
X161510535Y-116950590D01*
X161534955Y-116830000D01*
X161534955Y-115850000D01*
X162165045Y-115850000D01*
X162165045Y-116830000D01*
X162186243Y-116942655D01*
X162252822Y-117046123D01*
X162354410Y-117115535D01*
X162475000Y-117139955D01*
X163100000Y-117139955D01*
X163100000Y-122900000D01*
X159720710Y-122900000D01*
X157575000Y-120754290D01*
X157575000Y-116145710D01*
X157870710Y-115850000D01*
X159843302Y-115850000D01*
X160265045Y-116271743D01*
D63*
G36*
X127373000Y-88973000D02*
X122952606Y-88973000D01*
X121427000Y-87447394D01*
X121427000Y-84727000D01*
X127373000Y-84727000D01*
X127373000Y-88973000D01*
X127373000Y-88973000D01*
G37*
X127373000Y-88973000D02*
X122952606Y-88973000D01*
X121427000Y-87447394D01*
X121427000Y-84727000D01*
X127373000Y-84727000D01*
X127373000Y-88973000D01*
G36*
X129073000Y-82852606D02*
X129073000Y-85673000D01*
X128027000Y-85673000D01*
X128027000Y-84600000D01*
X128016994Y-84550590D01*
X127988553Y-84508965D01*
X127946159Y-84481685D01*
X127900000Y-84473000D01*
X127857104Y-84473000D01*
X127854944Y-84461523D01*
X127773104Y-84334340D01*
X127648230Y-84249017D01*
X127500000Y-84219000D01*
X121427000Y-84219000D01*
X121427000Y-81927000D01*
X128147394Y-81927000D01*
X129073000Y-82852606D01*
X129073000Y-82852606D01*
G37*
X129073000Y-82852606D02*
X129073000Y-85673000D01*
X128027000Y-85673000D01*
X128027000Y-84600000D01*
X128016994Y-84550590D01*
X127988553Y-84508965D01*
X127946159Y-84481685D01*
X127900000Y-84473000D01*
X127857104Y-84473000D01*
X127854944Y-84461523D01*
X127773104Y-84334340D01*
X127648230Y-84249017D01*
X127500000Y-84219000D01*
X121427000Y-84219000D01*
X121427000Y-81927000D01*
X128147394Y-81927000D01*
X129073000Y-82852606D01*
G36*
X165773000Y-109323000D02*
X161950000Y-109323000D01*
X161900590Y-109333006D01*
X161858965Y-109361447D01*
X161831685Y-109403841D01*
X161823000Y-109450000D01*
X161823000Y-109967114D01*
X161767141Y-110048866D01*
X161736536Y-110200000D01*
X161736536Y-110469000D01*
X161111859Y-110469000D01*
X161075000Y-110461536D01*
X160175000Y-110461536D01*
X160033810Y-110488103D01*
X159904135Y-110571546D01*
X159817141Y-110698866D01*
X159786536Y-110850000D01*
X159786536Y-111350000D01*
X159813103Y-111491190D01*
X159833572Y-111523000D01*
X158327000Y-111523000D01*
X158327000Y-110352606D01*
X160702606Y-107977000D01*
X165773000Y-107977000D01*
X165773000Y-109323000D01*
X165773000Y-109323000D01*
G37*
X165773000Y-109323000D02*
X161950000Y-109323000D01*
X161900590Y-109333006D01*
X161858965Y-109361447D01*
X161831685Y-109403841D01*
X161823000Y-109450000D01*
X161823000Y-109967114D01*
X161767141Y-110048866D01*
X161736536Y-110200000D01*
X161736536Y-110469000D01*
X161111859Y-110469000D01*
X161075000Y-110461536D01*
X160175000Y-110461536D01*
X160033810Y-110488103D01*
X159904135Y-110571546D01*
X159817141Y-110698866D01*
X159786536Y-110850000D01*
X159786536Y-111350000D01*
X159813103Y-111491190D01*
X159833572Y-111523000D01*
X158327000Y-111523000D01*
X158327000Y-110352606D01*
X160702606Y-107977000D01*
X165773000Y-107977000D01*
X165773000Y-109323000D01*
G36*
X159623000Y-114773000D02*
X159597921Y-114773000D01*
X159586005Y-114756554D01*
X159542873Y-114730455D01*
X159500000Y-114723000D01*
X157477000Y-114723000D01*
X157477000Y-113427000D01*
X159623000Y-113427000D01*
X159623000Y-114773000D01*
X159623000Y-114773000D01*
G37*
X159623000Y-114773000D02*
X159597921Y-114773000D01*
X159586005Y-114756554D01*
X159542873Y-114730455D01*
X159500000Y-114723000D01*
X157477000Y-114723000D01*
X157477000Y-113427000D01*
X159623000Y-113427000D01*
X159623000Y-114773000D01*
G36*
X170873000Y-117123000D02*
X168327000Y-117123000D01*
X168327000Y-114127000D01*
X170873000Y-114127000D01*
X170873000Y-117123000D01*
X170873000Y-117123000D01*
G37*
X170873000Y-117123000D02*
X168327000Y-117123000D01*
X168327000Y-114127000D01*
X170873000Y-114127000D01*
X170873000Y-117123000D01*
G36*
X170115356Y-101899191D02*
X170125046Y-101948664D01*
X170153221Y-101990468D01*
X170195441Y-102018018D01*
X170242353Y-102027000D01*
X171373000Y-102027000D01*
X171373000Y-103173000D01*
X168652606Y-103173000D01*
X168077000Y-102597394D01*
X168077000Y-100827000D01*
X170122189Y-100827000D01*
X170115356Y-101899191D01*
X170115356Y-101899191D01*
G37*
X170115356Y-101899191D02*
X170125046Y-101948664D01*
X170153221Y-101990468D01*
X170195441Y-102018018D01*
X170242353Y-102027000D01*
X171373000Y-102027000D01*
X171373000Y-103173000D01*
X168652606Y-103173000D01*
X168077000Y-102597394D01*
X168077000Y-100827000D01*
X170122189Y-100827000D01*
X170115356Y-101899191D01*
G36*
X167073000Y-95973000D02*
X165127000Y-95973000D01*
X165127000Y-92627000D01*
X167073000Y-92627000D01*
X167073000Y-95973000D01*
X167073000Y-95973000D01*
G37*
X167073000Y-95973000D02*
X165127000Y-95973000D01*
X165127000Y-92627000D01*
X167073000Y-92627000D01*
X167073000Y-95973000D01*
G36*
X157797867Y-88798000D02*
X157225000Y-88798000D01*
X157175590Y-88808006D01*
X157135197Y-88835197D01*
X157099322Y-88871072D01*
X157008810Y-88888103D01*
X156879135Y-88971546D01*
X156792141Y-89098866D01*
X156772876Y-89194000D01*
X156100000Y-89194000D01*
X155906362Y-89232517D01*
X155742204Y-89342204D01*
X155290408Y-89794000D01*
X152077000Y-89794000D01*
X152077000Y-88878373D01*
X152107796Y-88857796D01*
X152738592Y-88227000D01*
X153850000Y-88227000D01*
X153899410Y-88216994D01*
X153939803Y-88189803D01*
X154402606Y-87727000D01*
X157796749Y-87727000D01*
X157797867Y-88798000D01*
X157797867Y-88798000D01*
G37*
X157797867Y-88798000D02*
X157225000Y-88798000D01*
X157175590Y-88808006D01*
X157135197Y-88835197D01*
X157099322Y-88871072D01*
X157008810Y-88888103D01*
X156879135Y-88971546D01*
X156792141Y-89098866D01*
X156772876Y-89194000D01*
X156100000Y-89194000D01*
X155906362Y-89232517D01*
X155742204Y-89342204D01*
X155290408Y-89794000D01*
X152077000Y-89794000D01*
X152077000Y-88878373D01*
X152107796Y-88857796D01*
X152738592Y-88227000D01*
X153850000Y-88227000D01*
X153899410Y-88216994D01*
X153939803Y-88189803D01*
X154402606Y-87727000D01*
X157796749Y-87727000D01*
X157797867Y-88798000D01*
M02*
