EESchema Schematic File Version 4
LIBS:RadIIS_Mainboard-cache
EELAYER 30 0
EELAYER END
$Descr A4 11693 8268
encoding utf-8
Sheet 9 11
Title ""
Date ""
Rev ""
Comp ""
Comment1 ""
Comment2 ""
Comment3 ""
Comment4 ""
$EndDescr
$Comp
L Device:R R2
U 1 1 5728AC48
P 6200 2650
F 0 "R2" V 6200 2650 50  0000 C CNN
F 1 "86k6 1%" V 6100 2650 50  0000 C CNN
F 2 "Resistor_SMD:R_0603_1608Metric" V 6130 2650 50  0001 C CNN
F 3 "" H 6200 2650 50  0000 C CNN
F 4 "311-86.6KHRCT-ND" H 6200 2650 50  0001 C CNN "Digikey Nr"
F 5 "0.09" H 6200 2650 50  0001 C CNN "Digikey Price"
	1    6200 2650
	0    1    1    0   
$EndComp
$Comp
L Device:R R1
U 1 1 5728AC49
P 6200 2350
F 0 "R1" V 6200 2350 50  0000 C CNN
F 1 "24k9 1%" V 6100 2350 50  0000 C CNN
F 2 "Resistor_SMD:R_0603_1608Metric" V 6130 2350 50  0001 C CNN
F 3 "" H 6200 2350 50  0000 C CNN
F 4 "311-24.9KHRCT-ND" H 6200 2350 50  0001 C CNN "Digikey Nr"
F 5 "0.09" H 6200 2350 50  0001 C CNN "Digikey Price"
	1    6200 2350
	0    1    1    0   
$EndComp
$Comp
L Device:C C3
U 1 1 5728AC5B
P 6450 3200
F 0 "C3" H 6475 3300 50  0000 L CNN
F 1 "100nF" H 6475 3100 50  0000 L CNN
F 2 "Capacitor_SMD:C_0603_1608Metric" H 6488 3050 50  0001 C CNN
F 3 "" H 6450 3200 50  0000 C CNN
F 4 "1276-1000-1-ND " H 6450 3200 50  0001 C CNN "Digikey Nr"
F 5 "0.09" H 6450 3200 50  0001 C CNN "Digikey Price"
	1    6450 3200
	1    0    0    -1  
$EndComp
Text HLabel 1800 3100 0    61   Input ~ 0
VBat_In
Text HLabel 1800 3400 0    61   Input ~ 0
GND_In
Text HLabel 5950 2650 0    61   Input ~ 0
Biasreg_In_a
Text HLabel 5950 2350 0    61   Input ~ 0
2.048_Out
Text HLabel 8750 2750 2    61   Input ~ 0
Bias_Out
$Comp
L Device:C C1
U 1 1 57AD5C21
P 2000 3250
F 0 "C1" H 2025 3350 50  0000 L CNN
F 1 "4.7µF 16V" H 1500 3250 50  0000 L CNN
F 2 "Capacitor_SMD:C_0805_2012Metric" H 2038 3100 50  0001 C CNN
F 3 "" H 2000 3250 50  0000 C CNN
F 4 "1276-1065-1-ND" H 2000 3250 50  0001 C CNN "Digikey Nr"
F 5 "0.15" H 2000 3250 50  0001 C CNN "Digikey Price"
	1    2000 3250
	1    0    0    -1  
$EndComp
$Comp
L RadIIS_Mainboard:MAX5026 U1
U 1 1 57AD5E68
P 2700 3400
F 0 "U1" H 2700 3850 60  0000 C CNN
F 1 "MAX5026" H 2800 2950 60  0000 C CNN
F 2 "Package_TO_SOT_SMD:SOT-23-6" H 2700 3450 60  0001 C CNN
F 3 "https://datasheets.maximintegrated.com/en/ds/MAX5025-MAX5028.pdf" H 2700 3450 60  0001 C CNN
F 4 "MAX5026EUT+TCT-ND" H 2700 3400 50  0001 C CNN "Digikey Nr"
F 5 "0.97" H 2700 3400 50  0001 C CNN "Digikey Price"
	1    2700 3400
	1    0    0    -1  
$EndComp
$Comp
L Device:D_Schottky D2
U 1 1 57AD6094
P 3550 3100
F 0 "D2" H 3550 3200 50  0000 C CNN
F 1 "ZHCS500" H 3550 3000 50  0000 C CNN
F 2 "Diode_SMD:D_SOT-23_ANK" H 3550 3100 50  0001 C CNN
F 3 "https://www.diodes.com/assets/Datasheets/ZHCS500.pdf" H 3550 3100 50  0001 C CNN
F 4 "ZHCS500CT-ND" H 3550 3100 50  0001 C CNN "Digikey Nr"
F 5 "0.43" H 3550 3100 50  0001 C CNN "Digikey Price"
	1    3550 3100
	-1   0    0    1   
$EndComp
$Comp
L Device:C C2
U 1 1 57AD68EA
P 4200 3700
F 0 "C2" H 4225 3800 50  0000 L CNN
F 1 "1.0µF 50V" H 4225 3600 50  0000 L CNN
F 2 "Capacitor_SMD:C_0805_2012Metric" H 4238 3550 50  0001 C CNN
F 3 "" H 4200 3700 50  0000 C CNN
F 4 "1276-6470-1-ND" H 4200 3700 50  0001 C CNN "Digikey Nr"
F 5 "0.12" H 4200 3700 50  0001 C CNN "Digikey Price"
	1    4200 3700
	1    0    0    -1  
$EndComp
$Comp
L Device:R R19
U 1 1 57AD693F
P 4500 3100
F 0 "R19" V 4580 3100 50  0000 C CNN
F 1 "100" V 4500 3100 50  0000 C CNN
F 2 "Resistor_SMD:R_0603_1608Metric" V 4430 3100 50  0001 C CNN
F 3 "" H 4500 3100 50  0000 C CNN
F 4 "311-100HRCT-ND" H 4500 3100 50  0001 C CNN "Digikey Nr"
F 5 "0.09" H 4500 3100 50  0001 C CNN "Digikey Price"
	1    4500 3100
	0    1    1    0   
$EndComp
$Comp
L Device:C C19
U 1 1 57AD69AA
P 4850 3700
F 0 "C19" H 4875 3800 50  0000 L CNN
F 1 "1.0µF 50V" H 4875 3600 50  0000 L CNN
F 2 "Capacitor_SMD:C_0805_2012Metric" H 4888 3550 50  0001 C CNN
F 3 "" H 4850 3700 50  0000 C CNN
F 4 "1276-6470-1-ND" H 4850 3700 50  0001 C CNN "Digikey Nr"
F 5 "0.12" H 4850 3700 50  0001 C CNN "Digikey Price"
	1    4850 3700
	1    0    0    -1  
$EndComp
$Comp
L Device:R R17
U 1 1 57AD6A11
P 3850 3400
F 0 "R17" V 3850 3400 50  0000 C CNN
F 1 "150k 1%" V 3750 3400 50  0000 C CNN
F 2 "Resistor_SMD:R_0603_1608Metric" V 3780 3400 50  0001 C CNN
F 3 "" H 3850 3400 50  0000 C CNN
F 4 "311-150KHRCT-ND" H 3850 3400 50  0001 C CNN "Digikey Nr"
F 5 "0.09" H 3850 3400 50  0001 C CNN "Digikey Price"
	1    3850 3400
	1    0    0    -1  
$EndComp
$Comp
L Device:R R18
U 1 1 57AD6AA6
P 3850 4000
F 0 "R18" V 3850 4000 50  0000 C CNN
F 1 "6k04 1%" V 3750 4000 50  0000 C CNN
F 2 "Resistor_SMD:R_0603_1608Metric" V 3780 4000 50  0001 C CNN
F 3 "" H 3850 4000 50  0000 C CNN
F 4 "311-150KHRCT-ND" H 3850 4000 50  0001 C CNN "Digikey Nr"
F 5 "0.09" H 3850 4000 50  0001 C CNN "Digikey Price"
	1    3850 4000
	1    0    0    -1  
$EndComp
Text HLabel 3250 3400 2    61   Input ~ 0
GND_In
Text HLabel 2150 3700 0    60   Input ~ 0
~SHDN
Wire Wire Line
	6350 2650 6450 2650
Connection ~ 6450 2650
Connection ~ 8100 2750
Wire Wire Line
	1800 3100 2000 3100
Connection ~ 2000 3100
Wire Wire Line
	1800 3400 2000 3400
Connection ~ 2000 3400
Wire Wire Line
	2000 3100 2000 2700
Wire Wire Line
	3300 2700 3300 3100
Wire Wire Line
	3200 3100 3300 3100
Connection ~ 3300 3100
Wire Wire Line
	3850 3550 3850 3700
Connection ~ 3850 3700
Wire Wire Line
	3850 4250 4200 4250
Connection ~ 4200 4250
Wire Wire Line
	4850 2150 4850 3100
Wire Wire Line
	6050 2350 6000 2350
Wire Wire Line
	5950 2650 6000 2650
Wire Wire Line
	4850 2150 7050 2150
Wire Wire Line
	4650 3100 4850 3100
Text HLabel 8750 2300 2    60   Input ~ 0
Ext_Bias
$Comp
L Device:R R46
U 1 1 58B1B772
P 8500 2450
F 0 "R46" V 8500 2450 50  0000 C CNN
F 1 "NA/0" V 8400 2450 50  0000 C CNN
F 2 "Resistor_SMD:R_0603_1608Metric" V 8430 2450 50  0001 C CNN
F 3 "" H 8500 2450 50  0000 C CNN
F 4 "311-0.0GRCT-ND" H 8500 2450 50  0001 C CNN "Digikey Nr"
F 5 "0.09" H 8500 2450 50  0001 C CNN "Digikey Price"
	1    8500 2450
	0    1    1    0   
$EndComp
$Comp
L Device:R R45
U 1 1 58B1B7CF
P 8500 2150
F 0 "R45" V 8500 2150 50  0000 C CNN
F 1 "0/NA" V 8400 2150 50  0000 C CNN
F 2 "Resistor_SMD:R_0603_1608Metric" V 8430 2150 50  0001 C CNN
F 3 "" H 8500 2150 50  0000 C CNN
F 4 "311-0.0GRCT-ND" H 8500 2150 50  0001 C CNN "Digikey Nr"
F 5 "0.09" H 8500 2150 50  0001 C CNN "Digikey Price"
	1    8500 2150
	0    1    1    0   
$EndComp
Wire Wire Line
	8100 2850 8100 2750
Wire Wire Line
	8100 2450 8350 2450
Text Notes 8250 1900 0    60   ~ 0
Choose 31V or reg. 25-30V\nfor the ext. Bias
$Comp
L Connector:TestPoint W24
U 1 1 58B575D9
P 4850 2050
F 0 "W24" H 4850 2320 50  0000 C CNN
F 1 "TEST_1P" H 4850 2250 50  0000 C CNN
F 2 "Socket_Strips:Socket_Strip_Straight_1x01_Pitch1.27mm" H 5050 2050 50  0001 C CNN
F 3 "" H 5050 2050 50  0001 C CNN
F 4 "NA" H 4850 2050 50  0001 C CNN "Digikey Nr"
	1    4850 2050
	1    0    0    -1  
$EndComp
$Comp
L Connector:TestPoint W25
U 1 1 58B576AB
P 7850 2550
F 0 "W25" H 7850 2820 50  0000 C CNN
F 1 "TEST_1P" H 7850 2750 50  0000 C CNN
F 2 "Socket_Strips:Socket_Strip_Straight_1x01_Pitch1.27mm" H 8050 2550 50  0001 C CNN
F 3 "" H 8050 2550 50  0001 C CNN
F 4 "NA" H 7850 2550 50  0001 C CNN "Digikey Nr"
	1    7850 2550
	1    0    0    -1  
$EndComp
Text HLabel 4000 4450 2    61   Input ~ 0
GND_In
Wire Wire Line
	2150 3700 2200 3700
$Bitmap
Pos 6650 1750
Scale 1.000000
Data
89 50 4E 47 0D 0A 1A 0A 00 00 00 0D 49 48 44 52 00 00 02 A4 00 00 00 4D 08 03 00 00 00 47 4C 86 
F8 00 00 00 03 73 42 49 54 08 08 08 DB E1 4F E0 00 00 00 30 50 4C 54 45 02 00 00 EE EE EE 44 44 
44 22 22 22 54 54 54 32 32 32 10 10 10 66 66 66 DC DC DC 00 00 00 CC CC CC AA AA AA 88 88 88 98 
98 98 76 76 76 BA BA BA D1 2A D1 C6 00 00 00 01 74 52 4E 53 00 40 E6 D8 66 00 00 0B 70 49 44 41 
54 78 9C ED 5D D9 96 AC 20 0C 14 C5 05 45 FD FF BF 1D 71 6B 6D 13 44 2C 68 3D 67 EA E5 7A 67 7A 
EC 14 15 20 AC 49 92 A8 10 4F 7A 79 50 63 FE E1 8F DF 0A 93 66 21 DF 2E F3 4B EC C2 1A F3 0F 7F 
5C 14 12 FC E5 45 D8 2F CF B3 0B EF 0F 6D CC 3F FC 71 49 48 2C CA A2 0A FC 0D B9 7B 15 0C 6F CC 
3F FC 71 41 48 2C 4A 55 DF 7B 41 AD 56 E4 B2 A1 3E 21 8A 3C 96 31 77 70 4E E4 BD C0 70 73 17 12 
0B AD DA FB 2F C9 D5 14 48 56 9D CA 28 2F EB 55 19 CF 98 3B 38 23 F2 66 20 B8 B9 0A 89 45 AD 24 
E0 2D 99 EA E6 A7 5E 91 FD 75 A9 5C 6A 2F C6 98 3B 38 25 F2 62 40 B8 B9 09 09 46 86 18 A7 08 F5 
E9 A5 0B DA D1 32 E5 50 2C 10 63 EE C0 81 C8 6B 01 E2 E6 24 24 16 98 8A D1 28 B5 3E E7 AA A0 3E 
52 AB F3 68 E6 27 B5 74 07 07 22 AF 05 88 9B 8B 90 58 F4 2A 45 BC A6 DC BC 46 29 7A 9E F3 DC 03 
41 C6 DC 81 0B 91 B7 02 C5 2D 7A 53 92 63 06 D3 99 D2 CB E3 50 5F 3B F2 33 E2 B4 F2 82 8C B9 03 
17 22 6F 05 8A DB B9 90 58 34 98 B6 6B 1B ED 64 6C 6F D0 9D 14 0C C8 98 3B 70 23 F2 4E E0 B8 9D 
09 09 46 86 69 BB 36 D1 8E 54 EC A2 C4 50 4A D6 61 11 C8 98 3B 70 23 F2 4E E0 B8 9D 09 89 45 0B 
6A BB 96 68 47 B4 85 AD 92 95 D6 1A 88 32 E6 0E 1C 89 BC 12 40 6E 76 21 C1 C8 40 21 70 AE 72 29 
65 AA 54 AE 6D 55 AC B2 06 33 28 63 EE C0 91 C8 2B 01 E4 66 17 12 8B 1A F4 5D 6B B4 D3 65 FD EE 
E7 DF 81 4F 6E 59 4F 42 19 73 07 14 11 D1 95 69 DA B3 7F F2 1A D0 22 D5 B9 17 35 9B 90 60 48 D0 
12 57 BF 46 3B 52 6D 39 CB 6F B7 6B 2D 13 1F 28 63 EE 80 20 22 4A 61 7E FE FE BE 9F 12 49 96 DA 
AF FB B2 09 89 C5 76 B8 77 0B DD 1A 4D 36 DB 51 63 9F 7F 3B E9 F0 8D DC 6A 05 CC 98 3B 20 88 74 
63 D7 F8 D3 6D 2F 18 D0 22 D5 7E 4E 6A 11 12 8C 16 D5 C1 E6 6B 43 D3 6E 16 35 84 EE 0E EF 4F D9 
26 09 66 CC 1D 10 44 B2 B1 C9 E8 3F 53 8C 6F 05 2D 92 A7 93 5A 84 04 23 45 AD 4D AB B5 FF 28 37 
FC BB E4 E8 A4 9A ED 26 60 C6 DC 01 41 64 EA 0D EA 07 C4 22 37 41 8B E4 EB A4 BC 90 60 28 D0 70 
BA FF 4C 9B E5 1F DB FB 9E 70 D2 8A ED D4 51 C6 DC 01 4D C4 A0 79 7D 4B CA 70 F3 75 52 5E 48 2C 
7A D4 94 6C F7 21 AD D6 70 47 0C AA 1E 9D 34 29 18 B5 61 C6 DC 01 49 64 84 7C 80 75 F7 C0 70 F3 
75 52 56 48 30 3A 54 8B 9D AF 7D E1 50 BF 4C A7 2D 84 E9 EC 49 27 95 CC 8C 3D CC 98 3B 20 89 18 
D4 BF DE 8A 7D 1F 0C 37 6F 27 E5 84 04 23 C3 85 A4 0B D1 6A DA B7 50 56 A6 B3 27 9D 54 6F E2 A1 
20 C6 DC 01 45 64 44 F6 7A 1F E5 B8 79 3B 29 27 24 18 0A D3 3C 08 BD 09 27 0B 53 5F 2B 39 76 F6 
A4 93 F6 4C 2C 03 32 E6 0E 48 22 23 E4 DB 03 52 9E 9B B7 93 4E 42 56 F3 A9 A9 E6 F3 D3 01 B8 41 
66 AD 14 60 1D A5 99 AD 9C E5 AC 8B A2 6F A4 48 1A 69 30 34 8F F2 2B 96 13 B4 37 1E 8C 09 CD FE 
00 86 88 81 86 FB 68 64 76 16 6E DE 4E BA 08 39 FC BB 3D 4D 21 32 85 5C 50 6E E9 F9 D8 F2 E6 20 
BB D1 9F 17 1C 56 9C 12 53 8D A9 09 36 C2 98 B0 EC CF B1 12 69 46 1F 05 37 F4 BF 65 F7 11 C9 DB 
49 57 21 D3 FD 10 B3 80 AE 20 97 44 50 21 1A E8 A2 2C E5 A4 39 19 70 53 C6 04 65 EF 8E 7A F4 D1 
0A DD 9A 3E 85 9D B7 93 2E 42 96 BB 55 98 06 DB 1D A4 87 25 9E 3A 4B 5B FE 48 B1 C7 32 58 4A C4 
D6 92 5C 59 3A 1A 13 98 BD 33 AA AC 34 F0 DB 87 31 BD 81 FC E9 33 D8 DD 70 D2 45 C8 DD 08 EA B0 
A5 E8 26 32 B2 49 6B 39 27 AD 2F 4F 11 69 B3 2B EC 30 66 EF C8 51 21 65 4C 50 F6 CE C8 E6 78 CE 
7B A9 9A 29 B8 47 B0 EB D2 42 15 A9 5F 05 59 84 6C B6 65 53 82 3B 04 3A 50 E7 9D 14 B4 B4 4E 87 
C2 94 31 41 D9 C7 03 53 70 AF 67 B7 08 B9 1D F3 D6 E0 79 C4 21 72 A7 C2 AC E0 4E DA 50 73 50 A4 
31 21 D9 47 04 53 70 AF 67 B7 08 B9 D5 0E 7D 51 54 45 CF 05 C5 70 D2 63 14 44 1A 13 92 7D 44 30 
05 F7 7A 76 AB 90 9F 5E 10 3E 57 D7 D3 3B 3A 82 3B 69 4F F9 23 6D 4C 40 F6 11 C1 15 DC DB D9 AD 
42 AE E3 89 0A 1E 59 FF CA 49 6B AA 67 A7 8D 09 C8 3E 22 B8 82 7B 3B BB 55 48 B9 6C BB 48 AF EC 
8B 5A 16 18 36 38 5E B1 D4 D0 0B 4E C1 9D B4 A2 AE 25 A0 8D F1 63 FF 34 70 05 F7 76 76 AB 90 EB 
30 FF DA 2C 41 75 C0 31 E8 F9 95 93 0A 77 27 F5 64 FF 30 70 05 47 B3 EB 5F D3 AC AE 42 B6 F3 2E 
CB 93 C8 BA F7 98 C4 6B E9 9D 1E 31 9C F4 E8 73 B4 31 8E EC CD 27 BB 7D 5C F7 A4 19 1D AE E0 28 
76 22 75 B8 59 E4 21 E4 56 21 E7 3D 43 67 EB E9 3E 4B 99 CC D2 FD B7 93 9E 84 0E C7 DF 1E F1 6D 
2C ED A4 84 31 8E EC 87 0F 16 BB 64 10 A2 D8 4B ED 62 24 08 CE 05 C7 B1 93 67 BD C6 17 B9 9F 70 
5B BE 7A B2 B5 1A 07 14 F5 C9 F6 D2 DE 67 39 C4 B5 25 5D 02 86 A6 A0 42 07 0F 72 EE 2D A9 1B FB 
01 A9 4C B6 56 0D 21 FD AE F5 0A AD 1E CD D5 5E 70 1C BB E2 AC 46 7E 91 FB 0D B7 F9 AB CB E5 61 
E8 C6 F2 13 1F D4 3E 3D 71 FB A4 98 94 31 C6 89 7D 72 EC 49 E4 93 4E 24 B1 05 47 B1 AB CF 8F A9 
3C 85 DC 47 48 B3 3F F5 74 1A 2D FD 5A B0 20 7A 9A 23 77 72 52 FD 87 03 27 CA 18 27 F6 46 D9 27 
5F 1B CE 16 1C C5 4E 3F E0 10 8D 23 3E 42 E6 2A DD 6D 3E 68 A5 1E 83 98 AE 1C 3F 90 B6 49 2F A5 
CA BF 22 19 C7 D1 FD 4F 9C B4 A2 E6 49 19 63 76 EC 6B 2D AB 4A EB 99 A9 EE 74 39 45 08 F5 B8 B7 
FA B9 D3 38 6C C1 7D 6B 5B 76 5D 3F 6F F6 30 8F 72 12 A2 2D 3B 7D 73 8B 6F 18 7C 84 94 2A 93 9B 
8E 70 3C C7 90 35 49 37 7C 44 18 67 36 BF AB BD 0E 97 92 2B 3F 3F 9C CC A7 BE 76 C7 BE 4B CA BC 
1B DC D9 90 15 B9 F9 F8 12 CE C9 DF DF C6 67 01 5B 70 7B 6D 45 DE 98 AD 51 CD E7 71 FC 9D 1C 1A 
A3 FE 91 77 50 7E 84 EC D4 F6 80 9A 1C 9F BB 5C E8 81 43 62 1A 20 F3 7F ED 75 22 8A 74 96 38 4E 
7A 6C 18 18 63 B6 EC AB 66 1C C1 57 A3 79 D3 0E C0 E5 77 D9 A3 2F 6A 62 0B 6E AF 6D 6E DA D0 7E 
0C CB 36 8F 63 FD EB 1E 39 77 FA 11 B2 DD CE 5B F4 53 93 59 9A 10 6C 8C 43 CB D1 FA D4 AB 21 21 
63 43 53 72 CC 1C 08 70 ED FE 38 46 62 8C D9 B2 1F 38 17 8B 23 EB F1 0C 58 B9 74 20 0F B8 56 C2 
02 B6 E0 76 DA 36 63 5C DD 65 FB C7 FE C1 57 50 7D 84 EC B7 0D DB 3C 17 68 FE 11 A3 30 53 13 52 
F8 8D F6 8E 7E 21 F2 AC 18 C6 58 45 46 CD 9E 87 DE 4F 4A 39 E9 8E FD 10 E1 2C 8A E5 85 D6 BA 5D 
8C 7C F6 B8 89 2F 38 42 DB B1 0D 3D 3C 3E 13 1F 21 C5 56 A5 62 6A E4 4C 5B 37 75 F4 A3 A7 56 9E 
B5 ED 62 26 1F 9B 93 5E C9 08 48 EF CC A7 8D D9 B1 1F 4A 65 79 DA 7F B8 75 0B 77 50 29 19 AF BE 
87 2D 38 42 DB D1 6D E7 47 F3 6A D7 03 A4 BF E0 46 0B 99 4C 71 5B 6B 9C 72 EC E8 4D D8 52 4F 1A 
79 2C 95 E5 D7 EE F6 17 F6 55 2D E7 8C 80 92 E4 E6 62 CC 67 7C B4 6F 76 4B 67 1E A8 94 8C 97 DE 
73 52 70 F3 87 46 6D CD AA 4C BD 3C 0A F3 E8 BE 94 18 9D 1B 2D 64 52 4C 83 06 A3 D0 38 84 EA 8A 
A4 EA 47 8D 1A 0F B3 4A E8 5D 8B CE 19 01 69 77 74 31 E6 13 D6 E4 D3 D3 AC 60 EE BC FF 04 95 92 
31 40 6A C7 B1 E1 2C 8B 44 34 F3 A3 32 8F 93 E2 89 CB C0 30 3A 37 A6 5D D1 A6 29 29 47 49 74 6E 
6E 92 CE 93 41 AD 52 26 C2 67 78 0B BD 27 C5 3D 23 60 41 76 61 0E C6 6C C2 9A 66 2C 1E 3D FF DF 
B9 B9 B9 94 B6 D0 A2 4F 88 D4 8E 66 AA A9 91 59 A2 C5 F6 71 54 5C 74 0E 4D 50 7C 6E B4 90 66 06 
BB 5B 22 05 59 EA 46 48 33 CD 2B D2 CE 6B E4 D4 23 2F EB 75 CE 08 C8 DC 60 E2 60 4C BF 19 44 98 
5D 4F CB 65 0A 95 33 8D 2B 69 0B 6D 87 63 43 A4 76 14 A5 1E 2A 9D EC 9A DD A3 59 B3 70 DB B7 1F 
9D 1B 23 24 18 02 79 23 A8 73 46 C0 9A DE D7 72 C3 98 D6 79 04 7C 25 6D A1 6D 9C F8 C4 D4 8E D1 
B9 31 42 A2 81 CC 54 E4 9C 11 B0 65 FA 75 4F 63 7A 7D E1 36 B1 2B 69 0B 6D 42 3E 31 B5 63 74 6E 
9C 90 60 48 5C 5A 42 F7 8C 80 DC 97 7A 1A 33 84 E5 CE 7F 77 29 6D A1 45 C8 27 A6 76 8C CF 0D E8 
3D 36 00 EB 82 7B 46 C0 8C A9 9D 9E C6 34 BA 74 EE 74 2E A5 2D B4 08 F9 C4 D4 8E F1 B9 71 42 82 
01 BC F6 DC 39 23 20 9B 08 27 C2 1D EC 97 D2 16 5A 84 7C 62 6A C7 E8 DC A2 65 34 C2 55 06 E7 8C 
80 0D DB 60 86 AF 99 97 D2 16 5A 84 7C 62 6A C7 E8 DC 78 21 C1 D0 A8 B0 82 CE 08 D8 76 5D F7 3D 
64 E7 6F 5A 87 19 C3 E1 5A DA 42 5E 48 68 FA 43 10 E2 73 8B 74 65 FE D8 C5 62 9A 02 32 6D A3 19 
75 37 DF 73 98 FC 4C 13 CC 18 0E D7 D2 16 F2 42 42 D3 1F 82 10 9F 5B BC 8C 46 39 E8 B8 0C 95 11 
70 5C 69 EF BF F6 53 F5 96 E9 61 94 31 1C 9C D2 16 3A DC AB 01 4D 7F 08 42 74 6E 36 21 C1 40 A5 
31 25 32 02 D2 C7 05 A4 25 F0 0C 9D 53 D5 2D 6D E1 D9 19 4F 74 FA 43 0C A2 73 B3 09 89 46 81 59 
19 25 32 02 96 54 4D B3 A7 4D 05 19 C3 E1 5A DA 42 BE 4B C4 A6 3F C4 20 36 B7 78 F9 6F 13 CB 3E 
FC 4B A0 32 02 66 79 A5 75 F7 B5 BA AB AD D1 36 C6 18 0E 17 D3 16 5A B6 2A 43 D3 1F 42 10 9D 9B 
5D 48 30 04 64 B4 42 65 04 54 A9 89 30 D3 7D A7 50 58 E7 D6 30 C6 70 B8 98 B6 D0 72 32 09 9B FE 
10 81 E8 DC EC 42 A2 51 22 62 0B 22 23 E0 EC 70 FB C8 B4 3D D9 42 06 31 86 C3 C5 B4 85 96 83 C8 
D8 F4 87 08 C4 E6 76 26 24 18 A2 00 B4 5E 54 46 C0 B9 4E EE 7A F0 EC 24 90 81 18 C3 E1 62 DA 42 
CB BD 23 D8 F4 87 08 C4 E6 76 26 24 1A ED ED 40 90 CE 08 38 F7 16 DB D8 E5 FC AB EE 1B C3 E1 72 
DA 42 EE 12 71 78 FA C3 FB 88 CE 2D 9C 4C 1C 6E D6 0A 2E 23 60 76 70 52 51 1C 6F F2 05 1B 73 D5 
C8 E4 A2 90 21 D2 1F DE 45 7C 6E 2E 42 82 51 83 97 23 E7 8C 80 F3 14 D4 26 CA 2C 1D 52 99 A2 8D 
E1 70 9E B6 D0 ED 04 37 22 FD 21 1A C1 B9 B9 08 89 86 0E 32 5C 99 0E C3 6F 2E A5 EC 9D BE 26 8C 
31 16 70 42 3A 9D F1 74 78 CF 2F 11 86 9B 9B 90 68 A4 41 E6 13 3A D3 D1 67 EB 4A A7 28 DC D6 93 
C2 18 C3 03 E5 5C 6F 72 D2 5B EF 71 15 12 8C 40 31 46 2B CB CD FD 02 A9 E3 31 DB B8 01 CF 9D B4 
85 21 DE 83 44 20 6E AE 42 A2 51 15 C1 D7 0F 4A 67 6A 11 8C F9 87 3F DC 85 44 A3 2A 02 4F CE 76 
17 3A F1 E0 C6 FC C3 1F 57 84 44 A3 2A 82 76 55 ED A5 F1 60 60 63 FE E1 8F 6B 42 A2 51 05 DD CB 
79 F1 16 A0 B0 C6 FC C3 1F DF 42 FE 01 3D D8 99 77 A9 4A CF 1B 00 00 00 00 49 45 4E 44 AE 42 60 
82 
EndData
$EndBitmap
Wire Wire Line
	7050 2450 7050 2150
Wire Wire Line
	2000 3100 2200 3100
Wire Wire Line
	2000 3400 2200 3400
Wire Wire Line
	3300 3100 3400 3100
Wire Wire Line
	4200 4250 4850 4250
Wire Wire Line
	7850 2550 7850 2750
Connection ~ 7850 2750
Wire Wire Line
	7850 2750 8100 2750
$Comp
L RadIIS_Mainboard:LT6010 U2
U 1 1 5CE9B376
P 7150 2750
F 0 "U2" H 7350 2700 50  0000 L CNN
F 1 "LT6010" H 7200 2600 50  0000 L CNN
F 2 "Package_SO:SOIC-8_3.9x4.9mm_P1.27mm" H 7200 2950 50  0001 C CNN
F 3 "http://www.linear.com/docs/2853" H 7150 3000 50  0001 C CNN
F 4 "LT6010CS8#PBF-ND" H 7150 2750 50  0001 C CNN "Digikey Nr"
F 5 "2.39" H 7150 2750 50  0001 C CNN "Digikey Price"
	1    7150 2750
	1    0    0    -1  
$EndComp
Wire Wire Line
	6350 2350 6450 2350
Wire Wire Line
	6450 2350 6450 2650
Wire Wire Line
	7150 3150 7250 3150
Connection ~ 7150 3150
Wire Wire Line
	7050 3150 7150 3150
Text HLabel 6850 4050 2    61   Input ~ 0
AGND_Out
Wire Wire Line
	6750 3800 6750 3900
Connection ~ 6750 3900
Wire Wire Line
	6450 3350 6450 3900
$Comp
L Device:R R6
U 1 1 5728AC4B
P 6750 3650
F 0 "R6" V 6750 3650 50  0000 C CNN
F 1 "8k2 1%" V 6650 3650 50  0000 C CNN
F 2 "Resistor_SMD:R_0603_1608Metric" V 6680 3650 50  0001 C CNN
F 3 "" H 6750 3650 50  0000 C CNN
F 4 "311-8.20KHRCT-ND" H 6750 3650 50  0001 C CNN "Digikey Nr"
F 5 "0.09" H 6750 3650 50  0001 C CNN "Digikey Price"
	1    6750 3650
	1    0    0    -1  
$EndComp
$Comp
L Device:R R4
U 1 1 5728AC4A
P 7300 3500
F 0 "R4" V 7300 3500 50  0000 C CNN
F 1 "115k 1%" V 7200 3500 50  0000 C CNN
F 2 "Resistor_SMD:R_0603_1608Metric" V 7230 3500 50  0001 C CNN
F 3 "" H 7300 3500 50  0000 C CNN
F 4 "311-115KHRCT-ND" H 7300 3500 50  0001 C CNN "Digikey Nr"
F 5 "0.09" H 7300 3500 50  0001 C CNN "Digikey Price"
	1    7300 3500
	0    1    1    0   
$EndComp
Wire Wire Line
	6750 4050 6850 4050
Connection ~ 8100 3300
Wire Wire Line
	8100 3300 8450 3300
Wire Wire Line
	8450 3300 8600 3300
Wire Wire Line
	8450 3900 8450 3750
Connection ~ 8450 3300
Wire Wire Line
	8450 3450 8450 3300
$Comp
L Device:C C35
U 1 1 58C9251C
P 8450 3600
F 0 "C35" H 8475 3700 50  0000 L CNN
F 1 "10nF" H 8475 3500 50  0000 L CNN
F 2 "Capacitor_SMD:C_0603_1608Metric" H 8488 3450 50  0001 C CNN
F 3 "" H 8450 3600 50  0000 C CNN
F 4 "1276-1009-1-ND" H 8450 3600 50  0001 C CNN "Digikey Nr"
F 5 "0.09" H 8450 3600 50  0001 C CNN "Digikey Price"
	1    8450 3600
	1    0    0    -1  
$EndComp
Text HLabel 7250 3150 2    61   Input ~ 0
AGND_Out
Text HLabel 8600 3300 2    61   Input ~ 0
Biassense_Out_a
$Comp
L Device:R R5
U 1 1 5728AC65
P 8100 3600
F 0 "R5" V 8100 3600 50  0000 C CNN
F 1 "220k 1%" V 8200 3600 50  0000 C CNN
F 2 "Resistor_SMD:R_0603_1608Metric" V 8030 3600 50  0001 C CNN
F 3 "" H 8100 3600 50  0000 C CNN
F 4 "311-220KHRCT-ND" H 8100 3600 50  0001 C CNN "Digikey Nr"
F 5 "0.09" H 8100 3600 50  0001 C CNN "Digikey Price"
	1    8100 3600
	-1   0    0    1   
$EndComp
$Comp
L Device:R R3
U 1 1 5728AC64
P 8100 3000
F 0 "R3" V 8100 3000 50  0000 C CNN
F 1 "2M2 1%" V 8200 3000 50  0000 C CNN
F 2 "Resistor_SMD:R_0603_1608Metric" V 8030 3000 50  0001 C CNN
F 3 "" H 8100 3000 50  0000 C CNN
F 4 "YAG3329CT-ND" H 8100 3000 50  0001 C CNN "Digikey Nr"
F 5 "0.09" H 8100 3000 50  0001 C CNN "Digikey Price"
	1    8100 3000
	-1   0    0    1   
$EndComp
Wire Wire Line
	6750 2850 6850 2850
Wire Wire Line
	7850 2750 7850 3500
Wire Wire Line
	8100 3150 8100 3300
Wire Wire Line
	8100 3300 8100 3450
Wire Wire Line
	8100 3750 8100 3900
Connection ~ 8100 3900
Wire Wire Line
	8100 3900 8450 3900
Wire Wire Line
	6450 2650 6450 3050
Wire Wire Line
	6750 2850 6750 3500
Wire Wire Line
	7050 3050 7050 3150
Wire Wire Line
	7150 2950 7150 3150
Wire Wire Line
	7050 2150 8350 2150
Connection ~ 7050 2150
Wire Wire Line
	7450 2750 7850 2750
Wire Wire Line
	7150 3500 6750 3500
Connection ~ 6750 3500
Wire Wire Line
	7450 3500 7850 3500
Wire Wire Line
	8100 2750 8750 2750
Wire Wire Line
	6750 3900 8100 3900
Wire Notes Line
	9250 1900 8250 1900
Wire Wire Line
	8100 2750 8100 2450
Wire Wire Line
	8650 2150 8650 2300
Wire Wire Line
	8750 2300 8650 2300
Connection ~ 8650 2300
Wire Wire Line
	8650 2300 8650 2450
Wire Wire Line
	6750 3900 6750 4050
Wire Wire Line
	6450 2650 6850 2650
Wire Wire Line
	6450 3900 6750 3900
Wire Notes Line
	8250 2850 8250 1900
Wire Notes Line
	9250 1900 9250 2850
Wire Notes Line
	8250 2850 9250 2850
Connection ~ 3850 4250
Wire Wire Line
	3700 3100 3850 3100
Wire Wire Line
	3200 3700 3850 3700
Wire Wire Line
	3250 3400 3200 3400
Wire Wire Line
	3850 3250 3850 3100
Connection ~ 3850 3100
Wire Wire Line
	3850 3100 4200 3100
Wire Wire Line
	3850 4250 3850 4150
Wire Wire Line
	3850 3700 3850 3850
Wire Wire Line
	4200 3850 4200 4250
Wire Wire Line
	4850 3850 4850 4250
Wire Wire Line
	4850 3100 4850 3550
Connection ~ 4850 3100
Wire Wire Line
	4200 3100 4200 3550
Connection ~ 4200 3100
Wire Wire Line
	4200 3100 4350 3100
Wire Wire Line
	4000 4450 3850 4450
Wire Wire Line
	3850 4250 3850 4450
Wire Wire Line
	4850 2050 4850 2150
Connection ~ 4850 2150
Wire Wire Line
	2800 2700 3300 2700
Wire Wire Line
	2000 2700 2500 2700
$Comp
L Device:L L1
U 1 1 57AD68A3
P 2650 2700
F 0 "L1" V 2600 2700 50  0000 C CNN
F 1 "CDRH4D28 47uH" V 2700 2700 50  0000 C CNN
F 2 "RadIIS_Mainboard:CDRH4d28_FP" H 2650 2700 50  0001 C CNN
F 3 "http://products.sumida.com/products/pdf/CDRH4D28.pdf" H 2650 2700 50  0001 C CNN
F 4 "308-2182-1-ND" H 2650 2700 50  0001 C CNN "Digikey Nr"
F 5 "0.83" H 2650 2700 50  0001 C CNN "Digikey Price"
	1    2650 2700
	0    -1   -1   0   
$EndComp
$Comp
L Connector:TestPoint TP18
U 1 1 5D68A072
P 6000 2650
F 0 "TP18" H 6000 2883 50  0000 C CNN
F 1 "TestPoint" H 6000 2974 50  0000 C CNN
F 2 "TestPoint:TestPoint_Pad_D1.5mm" H 6200 2650 50  0001 C CNN
F 3 "~" H 6200 2650 50  0001 C CNN
	1    6000 2650
	-1   0    0    1   
$EndComp
Connection ~ 6000 2650
Wire Wire Line
	6000 2650 6050 2650
$Comp
L Connector:TestPoint TP17
U 1 1 5D68AB43
P 6000 2350
F 0 "TP17" H 6000 2675 50  0000 C CNN
F 1 "TestPoint" H 6000 2584 50  0000 C CNN
F 2 "TestPoint:TestPoint_Pad_D1.5mm" H 6200 2350 50  0001 C CNN
F 3 "~" H 6200 2350 50  0001 C CNN
	1    6000 2350
	1    0    0    -1  
$EndComp
Connection ~ 6000 2350
Wire Wire Line
	6000 2350 5950 2350
$EndSCHEMATC
