(module CUI_CMT-5023S-SMT (layer F.Cu) (tedit 5C9CB0F9)
  (attr smd)
  (fp_text reference CUI_CMT-5023S-SMT (at -0.64168 -3.72893) (layer F.SilkS)
    (effects (font (size 1.00106 1.00106) (thickness 0.05)))
  )
  (fp_text value VAL** (at -0.12502 3.45544) (layer F.SilkS)
    (effects (font (size 1.00013 1.00013) (thickness 0.05)))
  )
  (fp_text user + (at -3.24338 2.56267) (layer F.SilkS)
    (effects (font (size 1 1) (thickness 0.05)))
  )
  (fp_line (start -2.5 2.5) (end -2.5 -2.5) (layer Eco2.User) (width 0.127))
  (fp_line (start 2.5 2.5) (end -2.5 2.5) (layer F.SilkS) (width 0.127))
  (fp_line (start -2.5 -1) (end -2.5 1) (layer F.SilkS) (width 0.127))
  (fp_line (start 2.5 2.5) (end -2.5 2.5) (layer Eco2.User) (width 0.127))
  (fp_text user - (at 3.79702 1.84341) (layer F.SilkS)
    (effects (font (size 1 1) (thickness 0.05)))
  )
  (fp_line (start -2.9 -2.9) (end -2.9 2.75) (layer Eco1.User) (width 0.05))
  (fp_line (start 2.9 2.75) (end -2.9 2.75) (layer Eco1.User) (width 0.05))
  (fp_line (start -2.5 -2.5) (end 1.27 -2.5) (layer Eco2.User) (width 0.127))
  (fp_line (start 1.27 -2.5) (end 2.5 -1.27) (layer Eco2.User) (width 0.127))
  (fp_line (start 2.5 -1.27) (end 2.5 2.5) (layer Eco2.User) (width 0.127))
  (fp_line (start -2.5 -2.5) (end 1.27 -2.5) (layer F.SilkS) (width 0.127))
  (fp_line (start 1.27 -2.5) (end 2.5 -1.27) (layer F.SilkS) (width 0.127))
  (fp_line (start 2.5 -1.27) (end 2.5 1) (layer F.SilkS) (width 0.127))
  (fp_line (start 1.27 -2.9) (end -2.9 -2.9) (layer Eco1.User) (width 0.05))
  (fp_line (start 2.9 -1.27) (end 2.9 2.75) (layer Eco1.User) (width 0.05))
  (fp_line (start 1.27 -2.9) (end 2.9 -1.27) (layer Eco1.User) (width 0.05))
  (pad 1 smd rect (at -1.8 1.75) (size 1.7 1) (layers F.Cu F.Paste F.Mask))
  (pad 2 smd rect (at 1.8 1.75) (size 1.7 1) (layers F.Cu F.Paste F.Mask))
  (pad "" smd rect (at -1.8 -1.75) (size 1.7 1) (layers F.Cu F.Paste F.Mask))
  (model /media/merlin/Daten/Merlin_Forscht/Strahlenmesstechnik/Gammaspektroskopie/RadIIS/Hardware/KiCad_Libs/MODS/RadIIS_footprints_NEW.pretty/CUI_CMT-5023S-SMT.step
    (at (xyz 0 0 0))
    (scale (xyz 1 1 1))
    (rotate (xyz 0 0 0))
  )
)
