(kicad_pcb (version 20171130) (host pcbnew 5.1.4-e60b266~84~ubuntu18.04.1)

  (general
    (thickness 1.6)
    (drawings 19)
    (tracks 224)
    (zones 0)
    (modules 58)
    (nets 17)
  )

  (page A4)
  (layers
    (0 F.Cu signal)
    (31 B.Cu signal hide)
    (32 B.Adhes user hide)
    (33 F.Adhes user hide)
    (34 B.Paste user hide)
    (35 F.Paste user hide)
    (36 B.SilkS user)
    (37 F.SilkS user)
    (38 B.Mask user)
    (39 F.Mask user hide)
    (40 Dwgs.User user)
    (41 Cmts.User user)
    (42 Eco1.User user)
    (43 Eco2.User user)
    (44 Edge.Cuts user)
    (45 Margin user)
    (46 B.CrtYd user)
    (47 F.CrtYd user)
    (48 B.Fab user)
    (49 F.Fab user)
  )

  (setup
    (last_trace_width 0.25)
    (user_trace_width 0.5)
    (user_trace_width 1)
    (user_trace_width 3)
    (user_trace_width 4)
    (trace_clearance 0.2)
    (zone_clearance 0.35)
    (zone_45_only no)
    (trace_min 0.2)
    (via_size 0.8)
    (via_drill 0.4)
    (via_min_size 0.4)
    (via_min_drill 0.3)
    (uvia_size 0.3)
    (uvia_drill 0.1)
    (uvias_allowed no)
    (uvia_min_size 0.2)
    (uvia_min_drill 0.1)
    (edge_width 0.15)
    (segment_width 0.2)
    (pcb_text_width 0.3)
    (pcb_text_size 1.5 1.5)
    (mod_edge_width 0.15)
    (mod_text_size 1 1)
    (mod_text_width 0.15)
    (pad_size 0.8 0.8)
    (pad_drill 0.4)
    (pad_to_mask_clearance 0.2)
    (solder_mask_min_width 0.25)
    (aux_axis_origin 0 0)
    (visible_elements FFFDFF3F)
    (pcbplotparams
      (layerselection 0x01030_80000001)
      (usegerberextensions false)
      (usegerberattributes false)
      (usegerberadvancedattributes false)
      (creategerberjobfile false)
      (excludeedgelayer true)
      (linewidth 0.100000)
      (plotframeref false)
      (viasonmask false)
      (mode 1)
      (useauxorigin false)
      (hpglpennumber 1)
      (hpglpenspeed 20)
      (hpglpendiameter 15.000000)
      (psnegative false)
      (psa4output false)
      (plotreference true)
      (plotvalue true)
      (plotinvisibletext false)
      (padsonsilk false)
      (subtractmaskfromsilk false)
      (outputformat 1)
      (mirror false)
      (drillshape 0)
      (scaleselection 1)
      (outputdirectory "Gerber/"))
  )

  (net 0 "")
  (net 1 "Net-(C1-Pad2)")
  (net 2 "Net-(C2-Pad1)")
  (net 3 "Net-(C9-Pad1)")
  (net 4 "Net-(C9-Pad2)")
  (net 5 "Net-(C10-Pad1)")
  (net 6 "Net-(R1-Pad1)")
  (net 7 "Net-(R1-Pad2)")
  (net 8 "Net-(U1-Pad2)")
  (net 9 "Net-(U4-Pad3)")
  (net 10 /BiasF)
  (net 11 Pulse_Out)
  (net 12 AGND)
  (net 13 A3V3)
  (net 14 A-2V0)
  (net 15 Bias_In+)
  (net 16 Temp_Out)

  (net_class Default "This is the default net class."
    (clearance 0.2)
    (trace_width 0.25)
    (via_dia 0.8)
    (via_drill 0.4)
    (uvia_dia 0.3)
    (uvia_drill 0.1)
    (add_net A-2V0)
    (add_net A3V3)
    (add_net AGND)
    (add_net Bias_In+)
    (add_net "Net-(C1-Pad2)")
    (add_net "Net-(C10-Pad1)")
    (add_net "Net-(C2-Pad1)")
    (add_net "Net-(C9-Pad1)")
    (add_net "Net-(C9-Pad2)")
    (add_net "Net-(R1-Pad1)")
    (add_net "Net-(R1-Pad2)")
    (add_net "Net-(U1-Pad2)")
    (add_net "Net-(U4-Pad3)")
    (add_net Pulse_Out)
    (add_net Temp_Out)
  )

  (net_class HighVolt ""
    (clearance 0.45)
    (trace_width 0.25)
    (via_dia 0.8)
    (via_drill 0.4)
    (uvia_dia 0.3)
    (uvia_drill 0.1)
    (add_net /BiasF)
  )

  (module RadIIS_Modul_rev1:MicroFC-30035-SMT-C1 (layer F.Cu) (tedit 5D5C0A6B) (tstamp 578395EA)
    (at 185.265 77)
    (path /57601CD4)
    (fp_text reference U1 (at -2.965 -2.1 90) (layer F.SilkS)
      (effects (font (size 0.5 0.5) (thickness 0.1)))
    )
    (fp_text value MicroFC-30035-SMT (at 4.735 6.1 90) (layer F.Fab)
      (effects (font (size 1 1) (thickness 0.15)))
    )
    (fp_line (start -2 -2) (end 2 -2) (layer F.SilkS) (width 0.15))
    (fp_line (start 2 -2) (end 2 2) (layer F.SilkS) (width 0.15))
    (fp_line (start 2 2) (end -2 2) (layer F.SilkS) (width 0.15))
    (fp_line (start -2 2) (end -2 -2) (layer F.SilkS) (width 0.15))
    (fp_circle (center -3 1.5) (end -3 1.75) (layer F.SilkS) (width 0.5))
    (fp_line (start -2 2.5) (end 2.5 2.5) (layer F.SilkS) (width 0.15))
    (fp_line (start 2.5 2.5) (end 2.5 -2.5) (layer F.SilkS) (width 0.15))
    (fp_line (start 2.5 -2.5) (end -2.5 -2.5) (layer F.SilkS) (width 0.15))
    (fp_line (start -2.5 -2.5) (end -2.5 2.5) (layer F.SilkS) (width 0.15))
    (fp_line (start -2.5 2.5) (end -2 2.5) (layer F.SilkS) (width 0.15))
    (fp_line (start -3.5 -3.5) (end -3.5 3.5) (layer F.SilkS) (width 0.15))
    (fp_line (start 3.5 3.5) (end 3.5 -3.5) (layer F.SilkS) (width 0.15))
    (fp_arc (start 0 -4) (end -1.5 -4) (angle 180) (layer F.SilkS) (width 0.15))
    (fp_line (start 1.5 -4) (end 1.5 -3.5) (layer F.SilkS) (width 0.15))
    (fp_line (start 1.5 -3.5) (end 3.5 -3.5) (layer F.SilkS) (width 0.15))
    (fp_line (start -1.5 -4) (end -1.5 -3.5) (layer F.SilkS) (width 0.15))
    (fp_line (start -1.5 -3.5) (end -3.5 -3.5) (layer F.SilkS) (width 0.15))
    (fp_line (start 3.5 3.5) (end 3.5 5.5) (layer F.SilkS) (width 0.15))
    (fp_line (start 3.5 5.5) (end -3.5 5.5) (layer F.SilkS) (width 0.15))
    (fp_line (start -3.5 5.5) (end -3.5 3.5) (layer F.SilkS) (width 0.15))
    (pad "" np_thru_hole circle (at 0 -4) (size 1.2 1.2) (drill 1.2) (layers *.Cu *.Mask F.SilkS))
    (pad "" np_thru_hole circle (at 0 4) (size 1.2 1.2) (drill 1.2) (layers *.Cu *.Mask F.SilkS))
    (pad 2 smd rect (at 1.8 1.465 270) (size 0.35 0.5) (layers F.Cu F.Paste F.Mask)
      (net 8 "Net-(U1-Pad2)"))
    (pad 1 smd rect (at -1.465 1.8 180) (size 0.35 0.5) (layers F.Cu F.Paste F.Mask)
      (net 7 "Net-(R1-Pad2)"))
    (pad 4 smd rect (at -1.8 -1.465 90) (size 0.35 0.5) (layers F.Cu F.Paste F.Mask)
      (net 12 AGND))
    (pad 2 smd rect (at 0.98 0.98 270) (size 1.32 1.3) (layers F.Cu F.Paste F.Mask)
      (net 8 "Net-(U1-Pad2)"))
    (pad 1 smd rect (at -0.98 0.98 180) (size 1.32 1.3) (layers F.Cu F.Paste F.Mask)
      (net 7 "Net-(R1-Pad2)"))
    (pad 4 smd rect (at -0.98 -0.98 90) (size 1.32 1.3) (layers F.Cu F.Paste F.Mask)
      (net 12 AGND))
    (pad 3 smd rect (at 1.465 -1.8) (size 0.35 0.5) (layers F.Cu F.Paste F.Mask)
      (net 10 /BiasF))
    (pad 3 smd rect (at 0.98 -0.98) (size 1.32 1.3) (layers F.Cu F.Paste F.Mask)
      (net 10 /BiasF))
    (model ${KIPRJMOD}/LocalLib/3D/CrystalHousing.step
      (offset (xyz 3.5 -5.5 0))
      (scale (xyz 1 1 1))
      (rotate (xyz 0 0 -90))
    )
  )

  (module Wire_Pads:SolderWirePad_single_1-5mmDrill (layer F.Cu) (tedit 5BE5ED5F) (tstamp 5852BEE6)
    (at 155.5 72.3)
    (zone_connect 2)
    (fp_text reference "" (at 0 -3.81) (layer F.SilkS) hide
      (effects (font (size 0.5 0.5) (thickness 0.1)))
    )
    (fp_text value "" (at -0.635 3.81) (layer F.Fab) hide
      (effects (font (size 1 1) (thickness 0.15)))
    )
    (pad "" thru_hole circle (at 0 0) (size 0.8 0.8) (drill 0.4) (layers *.Cu)
      (net 12 AGND) (zone_connect 2))
  )

  (module Wire_Pads:SolderWirePad_single_1-5mmDrill (layer F.Cu) (tedit 5BE5ED59) (tstamp 5852BEE2)
    (at 154.6 72.3)
    (zone_connect 2)
    (fp_text reference "" (at 0 -3.81) (layer F.SilkS) hide
      (effects (font (size 0.5 0.5) (thickness 0.1)))
    )
    (fp_text value "" (at -0.635 3.81) (layer F.Fab) hide
      (effects (font (size 1 1) (thickness 0.15)))
    )
    (pad "" thru_hole circle (at 0 0) (size 0.8 0.8) (drill 0.4) (layers *.Cu)
      (net 12 AGND) (zone_connect 2))
  )

  (module Wire_Pads:SolderWirePad_single_1-5mmDrill (layer F.Cu) (tedit 5BE5ED53) (tstamp 5852BEDE)
    (at 153.7 72.3)
    (zone_connect 2)
    (fp_text reference "" (at 0 -3.81) (layer F.SilkS) hide
      (effects (font (size 0.5 0.5) (thickness 0.1)))
    )
    (fp_text value "" (at -0.635 3.81) (layer F.Fab) hide
      (effects (font (size 1 1) (thickness 0.15)))
    )
    (pad "" thru_hole circle (at 0 0) (size 0.8 0.8) (drill 0.4) (layers *.Cu)
      (net 12 AGND) (zone_connect 2))
  )

  (module Wire_Pads:SolderWirePad_single_1-5mmDrill (layer F.Cu) (tedit 5BE5ED4A) (tstamp 5852BED9)
    (at 152.8 72.3)
    (zone_connect 2)
    (fp_text reference "" (at 0 -3.81) (layer F.SilkS) hide
      (effects (font (size 0.5 0.5) (thickness 0.1)))
    )
    (fp_text value "" (at -0.635 3.81) (layer F.Fab) hide
      (effects (font (size 1 1) (thickness 0.15)))
    )
    (pad "" thru_hole circle (at 0 0) (size 0.8 0.8) (drill 0.4) (layers *.Cu)
      (net 12 AGND) (zone_connect 2))
  )

  (module Wire_Pads:SolderWirePad_single_1-5mmDrill (layer F.Cu) (tedit 5BE5ED3C) (tstamp 5852BECD)
    (at 165.989 81.026)
    (zone_connect 2)
    (fp_text reference "" (at 0 -3.81) (layer F.SilkS) hide
      (effects (font (size 0.5 0.5) (thickness 0.1)))
    )
    (fp_text value "" (at -0.635 3.81) (layer F.Fab) hide
      (effects (font (size 1 1) (thickness 0.15)))
    )
    (pad "" thru_hole circle (at 0 0) (size 0.8 0.8) (drill 0.4) (layers *.Cu)
      (net 12 AGND) (zone_connect 2))
  )

  (module Wire_Pads:SolderWirePad_single_1-5mmDrill (layer F.Cu) (tedit 5BE5EDB0) (tstamp 5852BE88)
    (at 187.8 74.9)
    (zone_connect 2)
    (fp_text reference "" (at 0 -3.81) (layer F.SilkS) hide
      (effects (font (size 0.5 0.5) (thickness 0.1)))
    )
    (fp_text value "" (at -0.635 3.81) (layer F.Fab) hide
      (effects (font (size 1 1) (thickness 0.15)))
    )
    (pad "" thru_hole circle (at 0 0) (size 0.8 0.8) (drill 0.4) (layers *.Cu)
      (net 12 AGND) (zone_connect 2))
  )

  (module Wire_Pads:SolderWirePad_single_1-5mmDrill (layer F.Cu) (tedit 5BE5EDA9) (tstamp 5852BE84)
    (at 187.8 74)
    (zone_connect 2)
    (fp_text reference "" (at 0 -3.81) (layer F.SilkS) hide
      (effects (font (size 0.5 0.5) (thickness 0.1)))
    )
    (fp_text value "" (at -0.635 3.81) (layer F.Fab) hide
      (effects (font (size 1 1) (thickness 0.15)))
    )
    (pad "" thru_hole circle (at 0 0) (size 0.8 0.8) (drill 0.4) (layers *.Cu)
      (net 12 AGND) (zone_connect 2))
  )

  (module Wire_Pads:SolderWirePad_single_1-5mmDrill (layer F.Cu) (tedit 5BE5ED87) (tstamp 5852BE77)
    (at 171.9 74.4)
    (zone_connect 2)
    (fp_text reference "" (at 0 -3.81) (layer F.SilkS) hide
      (effects (font (size 0.5 0.5) (thickness 0.1)))
    )
    (fp_text value "" (at -0.635 3.81) (layer F.Fab) hide
      (effects (font (size 1 1) (thickness 0.15)))
    )
    (pad "" thru_hole circle (at 0 0) (size 0.8 0.8) (drill 0.4) (layers *.Cu)
      (net 12 AGND) (zone_connect 2))
  )

  (module Wire_Pads:SolderWirePad_single_1-5mmDrill (layer F.Cu) (tedit 5BE5ED8E) (tstamp 5852BE73)
    (at 172.8 74.4)
    (zone_connect 2)
    (fp_text reference "" (at 0 -3.81) (layer F.SilkS) hide
      (effects (font (size 0.5 0.5) (thickness 0.1)))
    )
    (fp_text value "" (at -0.635 3.81) (layer F.Fab) hide
      (effects (font (size 1 1) (thickness 0.15)))
    )
    (pad "" thru_hole circle (at 0 0) (size 0.8 0.8) (drill 0.4) (layers *.Cu)
      (net 12 AGND) (zone_connect 2))
  )

  (module Wire_Pads:SolderWirePad_single_1-5mmDrill (layer F.Cu) (tedit 5BE5ED95) (tstamp 5852BE6F)
    (at 173.7 74.4)
    (zone_connect 2)
    (fp_text reference "" (at 0 -3.81) (layer F.SilkS) hide
      (effects (font (size 0.5 0.5) (thickness 0.1)))
    )
    (fp_text value "" (at -0.635 3.81) (layer F.Fab) hide
      (effects (font (size 1 1) (thickness 0.15)))
    )
    (pad "" thru_hole circle (at 0 0) (size 0.8 0.8) (drill 0.4) (layers *.Cu)
      (net 12 AGND) (zone_connect 2))
  )

  (module Wire_Pads:SolderWirePad_single_1-5mmDrill (layer F.Cu) (tedit 5BE5ED9F) (tstamp 5852BE6B)
    (at 174.6 74.4)
    (zone_connect 2)
    (fp_text reference "" (at 0 -3.81) (layer F.SilkS) hide
      (effects (font (size 0.5 0.5) (thickness 0.1)))
    )
    (fp_text value "" (at -0.635 3.81) (layer F.Fab) hide
      (effects (font (size 1 1) (thickness 0.15)))
    )
    (pad "" thru_hole circle (at 0 0) (size 0.8 0.8) (drill 0.4) (layers *.Cu)
      (net 12 AGND) (zone_connect 2))
  )

  (module Wire_Pads:SolderWirePad_single_1-5mmDrill (layer F.Cu) (tedit 5BE5ED82) (tstamp 5852BE67)
    (at 174.6 73.5)
    (zone_connect 2)
    (fp_text reference "" (at 0 -3.81) (layer F.SilkS) hide
      (effects (font (size 0.5 0.5) (thickness 0.1)))
    )
    (fp_text value "" (at -0.635 3.81) (layer F.Fab) hide
      (effects (font (size 1 1) (thickness 0.15)))
    )
    (pad "" thru_hole circle (at 0 0) (size 0.8 0.8) (drill 0.4) (layers *.Cu)
      (net 12 AGND) (zone_connect 2))
  )

  (module Wire_Pads:SolderWirePad_single_1-5mmDrill (layer F.Cu) (tedit 5BE5ED7D) (tstamp 5852BE63)
    (at 173.7 73.5)
    (zone_connect 2)
    (fp_text reference "" (at 0 -3.81) (layer F.SilkS) hide
      (effects (font (size 0.5 0.5) (thickness 0.1)))
    )
    (fp_text value "" (at -0.635 3.81) (layer F.Fab) hide
      (effects (font (size 1 1) (thickness 0.15)))
    )
    (pad "" thru_hole circle (at 0 0) (size 0.8 0.8) (drill 0.4) (layers *.Cu)
      (net 12 AGND) (zone_connect 2))
  )

  (module Wire_Pads:SolderWirePad_single_1-5mmDrill (layer F.Cu) (tedit 5BE5ED78) (tstamp 5852BE5F)
    (at 172.8 73.5)
    (zone_connect 2)
    (fp_text reference "" (at 0 -3.81) (layer F.SilkS) hide
      (effects (font (size 0.5 0.5) (thickness 0.1)))
    )
    (fp_text value "" (at -0.635 3.81) (layer F.Fab) hide
      (effects (font (size 1 1) (thickness 0.15)))
    )
    (pad "" thru_hole circle (at 0 0) (size 0.8 0.8) (drill 0.4) (layers *.Cu)
      (net 12 AGND) (zone_connect 2))
  )

  (module Wire_Pads:SolderWirePad_single_1-5mmDrill (layer F.Cu) (tedit 5BE5ED6C) (tstamp 5852BE5B)
    (at 171.9 73.5)
    (zone_connect 2)
    (fp_text reference "" (at 0 -3.81) (layer F.SilkS) hide
      (effects (font (size 0.5 0.5) (thickness 0.1)))
    )
    (fp_text value "" (at -0.635 3.81) (layer F.Fab) hide
      (effects (font (size 1 1) (thickness 0.15)))
    )
    (pad "" thru_hole circle (at 0 0) (size 0.8 0.8) (drill 0.4) (layers *.Cu)
      (net 12 AGND) (zone_connect 2))
  )

  (module Wire_Pads:SolderWirePad_single_1-5mmDrill (layer F.Cu) (tedit 5BE5EDEC) (tstamp 5852BE14)
    (at 180.848 80.01)
    (zone_connect 2)
    (fp_text reference "" (at 0 -3.81) (layer F.SilkS) hide
      (effects (font (size 0.5 0.5) (thickness 0.1)))
    )
    (fp_text value "" (at -0.635 3.81) (layer F.Fab) hide
      (effects (font (size 1 1) (thickness 0.15)))
    )
    (pad "" thru_hole circle (at 0 0) (size 0.8 0.8) (drill 0.4) (layers *.Cu)
      (net 12 AGND) (zone_connect 2))
  )

  (module Wire_Pads:SolderWirePad_single_1-5mmDrill (layer F.Cu) (tedit 5BE5EDE2) (tstamp 5852BDF0)
    (at 182.3 73.4)
    (zone_connect 2)
    (fp_text reference "" (at 0 -3.81) (layer F.SilkS) hide
      (effects (font (size 0.5 0.5) (thickness 0.1)))
    )
    (fp_text value "" (at -0.635 3.81) (layer F.Fab) hide
      (effects (font (size 1 1) (thickness 0.15)))
    )
    (pad "" thru_hole circle (at 0 0) (size 0.8 0.8) (drill 0.4) (layers *.Cu)
      (net 12 AGND) (zone_connect 2))
  )

  (module Wire_Pads:SolderWirePad_single_1-5mmDrill (layer F.Cu) (tedit 5BE5EDDC) (tstamp 5852BDEC)
    (at 183.6 73.4)
    (zone_connect 2)
    (fp_text reference "" (at 0 -3.81) (layer F.SilkS) hide
      (effects (font (size 0.5 0.5) (thickness 0.1)))
    )
    (fp_text value "" (at -0.635 3.81) (layer F.Fab) hide
      (effects (font (size 1 1) (thickness 0.15)))
    )
    (pad "" thru_hole circle (at 0 0) (size 0.8 0.8) (drill 0.4) (layers *.Cu)
      (net 12 AGND) (zone_connect 2))
  )

  (module Wire_Pads:SolderWirePad_single_1-5mmDrill (layer F.Cu) (tedit 5BE5EDD7) (tstamp 5852BDE8)
    (at 183.6 72.2)
    (zone_connect 2)
    (fp_text reference "" (at 0 -3.81) (layer F.SilkS) hide
      (effects (font (size 0.5 0.5) (thickness 0.1)))
    )
    (fp_text value "" (at -0.635 3.81) (layer F.Fab) hide
      (effects (font (size 1 1) (thickness 0.15)))
    )
    (pad "" thru_hole circle (at 0 0) (size 0.8 0.8) (drill 0.4) (layers *.Cu)
      (net 12 AGND) (zone_connect 2))
  )

  (module Wire_Pads:SolderWirePad_single_1-5mmDrill (layer F.Cu) (tedit 5BE5EDD2) (tstamp 5852BDE3)
    (at 182.3 72.2)
    (zone_connect 2)
    (fp_text reference "" (at 0 -3.81) (layer F.SilkS) hide
      (effects (font (size 0.5 0.5) (thickness 0.1)))
    )
    (fp_text value "" (at -0.635 3.81) (layer F.Fab) hide
      (effects (font (size 1 1) (thickness 0.15)))
    )
    (pad "" thru_hole circle (at 0 0) (size 0.8 0.8) (drill 0.4) (layers *.Cu)
      (net 12 AGND) (zone_connect 2))
  )

  (module Wire_Pads:SolderWirePad_single_1-5mmDrill (layer F.Cu) (tedit 5BE5EDF8) (tstamp 5852BDDD)
    (at 182.7 77.5)
    (zone_connect 2)
    (fp_text reference "" (at 0 -3.81) (layer F.SilkS) hide
      (effects (font (size 0.5 0.5) (thickness 0.1)))
    )
    (fp_text value "" (at -0.635 3.81) (layer F.Fab) hide
      (effects (font (size 1 1) (thickness 0.15)))
    )
    (pad "" thru_hole circle (at 0 0) (size 0.8 0.8) (drill 0.4) (layers *.Cu)
      (net 12 AGND) (zone_connect 2))
  )

  (module Wire_Pads:SolderWirePad_single_1-5mmDrill (layer F.Cu) (tedit 5BE5EDB7) (tstamp 5852BDD7)
    (at 187.325 80.01)
    (zone_connect 2)
    (fp_text reference "" (at 0 -3.81) (layer F.SilkS) hide
      (effects (font (size 0.5 0.5) (thickness 0.1)))
    )
    (fp_text value "" (at -0.635 3.81) (layer F.Fab) hide
      (effects (font (size 1 1) (thickness 0.15)))
    )
    (pad "" thru_hole circle (at 0 0) (size 0.8 0.8) (drill 0.4) (layers *.Cu)
      (net 12 AGND) (zone_connect 2))
  )

  (module Wire_Pads:SolderWirePad_single_1-5mmDrill (layer F.Cu) (tedit 5BE5EDBD) (tstamp 5852BDD3)
    (at 187.325 81.28)
    (zone_connect 2)
    (fp_text reference "" (at 0 -3.81) (layer F.SilkS) hide
      (effects (font (size 0.5 0.5) (thickness 0.1)))
    )
    (fp_text value "" (at -0.635 3.81) (layer F.Fab) hide
      (effects (font (size 1 1) (thickness 0.15)))
    )
    (pad "" thru_hole circle (at 0 0) (size 0.8 0.8) (drill 0.4) (layers *.Cu)
      (net 12 AGND) (zone_connect 2))
  )

  (module Wire_Pads:SolderWirePad_single_1-5mmDrill (layer F.Cu) (tedit 5BE5EE09) (tstamp 5852BDCF)
    (at 182.118 81.28)
    (zone_connect 2)
    (fp_text reference "" (at 0 -3.81) (layer F.SilkS) hide
      (effects (font (size 0.5 0.5) (thickness 0.1)))
    )
    (fp_text value "" (at -0.635 3.81) (layer F.Fab) hide
      (effects (font (size 1 1) (thickness 0.15)))
    )
    (pad "" thru_hole circle (at 0 0) (size 0.8 0.8) (drill 0.4) (layers *.Cu)
      (net 12 AGND) (zone_connect 2))
  )

  (module Wire_Pads:SolderWirePad_single_1-5mmDrill (layer F.Cu) (tedit 5BE5EDC8) (tstamp 5852BDC6)
    (at 183.388 81.28)
    (zone_connect 2)
    (fp_text reference "" (at 0 -3.81) (layer F.SilkS) hide
      (effects (font (size 0.5 0.5) (thickness 0.1)))
    )
    (fp_text value "" (at -0.635 3.81) (layer F.Fab) hide
      (effects (font (size 1 1) (thickness 0.15)))
    )
    (pad "" thru_hole circle (at 0 0) (size 0.8 0.8) (drill 0.4) (layers *.Cu)
      (net 12 AGND) (zone_connect 2))
  )

  (module Wire_Pads:SolderWirePad_single_1-5mmDrill (layer F.Cu) (tedit 5BE5EDC2) (tstamp 5852BDC2)
    (at 183.388 80.01)
    (zone_connect 2)
    (fp_text reference "" (at 0 -3.81) (layer F.SilkS) hide
      (effects (font (size 0.5 0.5) (thickness 0.1)))
    )
    (fp_text value "" (at -0.635 3.81) (layer F.Fab) hide
      (effects (font (size 1 1) (thickness 0.15)))
    )
    (pad "" thru_hole circle (at 0 0) (size 0.8 0.8) (drill 0.4) (layers *.Cu)
      (net 12 AGND) (zone_connect 2))
  )

  (module Wire_Pads:SolderWirePad_single_1-5mmDrill (layer F.Cu) (tedit 5BE5EDF1) (tstamp 5852BDBE)
    (at 182.118 80.01)
    (zone_connect 2)
    (fp_text reference "" (at 0 -3.81) (layer F.SilkS) hide
      (effects (font (size 0.5 0.5) (thickness 0.1)))
    )
    (fp_text value "" (at -0.635 3.81) (layer F.Fab) hide
      (effects (font (size 1 1) (thickness 0.15)))
    )
    (pad "" thru_hole circle (at 0 0) (size 0.8 0.8) (drill 0.4) (layers *.Cu)
      (net 12 AGND) (zone_connect 2))
  )

  (module Wire_Pads:SolderWirePad_single_1-5mmDrill (layer F.Cu) (tedit 5BE5ED2A) (tstamp 5852BDB0)
    (at 163.957 81.026)
    (zone_connect 2)
    (fp_text reference "" (at 0 -3.81) (layer F.SilkS) hide
      (effects (font (size 0.5 0.5) (thickness 0.1)))
    )
    (fp_text value "" (at -0.635 3.81) (layer F.Fab) hide
      (effects (font (size 1 1) (thickness 0.15)))
    )
    (pad "" thru_hole circle (at 0 0) (size 0.8 0.8) (drill 0.4) (layers *.Cu)
      (net 12 AGND) (zone_connect 2))
  )

  (module RadIIS_footprints_NEW:CardEdgeConnector (layer B.Cu) (tedit 57937D71) (tstamp 57937F17)
    (at 154.7 80.4 180)
    (descr http://media.digikey.com/pdf/Data%20Sheets/AVX%20PDFs/00-9159-zzz-551-906.pdf)
    (path /57937BCE)
    (fp_text reference P1 (at 6.5 3 180) (layer F.SilkS) hide
      (effects (font (size 0.5 0.5) (thickness 0.1)) (justify mirror))
    )
    (fp_text value CONN_01X06 (at -0.3 -3.1) (layer F.Fab)
      (effects (font (size 1.2 1.2) (thickness 0.15)))
    )
    (fp_text user Lines->BoardOutline! (at 5.5 -3 180) (layer Cmts.User)
      (effects (font (size 1 1) (thickness 0.15)))
    )
    (fp_line (start 5.9 -1.8) (end 5.9 2.9) (layer Cmts.User) (width 0.15))
    (fp_line (start -5.9 -1.8) (end 5.9 -1.8) (layer Cmts.User) (width 0.15))
    (fp_line (start -5.9 -1.8) (end -5.9 2.9) (layer Cmts.User) (width 0.15))
    (pad 1 smd rect (at -5 0 180) (size 1 3) (layers B.Cu B.Mask)
      (net 14 A-2V0))
    (pad 2 smd rect (at -3 0 180) (size 1 3) (layers B.Cu B.Mask)
      (net 11 Pulse_Out))
    (pad 3 smd rect (at -1 0 180) (size 1 3) (layers B.Cu B.Mask)
      (net 12 AGND))
    (pad 4 smd rect (at 1 0 180) (size 1 3) (layers B.Cu B.Mask)
      (net 13 A3V3))
    (pad 5 smd rect (at 3 0 180) (size 1 3) (layers B.Cu B.Mask)
      (net 16 Temp_Out))
    (pad 6 smd rect (at 5 0 180) (size 1 3) (layers B.Cu B.Mask)
      (net 15 Bias_In+))
  )

  (module Wire_Pads:SolderWirePad_single_1-5mmDrill (layer F.Cu) (tedit 5BE5ED35) (tstamp 5852BC3B)
    (at 164.973 81.026)
    (zone_connect 2)
    (fp_text reference "" (at 0 -3.81) (layer F.SilkS) hide
      (effects (font (size 0.5 0.5) (thickness 0.1)))
    )
    (fp_text value "" (at -0.635 3.81) (layer F.Fab) hide
      (effects (font (size 1 1) (thickness 0.15)))
    )
    (pad "" thru_hole circle (at 0 0) (size 0.8 0.8) (drill 0.4) (layers *.Cu)
      (net 12 AGND) (zone_connect 2))
  )

  (module Capacitor_SMD:C_0603_1608Metric (layer F.Cu) (tedit 5B301BBE) (tstamp 5BE5F26E)
    (at 170.804 76.962 270)
    (descr "Capacitor SMD 0603 (1608 Metric), square (rectangular) end terminal, IPC_7351 nominal, (Body size source: http://www.tortai-tech.com/upload/download/2011102023233369053.pdf), generated with kicad-footprint-generator")
    (tags capacitor)
    (path /5742FEBC)
    (attr smd)
    (fp_text reference C1 (at -1.562 0.004) (layer F.SilkS)
      (effects (font (size 0.5 0.5) (thickness 0.1)))
    )
    (fp_text value 100pF (at 0 1.43 270) (layer F.Fab)
      (effects (font (size 1 1) (thickness 0.15)))
    )
    (fp_line (start -0.8 0.4) (end -0.8 -0.4) (layer F.Fab) (width 0.1))
    (fp_line (start -0.8 -0.4) (end 0.8 -0.4) (layer F.Fab) (width 0.1))
    (fp_line (start 0.8 -0.4) (end 0.8 0.4) (layer F.Fab) (width 0.1))
    (fp_line (start 0.8 0.4) (end -0.8 0.4) (layer F.Fab) (width 0.1))
    (fp_line (start -0.162779 -0.51) (end 0.162779 -0.51) (layer F.SilkS) (width 0.12))
    (fp_line (start -0.162779 0.51) (end 0.162779 0.51) (layer F.SilkS) (width 0.12))
    (fp_line (start -1.48 0.73) (end -1.48 -0.73) (layer F.CrtYd) (width 0.05))
    (fp_line (start -1.48 -0.73) (end 1.48 -0.73) (layer F.CrtYd) (width 0.05))
    (fp_line (start 1.48 -0.73) (end 1.48 0.73) (layer F.CrtYd) (width 0.05))
    (fp_line (start 1.48 0.73) (end -1.48 0.73) (layer F.CrtYd) (width 0.05))
    (pad 1 smd roundrect (at -0.7875 0 270) (size 0.875 0.95) (layers F.Cu F.Paste F.Mask) (roundrect_rratio 0.25)
      (net 11 Pulse_Out))
    (pad 2 smd roundrect (at 0.7875 0 270) (size 0.875 0.95) (layers F.Cu F.Paste F.Mask) (roundrect_rratio 0.25)
      (net 1 "Net-(C1-Pad2)"))
    (model ${KISYS3DMOD}/Capacitor_SMD.3dshapes/C_0603_1608Metric.wrl
      (at (xyz 0 0 0))
      (scale (xyz 1 1 1))
      (rotate (xyz 0 0 0))
    )
  )

  (module Capacitor_SMD:C_0603_1608Metric (layer F.Cu) (tedit 5B301BBE) (tstamp 5BE5F27E)
    (at 167.248 80.01 270)
    (descr "Capacitor SMD 0603 (1608 Metric), square (rectangular) end terminal, IPC_7351 nominal, (Body size source: http://www.tortai-tech.com/upload/download/2011102023233369053.pdf), generated with kicad-footprint-generator")
    (tags capacitor)
    (path /5742FEAE)
    (attr smd)
    (fp_text reference C2 (at 1.79 -0.052 180) (layer F.SilkS)
      (effects (font (size 0.5 0.5) (thickness 0.1)))
    )
    (fp_text value 100nF (at 0 1.43 270) (layer F.Fab)
      (effects (font (size 1 1) (thickness 0.15)))
    )
    (fp_line (start 1.48 0.73) (end -1.48 0.73) (layer F.CrtYd) (width 0.05))
    (fp_line (start 1.48 -0.73) (end 1.48 0.73) (layer F.CrtYd) (width 0.05))
    (fp_line (start -1.48 -0.73) (end 1.48 -0.73) (layer F.CrtYd) (width 0.05))
    (fp_line (start -1.48 0.73) (end -1.48 -0.73) (layer F.CrtYd) (width 0.05))
    (fp_line (start -0.162779 0.51) (end 0.162779 0.51) (layer F.SilkS) (width 0.12))
    (fp_line (start -0.162779 -0.51) (end 0.162779 -0.51) (layer F.SilkS) (width 0.12))
    (fp_line (start 0.8 0.4) (end -0.8 0.4) (layer F.Fab) (width 0.1))
    (fp_line (start 0.8 -0.4) (end 0.8 0.4) (layer F.Fab) (width 0.1))
    (fp_line (start -0.8 -0.4) (end 0.8 -0.4) (layer F.Fab) (width 0.1))
    (fp_line (start -0.8 0.4) (end -0.8 -0.4) (layer F.Fab) (width 0.1))
    (pad 2 smd roundrect (at 0.7875 0 270) (size 0.875 0.95) (layers F.Cu F.Paste F.Mask) (roundrect_rratio 0.25)
      (net 12 AGND))
    (pad 1 smd roundrect (at -0.7875 0 270) (size 0.875 0.95) (layers F.Cu F.Paste F.Mask) (roundrect_rratio 0.25)
      (net 2 "Net-(C2-Pad1)"))
    (model ${KISYS3DMOD}/Capacitor_SMD.3dshapes/C_0603_1608Metric.wrl
      (at (xyz 0 0 0))
      (scale (xyz 1 1 1))
      (rotate (xyz 0 0 0))
    )
  )

  (module Capacitor_SMD:C_0603_1608Metric (layer F.Cu) (tedit 5B301BBE) (tstamp 5BE5F28E)
    (at 187.8 72.1 90)
    (descr "Capacitor SMD 0603 (1608 Metric), square (rectangular) end terminal, IPC_7351 nominal, (Body size source: http://www.tortai-tech.com/upload/download/2011102023233369053.pdf), generated with kicad-footprint-generator")
    (tags capacitor)
    (path /5742FE7F)
    (attr smd)
    (fp_text reference C3 (at 0.6 -1.1 270) (layer F.SilkS)
      (effects (font (size 0.5 0.5) (thickness 0.1)))
    )
    (fp_text value 100nF (at 0 1.43 90) (layer F.Fab)
      (effects (font (size 1 1) (thickness 0.15)))
    )
    (fp_line (start 1.48 0.73) (end -1.48 0.73) (layer F.CrtYd) (width 0.05))
    (fp_line (start 1.48 -0.73) (end 1.48 0.73) (layer F.CrtYd) (width 0.05))
    (fp_line (start -1.48 -0.73) (end 1.48 -0.73) (layer F.CrtYd) (width 0.05))
    (fp_line (start -1.48 0.73) (end -1.48 -0.73) (layer F.CrtYd) (width 0.05))
    (fp_line (start -0.162779 0.51) (end 0.162779 0.51) (layer F.SilkS) (width 0.12))
    (fp_line (start -0.162779 -0.51) (end 0.162779 -0.51) (layer F.SilkS) (width 0.12))
    (fp_line (start 0.8 0.4) (end -0.8 0.4) (layer F.Fab) (width 0.1))
    (fp_line (start 0.8 -0.4) (end 0.8 0.4) (layer F.Fab) (width 0.1))
    (fp_line (start -0.8 -0.4) (end 0.8 -0.4) (layer F.Fab) (width 0.1))
    (fp_line (start -0.8 0.4) (end -0.8 -0.4) (layer F.Fab) (width 0.1))
    (pad 2 smd roundrect (at 0.7875 0 90) (size 0.875 0.95) (layers F.Cu F.Paste F.Mask) (roundrect_rratio 0.25)
      (net 10 /BiasF))
    (pad 1 smd roundrect (at -0.7875 0 90) (size 0.875 0.95) (layers F.Cu F.Paste F.Mask) (roundrect_rratio 0.25)
      (net 12 AGND))
    (model ${KISYS3DMOD}/Capacitor_SMD.3dshapes/C_0603_1608Metric.wrl
      (at (xyz 0 0 0))
      (scale (xyz 1 1 1))
      (rotate (xyz 0 0 0))
    )
  )

  (module Capacitor_SMD:C_0603_1608Metric (layer F.Cu) (tedit 5B301BBE) (tstamp 5BE5F29E)
    (at 176.6594 74.422)
    (descr "Capacitor SMD 0603 (1608 Metric), square (rectangular) end terminal, IPC_7351 nominal, (Body size source: http://www.tortai-tech.com/upload/download/2011102023233369053.pdf), generated with kicad-footprint-generator")
    (tags capacitor)
    (path /574D3A8A)
    (attr smd)
    (fp_text reference C4 (at 0 -1.022) (layer F.SilkS)
      (effects (font (size 0.5 0.5) (thickness 0.1)))
    )
    (fp_text value 100nF (at 0 1.43) (layer F.Fab)
      (effects (font (size 1 1) (thickness 0.15)))
    )
    (fp_line (start 1.48 0.73) (end -1.48 0.73) (layer F.CrtYd) (width 0.05))
    (fp_line (start 1.48 -0.73) (end 1.48 0.73) (layer F.CrtYd) (width 0.05))
    (fp_line (start -1.48 -0.73) (end 1.48 -0.73) (layer F.CrtYd) (width 0.05))
    (fp_line (start -1.48 0.73) (end -1.48 -0.73) (layer F.CrtYd) (width 0.05))
    (fp_line (start -0.162779 0.51) (end 0.162779 0.51) (layer F.SilkS) (width 0.12))
    (fp_line (start -0.162779 -0.51) (end 0.162779 -0.51) (layer F.SilkS) (width 0.12))
    (fp_line (start 0.8 0.4) (end -0.8 0.4) (layer F.Fab) (width 0.1))
    (fp_line (start 0.8 -0.4) (end 0.8 0.4) (layer F.Fab) (width 0.1))
    (fp_line (start -0.8 -0.4) (end 0.8 -0.4) (layer F.Fab) (width 0.1))
    (fp_line (start -0.8 0.4) (end -0.8 -0.4) (layer F.Fab) (width 0.1))
    (pad 2 smd roundrect (at 0.7875 0) (size 0.875 0.95) (layers F.Cu F.Paste F.Mask) (roundrect_rratio 0.25)
      (net 13 A3V3))
    (pad 1 smd roundrect (at -0.7875 0) (size 0.875 0.95) (layers F.Cu F.Paste F.Mask) (roundrect_rratio 0.25)
      (net 12 AGND))
    (model ${KISYS3DMOD}/Capacitor_SMD.3dshapes/C_0603_1608Metric.wrl
      (at (xyz 0 0 0))
      (scale (xyz 1 1 1))
      (rotate (xyz 0 0 0))
    )
  )

  (module Capacitor_SMD:C_0603_1608Metric (layer F.Cu) (tedit 5B301BBE) (tstamp 5BE5F2AE)
    (at 169.915 74.422 180)
    (descr "Capacitor SMD 0603 (1608 Metric), square (rectangular) end terminal, IPC_7351 nominal, (Body size source: http://www.tortai-tech.com/upload/download/2011102023233369053.pdf), generated with kicad-footprint-generator")
    (tags capacitor)
    (path /5742FF09)
    (attr smd)
    (fp_text reference C5 (at 0.015 1.022 180) (layer F.SilkS)
      (effects (font (size 0.5 0.5) (thickness 0.1)))
    )
    (fp_text value 100nF (at 0 1.43 180) (layer F.Fab)
      (effects (font (size 1 1) (thickness 0.15)))
    )
    (fp_line (start -0.8 0.4) (end -0.8 -0.4) (layer F.Fab) (width 0.1))
    (fp_line (start -0.8 -0.4) (end 0.8 -0.4) (layer F.Fab) (width 0.1))
    (fp_line (start 0.8 -0.4) (end 0.8 0.4) (layer F.Fab) (width 0.1))
    (fp_line (start 0.8 0.4) (end -0.8 0.4) (layer F.Fab) (width 0.1))
    (fp_line (start -0.162779 -0.51) (end 0.162779 -0.51) (layer F.SilkS) (width 0.12))
    (fp_line (start -0.162779 0.51) (end 0.162779 0.51) (layer F.SilkS) (width 0.12))
    (fp_line (start -1.48 0.73) (end -1.48 -0.73) (layer F.CrtYd) (width 0.05))
    (fp_line (start -1.48 -0.73) (end 1.48 -0.73) (layer F.CrtYd) (width 0.05))
    (fp_line (start 1.48 -0.73) (end 1.48 0.73) (layer F.CrtYd) (width 0.05))
    (fp_line (start 1.48 0.73) (end -1.48 0.73) (layer F.CrtYd) (width 0.05))
    (pad 1 smd roundrect (at -0.7875 0 180) (size 0.875 0.95) (layers F.Cu F.Paste F.Mask) (roundrect_rratio 0.25)
      (net 12 AGND))
    (pad 2 smd roundrect (at 0.7875 0 180) (size 0.875 0.95) (layers F.Cu F.Paste F.Mask) (roundrect_rratio 0.25)
      (net 13 A3V3))
    (model ${KISYS3DMOD}/Capacitor_SMD.3dshapes/C_0603_1608Metric.wrl
      (at (xyz 0 0 0))
      (scale (xyz 1 1 1))
      (rotate (xyz 0 0 0))
    )
  )

  (module Capacitor_SMD:C_0603_1608Metric (layer F.Cu) (tedit 5B301BBE) (tstamp 5BE5F2BE)
    (at 164.835 76.581)
    (descr "Capacitor SMD 0603 (1608 Metric), square (rectangular) end terminal, IPC_7351 nominal, (Body size source: http://www.tortai-tech.com/upload/download/2011102023233369053.pdf), generated with kicad-footprint-generator")
    (tags capacitor)
    (path /5742FF10)
    (attr smd)
    (fp_text reference C6 (at -0.035 -1.181) (layer F.SilkS)
      (effects (font (size 0.5 0.5) (thickness 0.1)))
    )
    (fp_text value 100nF (at 0 1.43) (layer F.Fab)
      (effects (font (size 1 1) (thickness 0.15)))
    )
    (fp_line (start -0.8 0.4) (end -0.8 -0.4) (layer F.Fab) (width 0.1))
    (fp_line (start -0.8 -0.4) (end 0.8 -0.4) (layer F.Fab) (width 0.1))
    (fp_line (start 0.8 -0.4) (end 0.8 0.4) (layer F.Fab) (width 0.1))
    (fp_line (start 0.8 0.4) (end -0.8 0.4) (layer F.Fab) (width 0.1))
    (fp_line (start -0.162779 -0.51) (end 0.162779 -0.51) (layer F.SilkS) (width 0.12))
    (fp_line (start -0.162779 0.51) (end 0.162779 0.51) (layer F.SilkS) (width 0.12))
    (fp_line (start -1.48 0.73) (end -1.48 -0.73) (layer F.CrtYd) (width 0.05))
    (fp_line (start -1.48 -0.73) (end 1.48 -0.73) (layer F.CrtYd) (width 0.05))
    (fp_line (start 1.48 -0.73) (end 1.48 0.73) (layer F.CrtYd) (width 0.05))
    (fp_line (start 1.48 0.73) (end -1.48 0.73) (layer F.CrtYd) (width 0.05))
    (pad 1 smd roundrect (at -0.7875 0) (size 0.875 0.95) (layers F.Cu F.Paste F.Mask) (roundrect_rratio 0.25)
      (net 12 AGND))
    (pad 2 smd roundrect (at 0.7875 0) (size 0.875 0.95) (layers F.Cu F.Paste F.Mask) (roundrect_rratio 0.25)
      (net 14 A-2V0))
    (model ${KISYS3DMOD}/Capacitor_SMD.3dshapes/C_0603_1608Metric.wrl
      (at (xyz 0 0 0))
      (scale (xyz 1 1 1))
      (rotate (xyz 0 0 0))
    )
  )

  (module Capacitor_SMD:C_0603_1608Metric (layer F.Cu) (tedit 5B301BBE) (tstamp 5BE5F2CE)
    (at 175.9602 76.6953 270)
    (descr "Capacitor SMD 0603 (1608 Metric), square (rectangular) end terminal, IPC_7351 nominal, (Body size source: http://www.tortai-tech.com/upload/download/2011102023233369053.pdf), generated with kicad-footprint-generator")
    (tags capacitor)
    (path /5742FEFB)
    (attr smd)
    (fp_text reference C7 (at -0.9953 -1.2398) (layer F.SilkS)
      (effects (font (size 0.5 0.5) (thickness 0.1)))
    )
    (fp_text value 100nF (at 0 1.43 270) (layer F.Fab)
      (effects (font (size 1 1) (thickness 0.15)))
    )
    (fp_line (start -0.8 0.4) (end -0.8 -0.4) (layer F.Fab) (width 0.1))
    (fp_line (start -0.8 -0.4) (end 0.8 -0.4) (layer F.Fab) (width 0.1))
    (fp_line (start 0.8 -0.4) (end 0.8 0.4) (layer F.Fab) (width 0.1))
    (fp_line (start 0.8 0.4) (end -0.8 0.4) (layer F.Fab) (width 0.1))
    (fp_line (start -0.162779 -0.51) (end 0.162779 -0.51) (layer F.SilkS) (width 0.12))
    (fp_line (start -0.162779 0.51) (end 0.162779 0.51) (layer F.SilkS) (width 0.12))
    (fp_line (start -1.48 0.73) (end -1.48 -0.73) (layer F.CrtYd) (width 0.05))
    (fp_line (start -1.48 -0.73) (end 1.48 -0.73) (layer F.CrtYd) (width 0.05))
    (fp_line (start 1.48 -0.73) (end 1.48 0.73) (layer F.CrtYd) (width 0.05))
    (fp_line (start 1.48 0.73) (end -1.48 0.73) (layer F.CrtYd) (width 0.05))
    (pad 1 smd roundrect (at -0.7875 0 270) (size 0.875 0.95) (layers F.Cu F.Paste F.Mask) (roundrect_rratio 0.25)
      (net 12 AGND))
    (pad 2 smd roundrect (at 0.7875 0 270) (size 0.875 0.95) (layers F.Cu F.Paste F.Mask) (roundrect_rratio 0.25)
      (net 13 A3V3))
    (model ${KISYS3DMOD}/Capacitor_SMD.3dshapes/C_0603_1608Metric.wrl
      (at (xyz 0 0 0))
      (scale (xyz 1 1 1))
      (rotate (xyz 0 0 0))
    )
  )

  (module Capacitor_SMD:C_0603_1608Metric (layer F.Cu) (tedit 5B301BBE) (tstamp 5BE5F2DE)
    (at 179.844 81.28 180)
    (descr "Capacitor SMD 0603 (1608 Metric), square (rectangular) end terminal, IPC_7351 nominal, (Body size source: http://www.tortai-tech.com/upload/download/2011102023233369053.pdf), generated with kicad-footprint-generator")
    (tags capacitor)
    (path /5742FF02)
    (attr smd)
    (fp_text reference C8 (at 0.244 0.88 180) (layer F.SilkS)
      (effects (font (size 0.5 0.5) (thickness 0.1)))
    )
    (fp_text value 100nF (at 0 1.43 180) (layer F.Fab)
      (effects (font (size 1 1) (thickness 0.15)))
    )
    (fp_line (start -0.8 0.4) (end -0.8 -0.4) (layer F.Fab) (width 0.1))
    (fp_line (start -0.8 -0.4) (end 0.8 -0.4) (layer F.Fab) (width 0.1))
    (fp_line (start 0.8 -0.4) (end 0.8 0.4) (layer F.Fab) (width 0.1))
    (fp_line (start 0.8 0.4) (end -0.8 0.4) (layer F.Fab) (width 0.1))
    (fp_line (start -0.162779 -0.51) (end 0.162779 -0.51) (layer F.SilkS) (width 0.12))
    (fp_line (start -0.162779 0.51) (end 0.162779 0.51) (layer F.SilkS) (width 0.12))
    (fp_line (start -1.48 0.73) (end -1.48 -0.73) (layer F.CrtYd) (width 0.05))
    (fp_line (start -1.48 -0.73) (end 1.48 -0.73) (layer F.CrtYd) (width 0.05))
    (fp_line (start 1.48 -0.73) (end 1.48 0.73) (layer F.CrtYd) (width 0.05))
    (fp_line (start 1.48 0.73) (end -1.48 0.73) (layer F.CrtYd) (width 0.05))
    (pad 1 smd roundrect (at -0.7875 0 180) (size 0.875 0.95) (layers F.Cu F.Paste F.Mask) (roundrect_rratio 0.25)
      (net 12 AGND))
    (pad 2 smd roundrect (at 0.7875 0 180) (size 0.875 0.95) (layers F.Cu F.Paste F.Mask) (roundrect_rratio 0.25)
      (net 14 A-2V0))
    (model ${KISYS3DMOD}/Capacitor_SMD.3dshapes/C_0603_1608Metric.wrl
      (at (xyz 0 0 0))
      (scale (xyz 1 1 1))
      (rotate (xyz 0 0 0))
    )
  )

  (module Capacitor_SMD:C_0603_1608Metric (layer F.Cu) (tedit 5B301BBE) (tstamp 5BE5F2EE)
    (at 173.84 81.28 180)
    (descr "Capacitor SMD 0603 (1608 Metric), square (rectangular) end terminal, IPC_7351 nominal, (Body size source: http://www.tortai-tech.com/upload/download/2011102023233369053.pdf), generated with kicad-footprint-generator")
    (tags capacitor)
    (path /575FFDB4)
    (attr smd)
    (fp_text reference C9 (at 0.04 0.88 180) (layer F.SilkS)
      (effects (font (size 0.5 0.5) (thickness 0.1)))
    )
    (fp_text value 1nF (at 0 1.43 180) (layer F.Fab)
      (effects (font (size 1 1) (thickness 0.15)))
    )
    (fp_line (start 1.48 0.73) (end -1.48 0.73) (layer F.CrtYd) (width 0.05))
    (fp_line (start 1.48 -0.73) (end 1.48 0.73) (layer F.CrtYd) (width 0.05))
    (fp_line (start -1.48 -0.73) (end 1.48 -0.73) (layer F.CrtYd) (width 0.05))
    (fp_line (start -1.48 0.73) (end -1.48 -0.73) (layer F.CrtYd) (width 0.05))
    (fp_line (start -0.162779 0.51) (end 0.162779 0.51) (layer F.SilkS) (width 0.12))
    (fp_line (start -0.162779 -0.51) (end 0.162779 -0.51) (layer F.SilkS) (width 0.12))
    (fp_line (start 0.8 0.4) (end -0.8 0.4) (layer F.Fab) (width 0.1))
    (fp_line (start 0.8 -0.4) (end 0.8 0.4) (layer F.Fab) (width 0.1))
    (fp_line (start -0.8 -0.4) (end 0.8 -0.4) (layer F.Fab) (width 0.1))
    (fp_line (start -0.8 0.4) (end -0.8 -0.4) (layer F.Fab) (width 0.1))
    (pad 2 smd roundrect (at 0.7875 0 180) (size 0.875 0.95) (layers F.Cu F.Paste F.Mask) (roundrect_rratio 0.25)
      (net 4 "Net-(C9-Pad2)"))
    (pad 1 smd roundrect (at -0.7875 0 180) (size 0.875 0.95) (layers F.Cu F.Paste F.Mask) (roundrect_rratio 0.25)
      (net 3 "Net-(C9-Pad1)"))
    (model ${KISYS3DMOD}/Capacitor_SMD.3dshapes/C_0603_1608Metric.wrl
      (at (xyz 0 0 0))
      (scale (xyz 1 1 1))
      (rotate (xyz 0 0 0))
    )
  )

  (module Capacitor_SMD:C_0603_1608Metric (layer F.Cu) (tedit 5B301BBE) (tstamp 5BE5F2FE)
    (at 172.455 76.962 90)
    (descr "Capacitor SMD 0603 (1608 Metric), square (rectangular) end terminal, IPC_7351 nominal, (Body size source: http://www.tortai-tech.com/upload/download/2011102023233369053.pdf), generated with kicad-footprint-generator")
    (tags capacitor)
    (path /576002EE)
    (attr smd)
    (fp_text reference C10 (at 1.662 -0.055 180) (layer F.SilkS)
      (effects (font (size 0.5 0.5) (thickness 0.1)))
    )
    (fp_text value 100p (at 0 1.43 90) (layer F.Fab)
      (effects (font (size 1 1) (thickness 0.15)))
    )
    (fp_line (start 1.48 0.73) (end -1.48 0.73) (layer F.CrtYd) (width 0.05))
    (fp_line (start 1.48 -0.73) (end 1.48 0.73) (layer F.CrtYd) (width 0.05))
    (fp_line (start -1.48 -0.73) (end 1.48 -0.73) (layer F.CrtYd) (width 0.05))
    (fp_line (start -1.48 0.73) (end -1.48 -0.73) (layer F.CrtYd) (width 0.05))
    (fp_line (start -0.162779 0.51) (end 0.162779 0.51) (layer F.SilkS) (width 0.12))
