(kicad_pcb (version 20171130) (host pcbnew 5.0.2-bee76a0~70~ubuntu16.04.1)

  (general
    (thickness 0.15)
    (drawings 9)
    (tracks 0)
    (zones 0)
    (modules 2)
    (nets 13)
  )

  (page A4)
  (layers
    (0 F.Cu signal)
    (31 B.Cu signal)
    (32 B.Adhes user)
    (33 F.Adhes user)
    (34 B.Paste user)
    (35 F.Paste user)
    (36 B.SilkS user)
    (37 F.SilkS user)
    (38 B.Mask user)
    (39 F.Mask user)
    (40 Dwgs.User user)
    (41 Cmts.User user)
    (42 Eco1.User user)
    (43 Eco2.User user)
    (44 Edge.Cuts user)
    (45 Margin user)
    (46 B.CrtYd user)
    (47 F.CrtYd user)
    (48 B.Fab user)
    (49 F.Fab user)
  )

  (setup
    (last_trace_width 0.1)
    (user_trace_width 0.2)
    (user_trace_width 0.3)
    (user_trace_width 0.4)
    (user_trace_width 0.5)
    (trace_clearance 0.1)
    (zone_clearance 0.2)
    (zone_45_only no)
    (trace_min 0.1)
    (segment_width 0.2)
    (edge_width 0.15)
    (via_size 0.6)
    (via_drill 0.4)
    (via_min_size 0.45)
    (via_min_drill 0.2)
    (user_via 0.45 0.2)
    (uvia_size 0.45)
    (uvia_drill 0.2)
    (uvias_allowed yes)
    (uvia_min_size 0.45)
    (uvia_min_drill 0.2)
    (pcb_text_width 0.3)
    (pcb_text_size 1.5 1.5)
    (mod_edge_width 0.15)
    (mod_text_size 1 1)
    (mod_text_width 0.15)
    (pad_size 1.3 1.3)
    (pad_drill 1.1)
    (pad_to_mask_clearance 0.2)
    (solder_mask_min_width 0.25)
    (aux_axis_origin 0 0)
    (visible_elements FFFFFF7F)
    (pcbplotparams
      (layerselection 0x01000_fffffffe)
      (usegerberextensions false)
      (usegerberattributes false)
      (usegerberadvancedattributes false)
      (creategerberjobfile false)
      (excludeedgelayer true)
      (linewidth 0.100000)
      (plotframeref false)
      (viasonmask false)
      (mode 1)
      (useauxorigin false)
      (hpglpennumber 1)
      (hpglpenspeed 20)
      (hpglpendiameter 15.000000)
      (psnegative false)
      (psa4output false)
      (plotreference true)
      (plotvalue true)
      (plotinvisibletext false)
      (padsonsilk false)
      (subtractmaskfromsilk false)
      (outputformat 1)
      (mirror false)
      (drillshape 0)
      (scaleselection 1)
      (outputdirectory "Gerber/"))
  )

  (net 0 "")
  (net 1 /Ext_RX)
  (net 2 /Ext_GPIO0)
  (net 3 /Ext_Vin)
  (net 4 /Ext_Bat)
  (net 5 /Ext_DGND)
  (net 6 /Ext_TX)
  (net 7 /Ext_AGND)
  (net 8 /Ext_Ain)
  (net 9 /Ext_Bout)
  (net 10 /Ext_3.3Va)
  (net 11 /Ext_-2Va)
  (net 12 /Ext_Misc)

  (net_class Default "This is the default net class."
    (clearance 0.1)
    (trace_width 0.1)
    (via_dia 0.6)
    (via_drill 0.4)
    (uvia_dia 0.45)
    (uvia_drill 0.2)
    (add_net /Ext_-2Va)
    (add_net /Ext_3.3Va)
    (add_net /Ext_AGND)
    (add_net /Ext_Ain)
    (add_net /Ext_Bat)
    (add_net /Ext_DGND)
    (add_net /Ext_GPIO0)
    (add_net /Ext_Misc)
    (add_net /Ext_RX)
    (add_net /Ext_TX)
  )

  (net_class 30V+ ""
    (clearance 0.2)
    (trace_width 0.1)
    (via_dia 0.6)
    (via_drill 0.4)
    (uvia_dia 0.45)
    (uvia_drill 0.2)
    (add_net /Ext_Bout)
    (add_net /Ext_Vin)
  )

  (module w_conn_misc:HR30-8R-12SD (layer F.Cu) (tedit 5C911C0A) (tstamp 5A01A5FF)
    (at 100 100)
    (path /59E898F3)
    (fp_text reference J1 (at -2.77 1.24 -270) (layer F.SilkS)
      (effects (font (size 1 1) (thickness 0.15)))
    )
    (fp_text value Conn_01x12 (at -11 0) (layer F.Fab)
      (effects (font (size 1 1) (thickness 0.15)))
    )
    (fp_circle (center 0 0) (end 4.625 0) (layer F.SilkS) (width 0.15))
    (pad 2 thru_hole circle (at 0 -1.83) (size 1.3 1.3) (drill 1.1) (layers *.Cu *.Mask)
      (net 7 /Ext_AGND))
    (pad 3 thru_hole circle (at 1.44 -1.83) (size 1.3 1.3) (drill 1.1) (layers *.Cu *.Mask)
      (net 8 /Ext_Ain))
    (pad 1 thru_hole circle (at -1.44 -1.83) (size 1.3 1.3) (drill 1.1) (layers *.Cu *.Mask)
      (net 5 /Ext_DGND))
    (pad 6 thru_hole circle (at 0.72 -0.48) (size 1.3 1.3) (drill 1.1) (layers *.Cu *.Mask)
      (net 12 /Ext_Misc))
    (pad 5 thru_hole circle (at -0.72 -0.48) (size 1.3 1.3) (drill 1.1) (layers *.Cu *.Mask)
      (net 2 /Ext_GPIO0))
    (pad 4 thru_hole circle (at -2.16 -0.48) (size 1.3 1.3) (drill 1.1) (layers *.Cu *.Mask)
      (net 3 /Ext_Vin))
    (pad 7 thru_hole circle (at 2.16 -0.48) (size 1.3 1.3) (drill 1.1) (layers *.Cu *.Mask)
      (net 11 /Ext_-2Va))
    (pad 10 thru_hole circle (at 1.44 0.87) (size 1.3 1.3) (drill 1.1) (layers *.Cu *.Mask)
      (net 10 /Ext_3.3Va))
    (pad 9 thru_hole circle (at 0 0.87) (size 1.3 1.3) (drill 1.1) (layers *.Cu *.Mask)
      (net 6 /Ext_TX))
    (pad 8 thru_hole circle (at -1.44 0.87) (size 1.3 1.3) (drill 1.1) (layers *.Cu *.Mask)
      (net 1 /Ext_RX))
    (pad 12 thru_hole circle (at 0.72 2.22) (size 1.3 1.3) (drill 1.1) (layers *.Cu *.Mask)
      (net 9 /Ext_Bout))
    (pad 11 thru_hole circle (at -0.72 2.22) (size 1.3 1.3) (drill 1.1) (layers *.Cu *.Mask)
      (net 4 /Ext_Bat))
  )

  (module Connector_FFC-FPC:Hirose_FH12-12S-0.5SH_1x12-1MP_P0.50mm_Horizontal (layer B.Cu) (tedit 5AEE0F8A) (tstamp 5C7D4196)
    (at 90.9 100.5)
    (descr "Molex FH12, FFC/FPC connector, FH12-12S-0.5SH, 12 Pins per row (https://www.hirose.com/product/en/products/FH12/FH12-24S-0.5SH(55)/), generated with kicad-footprint-generator")
    (tags "connector Hirose  top entry")
    (path /59E89970)
    (attr smd)
    (fp_text reference J2 (at -2.34 -1.08) (layer B.SilkS)
      (effects (font (size 1 1) (thickness 0.15)) (justify mirror))
    )
    (fp_text value Conn_01x12 (at -0.498 -7.948) (layer B.Fab)
      (effects (font (size 1 1) (thickness 0.15)) (justify mirror))
    )
    (fp_line (start 0 1.2) (end -4.55 1.2) (layer B.Fab) (width 0.1))
    (fp_line (start -4.55 1.2) (end -4.55 -3.4) (layer B.Fab) (width 0.1))
    (fp_line (start -4.55 -3.4) (end -3.95 -3.4) (layer B.Fab) (width 0.1))
    (fp_line (start -3.95 -3.4) (end -3.95 -3.7) (layer B.Fab) (width 0.1))
    (fp_line (start -3.95 -3.7) (end -4.45 -3.7) (layer B.Fab) (width 0.1))
    (fp_line (start -4.45 -3.7) (end -4.45 -4.4) (layer B.Fab) (width 0.1))
    (fp_line (start -4.45 -4.4) (end 0 -4.4) (layer B.Fab) (width 0.1))
    (fp_line (start 0 1.2) (end 4.55 1.2) (layer B.Fab) (width 0.1))
    (fp_line (start 4.55 1.2) (end 4.55 -3.4) (layer B.Fab) (width 0.1))
    (fp_line (start 4.55 -3.4) (end 3.95 -3.4) (layer B.Fab) (width 0.1))
    (fp_line (start 3.95 -3.4) (end 3.95 -3.7) (layer B.Fab) (width 0.1))
    (fp_line (start 3.95 -3.7) (end 4.45 -3.7) (layer B.Fab) (width 0.1))
    (fp_line (start 4.45 -3.7) (end 4.45 -4.4) (layer B.Fab) (width 0.1))
    (fp_line (start 4.45 -4.4) (end 0 -4.4) (layer B.Fab) (width 0.1))
    (fp_line (start -3.16 1.3) (end -4.65 1.3) (layer B.SilkS) (width 0.12))
    (fp_line (start -4.65 1.3) (end -4.65 -0.04) (layer B.SilkS) (width 0.12))
    (fp_line (start 3.16 1.3) (end 4.65 1.3) (layer B.SilkS) (width 0.12))
    (fp_line (start 4.65 1.3) (end 4.65 -0.04) (layer B.SilkS) (width 0.12))
    (fp_line (start -4.65 -2.76) (end -4.65 -4.5) (layer B.SilkS) (width 0.12))
    (fp_line (start -4.65 -4.5) (end 4.65 -4.5) (layer B.SilkS) (width 0.12))
    (fp_line (start 4.65 -4.5) (end 4.65 -2.76) (layer B.SilkS) (width 0.12))
    (fp_line (start -3.16 1.3) (end -3.16 2.5) (layer B.SilkS) (width 0.12))
    (fp_line (start -3.25 1.2) (end -2.75 0.492893) (layer B.Fab) (width 0.1))
    (fp_line (start -2.75 0.492893) (end -2.25 1.2) (layer B.Fab) (width 0.1))
    (fp_line (start -6.05 3) (end -6.05 -4.9) (layer B.CrtYd) (width 0.05))
    (fp_line (start -6.05 -4.9) (end 6.05 -4.9) (layer B.CrtYd) (width 0.05))
    (fp_line (start 6.05 -4.9) (end 6.05 3) (layer B.CrtYd) (width 0.05))
    (fp_line (start 6.05 3) (end -6.05 3) (layer B.CrtYd) (width 0.05))
    (fp_text user %R (at 0 -3.7) (layer B.Fab)
      (effects (font (size 1 1) (thickness 0.15)) (justify mirror))
    )
    (pad MP smd rect (at 4.65 -1.4) (size 1.8 2.2) (layers B.Cu B.Paste B.Mask))
    (pad MP smd rect (at -4.65 -1.4) (size 1.8 2.2) (layers B.Cu B.Paste B.Mask))
    (pad 1 smd rect (at -2.75 1.85) (size 0.3 1.3) (layers B.Cu B.Paste B.Mask)
      (net 11 /Ext_-2Va))
    (pad 2 smd rect (at -2.25 1.85) (size 0.3 1.3) (layers B.Cu B.Paste B.Mask)
      (net 8 /Ext_Ain))
    (pad 3 smd rect (at -1.75 1.85) (size 0.3 1.3) (layers B.Cu B.Paste B.Mask)
      (net 7 /Ext_AGND))
    (pad 4 smd rect (at -1.25 1.85) (size 0.3 1.3) (layers B.Cu B.Paste B.Mask)
      (net 12 /Ext_Misc))
    (pad 5 smd rect (at -0.75 1.85) (size 0.3 1.3) (layers B.Cu B.Paste B.Mask)
      (net 10 /Ext_3.3Va))
    (pad 6 smd rect (at -0.25 1.85) (size 0.3 1.3) (layers B.Cu B.Paste B.Mask)
      (net 9 /Ext_Bout))
    (pad 7 smd rect (at 0.25 1.85) (size 0.3 1.3) (layers B.Cu B.Paste B.Mask)
      (net 4 /Ext_Bat))
    (pad 8 smd rect (at 0.75 1.85) (size 0.3 1.3) (layers B.Cu B.Paste B.Mask)
      (net 6 /Ext_TX))
    (pad 9 smd rect (at 1.25 1.85) (size 0.3 1.3) (layers B.Cu B.Paste B.Mask)
      (net 1 /Ext_RX))
    (pad 10 smd rect (at 1.75 1.85) (size 0.3 1.3) (layers B.Cu B.Paste B.Mask)
      (net 2 /Ext_GPIO0))
    (pad 11 smd rect (at 2.25 1.85) (size 0.3 1.3) (layers B.Cu B.Paste B.Mask)
      (net 3 /Ext_Vin))
    (pad 12 smd rect (at 2.75 1.85) (size 0.3 1.3) (layers B.Cu B.Paste B.Mask)
      (net 5 /Ext_DGND))
    (model ${KISYS3DMOD}/Connector_FFC-FPC.3dshapes/Hirose_FH12-12S-0.5SH_1x12-1MP_P0.50mm_Horizontal.wrl
      (at (xyz 0 0 0))
      (scale (xyz 1 1 1))
      (rotate (xyz 0 0 0))
    )
  )

  (dimension 19.102355 (width 0.3) (layer F.SilkS)
    (gr_text "19,102 mm" (at 94.448822 111.9) (layer F.SilkS)
      (effects (font (size 1.5 1.5) (thickness 0.3)))
    )
    (feature1 (pts (xy 84.897645 100) (xy 84.897645 110.386421)))
    (feature2 (pts (xy 104 100) (xy 104 110.386421)))
    (crossbar (pts (xy 104 109.8) (xy 84.897645 109.8)))
    (arrow1a (pts (xy 84.897645 109.8) (xy 86.024149 109.213579)))
    (arrow1b (pts (xy 84.897645 109.8) (xy 86.024149 110.386421)))
    (arrow2a (pts (xy 104 109.8) (xy 102.873496 109.213579)))
    (arrow2b (pts (xy 104 109.8) (xy 102.873496 110.386421)))
  )
  (dimension 8 (width 0.3) (layer F.SilkS)
    (gr_text "8,000 mm" (at 112.3 100 270) (layer F.SilkS)
      (effects (font (size 1.5 1.5) (thickness 0.3)))
    )
    (feature1 (pts (xy 97.1 104) (xy 110.786421 104)))
    (feature2 (pts (xy 97.1 96) (xy 110.786421 96)))
    (crossbar (pts (xy 110.2 96) (xy 110.2 104)))
    (arrow1a (pts (xy 110.2 104) (xy 109.613579 102.873496)))
    (arrow1b (pts (xy 110.2 104) (xy 110.786421 102.873496)))
    (arrow2a (pts (xy 110.2 96) (xy 109.613579 97.126504)))
    (arrow2b (pts (xy 110.2 96) (xy 110.786421 97.126504)))
  )
  (gr_line (start 86.5 104) (end 100 104) (layer Edge.Cuts) (width 0.15))
  (gr_line (start 86.4 103.9) (end 86.5 104) (layer Edge.Cuts) (width 0.15))
  (gr_line (start 84.9 102.4) (end 86.4 103.9) (layer Edge.Cuts) (width 0.15))
  (gr_line (start 84.9 97.6) (end 84.9 102.4) (layer Edge.Cuts) (width 0.15))
  (gr_line (start 86.5 96) (end 84.9 97.6) (layer Edge.Cuts) (width 0.15))
  (gr_line (start 100 96) (end 86.5 96) (layer Edge.Cuts) (width 0.15))
  (gr_arc (start 100 100) (end 100 96) (angle 180) (layer Edge.Cuts) (width 0.15))

)
