(kicad_pcb (version 20171130) (host pcbnew 5.1.3-ffb9f22~84~ubuntu18.04.1)

  (general
    (thickness 1.6)
    (drawings 12)
    (tracks 12)
    (zones 0)
    (modules 6)
    (nets 6)
  )

  (page A4)
  (layers
    (0 F.Cu signal)
    (31 B.Cu signal)
    (32 B.Adhes user)
    (33 F.Adhes user)
    (34 B.Paste user)
    (35 F.Paste user)
    (36 B.SilkS user)
    (37 F.SilkS user)
    (38 B.Mask user)
    (39 F.Mask user)
    (40 Dwgs.User user)
    (41 Cmts.User user)
    (42 Eco1.User user)
    (43 Eco2.User user)
    (44 Edge.Cuts user)
    (45 Margin user)
    (46 B.CrtYd user)
    (47 F.CrtYd user hide)
    (48 B.Fab user)
    (49 F.Fab user hide)
  )

  (setup
    (last_trace_width 0.25)
    (user_trace_width 0.6)
    (user_trace_width 0.8)
    (user_trace_width 1)
    (trace_clearance 0.2)
    (zone_clearance 0.508)
    (zone_45_only no)
    (trace_min 0.2)
    (via_size 0.8)
    (via_drill 0.4)
    (via_min_size 0.4)
    (via_min_drill 0.3)
    (uvia_size 0.3)
    (uvia_drill 0.1)
    (uvias_allowed no)
    (uvia_min_size 0.2)
    (uvia_min_drill 0.1)
    (edge_width 0.15)
    (segment_width 0.2)
    (pcb_text_width 0.3)
    (pcb_text_size 1.5 1.5)
    (mod_edge_width 0.15)
    (mod_text_size 1 1)
    (mod_text_width 0.15)
    (pad_size 2 2)
    (pad_drill 0)
    (pad_to_mask_clearance 0.2)
    (solder_mask_min_width 0.25)
    (aux_axis_origin 0 0)
    (visible_elements FFFFFF7F)
    (pcbplotparams
      (layerselection 0x010fc_ffffffff)
      (usegerberextensions false)
      (usegerberattributes false)
      (usegerberadvancedattributes false)
      (creategerberjobfile false)
      (excludeedgelayer true)
      (linewidth 0.100000)
      (plotframeref false)
      (viasonmask false)
      (mode 1)
      (useauxorigin false)
      (hpglpennumber 1)
      (hpglpenspeed 20)
      (hpglpendiameter 15.000000)
      (psnegative false)
      (psa4output false)
      (plotreference true)
      (plotvalue true)
      (plotinvisibletext false)
      (padsonsilk false)
      (subtractmaskfromsilk false)
      (outputformat 1)
      (mirror false)
      (drillshape 0)
      (scaleselection 1)
      (outputdirectory "Gerber/"))
  )

  (net 0 "")
  (net 1 "Net-(SW1-Pad2)")
  (net 2 "Net-(SW1-Pad1)")
  (net 3 "Net-(SW1-Pad5)")
  (net 4 "Net-(SW1-Pad6)")
  (net 5 "Net-(SW1-Pad4)")

  (net_class Default "This is the default net class."
    (clearance 0.2)
    (trace_width 0.25)
    (via_dia 0.8)
    (via_drill 0.4)
    (uvia_dia 0.3)
    (uvia_drill 0.1)
    (add_net "Net-(SW1-Pad1)")
    (add_net "Net-(SW1-Pad2)")
    (add_net "Net-(SW1-Pad4)")
    (add_net "Net-(SW1-Pad5)")
    (add_net "Net-(SW1-Pad6)")
  )

  (module RadIIS_BUTTON_PCB:MBP16_RGB_PCB (layer F.Cu) (tedit 5D389B4E) (tstamp 5BCB8086)
    (at 100 100)
    (path /5BBD16D6)
    (fp_text reference SW1 (at 3.328 -8.008) (layer F.SilkS) hide
      (effects (font (size 1 1) (thickness 0.15)))
    )
    (fp_text value SW_Push_LED (at 3.79 4.27) (layer F.Fab)
      (effects (font (size 1 1) (thickness 0.15)))
    )
    (fp_line (start 1.88 -2.11) (end 2.88 -2.11) (layer F.SilkS) (width 0.15))
    (fp_line (start 2.38 -1.61) (end 2.38 -2.61) (layer F.SilkS) (width 0.15))
    (fp_text user R (at -10.896 -0.388) (layer F.SilkS) hide
      (effects (font (size 1 1) (thickness 0.15)))
    )
    (fp_text user G (at -4.292 -0.388) (layer F.SilkS) hide
      (effects (font (size 1 1) (thickness 0.15)))
    )
    (fp_text user B (at -10.896 -4.96) (layer F.SilkS) hide
      (effects (font (size 1 1) (thickness 0.15)))
    )
    (fp_circle (center 0 0) (end 7 0) (layer Dwgs.User) (width 0.15))
    (pad 2 thru_hole oval (at 0 -4.7) (size 4.2 1.6) (drill oval 3.2 0.6) (layers *.Cu *.Mask)
      (net 1 "Net-(SW1-Pad2)") (solder_mask_margin 0.05))
    (pad 1 thru_hole oval (at 0 4.7) (size 4.2 1.6) (drill oval 3.2 0.6) (layers *.Cu *.Mask)
      (net 2 "Net-(SW1-Pad1)") (solder_mask_margin 0.05))
    (pad 3 thru_hole circle (at 2 -0.9) (size 1.2 1.2) (drill 0.6) (layers *.Cu *.Mask)
      (net 1 "Net-(SW1-Pad2)") (solder_mask_margin 0.05))
    (pad 5 thru_hole circle (at 2 0.9) (size 1.2 1.2) (drill 0.6) (layers *.Cu *.Mask)
      (net 3 "Net-(SW1-Pad5)") (solder_mask_margin 0.05))
    (pad 6 thru_hole circle (at -4.7 -0.9) (size 1.2 1.2) (drill 0.6) (layers *.Cu *.Mask)
      (net 4 "Net-(SW1-Pad6)") (solder_mask_margin 0.05))
    (pad 4 thru_hole circle (at -4.7 0.9) (size 1.2 1.2) (drill 0.6) (layers *.Cu *.Mask)
      (net 5 "Net-(SW1-Pad4)") (solder_mask_margin 0.05))
    (model ${KIPRJMOD}/LocalLib/3D/MPB16_CBRE_RGB_JR_0V.step
      (offset (xyz -5.5 0 14.5))
      (scale (xyz 1 1 1))
      (rotate (xyz -90 0 180))
    )
  )

  (module TestPoint:TestPoint_Pad_2.0x2.0mm (layer B.Cu) (tedit 5BD058A0) (tstamp 5BCB942E)
    (at 97.3 98)
    (descr "SMD rectangular pad as test Point, square 2.0mm side length")
    (tags "test point SMD pad rectangle square")
    (path /5BBD1C14)
    (attr virtual)
    (fp_text reference TP4 (at 0 1.998) (layer B.SilkS) hide
      (effects (font (size 1 1) (thickness 0.15)) (justify mirror))
    )
    (fp_text value Pad (at 0 -2.05) (layer B.Fab)
      (effects (font (size 1 1) (thickness 0.15)) (justify mirror))
    )
    (fp_line (start 1.5 -1.5) (end -1.5 -1.5) (layer B.CrtYd) (width 0.05))
    (fp_line (start 1.5 -1.5) (end 1.5 1.5) (layer B.CrtYd) (width 0.05))
    (fp_line (start -1.5 1.5) (end -1.5 -1.5) (layer B.CrtYd) (width 0.05))
    (fp_line (start -1.5 1.5) (end 1.5 1.5) (layer B.CrtYd) (width 0.05))
    (fp_line (start -1.2 -1.2) (end -1.2 1.2) (layer B.SilkS) (width 0.12))
    (fp_line (start 1.2 -1.2) (end -1.2 -1.2) (layer B.SilkS) (width 0.12))
    (fp_line (start 1.2 1.2) (end 1.2 -1.2) (layer B.SilkS) (width 0.12))
    (fp_line (start -1.2 1.2) (end 1.2 1.2) (layer B.SilkS) (width 0.12))
    (fp_text user %R (at 0 2) (layer B.Fab)
      (effects (font (size 1 1) (thickness 0.15)) (justify mirror))
    )
    (pad 1 smd rect (at 0 0) (size 2 2) (layers B.Cu B.Mask)
      (net 4 "Net-(SW1-Pad6)") (solder_mask_margin 0.05))
  )

  (module TestPoint:TestPoint_Pad_2.0x2.0mm (layer B.Cu) (tedit 5BD058C3) (tstamp 5BCB9407)
    (at 97.3 102)
    (descr "SMD rectangular pad as test Point, square 2.0mm side length")
    (tags "test point SMD pad rectangle square")
    (path /5BBD1B8E)
    (attr virtual)
    (fp_text reference TP2 (at 0 1.998) (layer B.SilkS) hide
      (effects (font (size 1 1) (thickness 0.15)) (justify mirror))
    )
    (fp_text value Pad (at 0 -2.05) (layer B.Fab)
      (effects (font (size 1 1) (thickness 0.15)) (justify mirror))
    )
    (fp_line (start 1.5 -1.5) (end -1.5 -1.5) (layer B.CrtYd) (width 0.05))
    (fp_line (start 1.5 -1.5) (end 1.5 1.5) (layer B.CrtYd) (width 0.05))
    (fp_line (start -1.5 1.5) (end -1.5 -1.5) (layer B.CrtYd) (width 0.05))
    (fp_line (start -1.5 1.5) (end 1.5 1.5) (layer B.CrtYd) (width 0.05))
    (fp_line (start -1.2 -1.2) (end -1.2 1.2) (layer B.SilkS) (width 0.12))
    (fp_line (start 1.2 -1.2) (end -1.2 -1.2) (layer B.SilkS) (width 0.12))
    (fp_line (start 1.2 1.2) (end 1.2 -1.2) (layer B.SilkS) (width 0.12))
    (fp_line (start -1.2 1.2) (end 1.2 1.2) (layer B.SilkS) (width 0.12))
    (fp_text user %R (at 0 2) (layer B.Fab)
      (effects (font (size 1 1) (thickness 0.15)) (justify mirror))
    )
    (pad 1 smd rect (at 0 0) (size 2 2) (layers B.Cu B.Mask)
      (net 5 "Net-(SW1-Pad4)") (solder_mask_margin 0.05))
  )

  (module TestPoint:TestPoint_Pad_2.0x2.0mm (layer B.Cu) (tedit 5BD058F6) (tstamp 5BCB93FA)
    (at 100 102 270)
    (descr "SMD rectangular pad as test Point, square 2.0mm side length")
    (tags "test point SMD pad rectangle square")
    (path /5BBD1B3C)
    (attr virtual)
    (fp_text reference TP1 (at 0 1.998 270) (layer B.SilkS) hide
      (effects (font (size 1 1) (thickness 0.15)) (justify mirror))
    )
    (fp_text value Pad (at 0 -2.05 270) (layer B.Fab)
      (effects (font (size 1 1) (thickness 0.15)) (justify mirror))
    )
    (fp_line (start 1.5 -1.5) (end -1.5 -1.5) (layer B.CrtYd) (width 0.05))
    (fp_line (start 1.5 -1.5) (end 1.5 1.5) (layer B.CrtYd) (width 0.05))
    (fp_line (start -1.5 1.5) (end -1.5 -1.5) (layer B.CrtYd) (width 0.05))
    (fp_line (start -1.5 1.5) (end 1.5 1.5) (layer B.CrtYd) (width 0.05))
    (fp_line (start -1.2 -1.2) (end -1.2 1.2) (layer B.SilkS) (width 0.12))
    (fp_line (start 1.2 -1.2) (end -1.2 -1.2) (layer B.SilkS) (width 0.12))
    (fp_line (start 1.2 1.2) (end 1.2 -1.2) (layer B.SilkS) (width 0.12))
    (fp_line (start -1.2 1.2) (end 1.2 1.2) (layer B.SilkS) (width 0.12))
    (fp_text user %R (at 0 2 270) (layer B.Fab)
      (effects (font (size 1 1) (thickness 0.15)) (justify mirror))
    )
    (pad 1 smd rect (at 0 0 270) (size 2 2) (layers B.Cu B.Mask)
      (net 2 "Net-(SW1-Pad1)") (solder_mask_margin 0.05))
  )

  (module TestPoint:TestPoint_Pad_2.0x2.0mm (layer B.Cu) (tedit 5BD058BE) (tstamp 5BCB91A1)
    (at 104.1 100)
    (descr "SMD rectangular pad as test Point, square 2.0mm side length")
    (tags "test point SMD pad rectangle square")
    (path /5BBD1BF6)
    (attr virtual)
    (fp_text reference TP3 (at 0 1.998) (layer B.SilkS) hide
      (effects (font (size 1 1) (thickness 0.15)) (justify mirror))
    )
    (fp_text value Pad (at 0 -2.05) (layer B.Fab)
      (effects (font (size 1 1) (thickness 0.15)) (justify mirror))
    )
    (fp_line (start 1.5 -1.5) (end -1.5 -1.5) (layer B.CrtYd) (width 0.05))
    (fp_line (start 1.5 -1.5) (end 1.5 1.5) (layer B.CrtYd) (width 0.05))
    (fp_line (start -1.5 1.5) (end -1.5 -1.5) (layer B.CrtYd) (width 0.05))
    (fp_line (start -1.5 1.5) (end 1.5 1.5) (layer B.CrtYd) (width 0.05))
    (fp_line (start -1.2 -1.2) (end -1.2 1.2) (layer B.SilkS) (width 0.12))
    (fp_line (start 1.2 -1.2) (end -1.2 -1.2) (layer B.SilkS) (width 0.12))
    (fp_line (start 1.2 1.2) (end 1.2 -1.2) (layer B.SilkS) (width 0.12))
    (fp_line (start -1.2 1.2) (end 1.2 1.2) (layer B.SilkS) (width 0.12))
    (fp_text user %R (at 0 2) (layer B.Fab)
      (effects (font (size 1 1) (thickness 0.15)) (justify mirror))
    )
    (pad 1 smd rect (at 0 0) (size 2 2) (layers B.Cu B.Mask)
      (net 3 "Net-(SW1-Pad5)") (solder_mask_margin 0.05))
  )

  (module TestPoint:TestPoint_Pad_2.0x2.0mm (layer B.Cu) (tedit 5BD058A6) (tstamp 5BCB8FEF)
    (at 100 98)
    (descr "SMD rectangular pad as test Point, square 2.0mm side length")
    (tags "test point SMD pad rectangle square")
    (path /5BBF65E5)
    (attr virtual)
    (fp_text reference TP5 (at 0 1.998) (layer B.SilkS) hide
      (effects (font (size 1 1) (thickness 0.15)) (justify mirror))
    )
    (fp_text value Pad (at 0 -2.05) (layer B.Fab)
      (effects (font (size 1 1) (thickness 0.15)) (justify mirror))
    )
    (fp_line (start 1.5 -1.5) (end -1.5 -1.5) (layer B.CrtYd) (width 0.05))
    (fp_line (start 1.5 -1.5) (end 1.5 1.5) (layer B.CrtYd) (width 0.05))
    (fp_line (start -1.5 1.5) (end -1.5 -1.5) (layer B.CrtYd) (width 0.05))
    (fp_line (start -1.5 1.5) (end 1.5 1.5) (layer B.CrtYd) (width 0.05))
    (fp_line (start -1.2 -1.2) (end -1.2 1.2) (layer B.SilkS) (width 0.12))
    (fp_line (start 1.2 -1.2) (end -1.2 -1.2) (layer B.SilkS) (width 0.12))
    (fp_line (start 1.2 1.2) (end 1.2 -1.2) (layer B.SilkS) (width 0.12))
    (fp_line (start -1.2 1.2) (end 1.2 1.2) (layer B.SilkS) (width 0.12))
    (fp_text user %R (at 0 2) (layer B.Fab)
      (effects (font (size 1 1) (thickness 0.15)) (justify mirror))
    )
    (pad 1 smd rect (at 0 0) (size 2 2) (layers B.Cu B.Mask)
      (net 1 "Net-(SW1-Pad2)") (solder_mask_margin 0.05))
  )

  (dimension 4.100076 (width 0.3) (layer Dwgs.User)
    (gr_text "4,100 mm" (at 102.049962 110.575) (layer Dwgs.User)
      (effects (font (size 1.5 1.5) (thickness 0.3)))
    )
    (feature1 (pts (xy 99.999924 100) (xy 99.999924 109.061421)))
    (feature2 (pts (xy 104.1 100) (xy 104.1 109.061421)))
    (crossbar (pts (xy 104.1 108.475) (xy 99.999924 108.475)))
    (arrow1a (pts (xy 99.999924 108.475) (xy 101.126428 107.888579)))
    (arrow1b (pts (xy 99.999924 108.475) (xy 101.126428 109.061421)))
    (arrow2a (pts (xy 104.1 108.475) (xy 102.973496 107.888579)))
    (arrow2b (pts (xy 104.1 108.475) (xy 102.973496 109.061421)))
  )
  (gr_line (start 100 98) (end 100 102.025) (layer Dwgs.User) (width 0.2))
  (gr_line (start 104.1 100) (end 96.825 100) (layer Dwgs.User) (width 0.2))
  (dimension 2.7 (width 0.3) (layer Dwgs.User)
    (gr_text "2,700 mm" (at 98.65 87.2) (layer Dwgs.User)
      (effects (font (size 1.5 1.5) (thickness 0.3)))
    )
    (feature1 (pts (xy 97.3 98) (xy 97.3 88.713579)))
    (feature2 (pts (xy 100 98) (xy 100 88.713579)))
    (crossbar (pts (xy 100 89.3) (xy 97.3 89.3)))
    (arrow1a (pts (xy 97.3 89.3) (xy 98.426504 88.713579)))
    (arrow1b (pts (xy 97.3 89.3) (xy 98.426504 89.886421)))
    (arrow2a (pts (xy 100 89.3) (xy 98.873496 88.713579)))
    (arrow2b (pts (xy 100 89.3) (xy 98.873496 89.886421)))
  )
  (dimension 2.000624 (width 0.3) (layer Dwgs.User)
    (gr_text "2,001 mm" (at 111.3 98.999688 90) (layer Dwgs.User)
      (effects (font (size 1.5 1.5) (thickness 0.3)))
    )
    (feature1 (pts (xy 104.1 97.999376) (xy 109.786421 97.999376)))
    (feature2 (pts (xy 104.1 100) (xy 109.786421 100)))
    (crossbar (pts (xy 109.2 100) (xy 109.2 97.999376)))
    (arrow1a (pts (xy 109.2 97.999376) (xy 109.786421 99.12588)))
    (arrow1b (pts (xy 109.2 97.999376) (xy 108.613579 99.12588)))
    (arrow2a (pts (xy 109.2 100) (xy 109.786421 98.873496)))
    (arrow2b (pts (xy 109.2 100) (xy 108.613579 98.873496)))
  )
  (gr_text "RadIIS BT r.2\n" (at 98.806 100) (layer B.SilkS) (tstamp 5BBFCD8A)
    (effects (font (size 0.5 0.5) (thickness 0.1) italic) (justify mirror))
  )
  (gr_text B (at 95.25 97.79) (layer B.SilkS) (tstamp 5BBFCD5A)
    (effects (font (size 0.75 0.75) (thickness 0.15)) (justify mirror))
  )
  (gr_text G (at 104.394 102.108) (layer B.SilkS) (tstamp 5BBFCD40)
    (effects (font (size 0.75 0.75) (thickness 0.15)) (justify mirror))
  )
  (gr_text Bt (at 102.108 102.108) (layer B.SilkS) (tstamp 5BBFCD27)
    (effects (font (size 0.75 0.75) (thickness 0.15)) (justify mirror))
  )
  (gr_text R (at 95.504 102.108) (layer B.SilkS)
    (effects (font (size 0.75 0.75) (thickness 0.15)) (justify mirror))
  )
  (gr_text + (at 102.108 97.536) (layer B.SilkS)
    (effects (font (size 1.5 1.5) (thickness 0.3)) (justify mirror))
  )
  (gr_circle (center 100 100) (end 106 100) (layer Edge.Cuts) (width 0.15))

  (segment (start 100 95.3) (end 100 98) (width 1) (layer B.Cu) (net 1))
  (segment (start 101.1 99.1) (end 100 98) (width 0.8) (layer B.Cu) (net 1))
  (segment (start 102 99.1) (end 101.1 99.1) (width 0.8) (layer B.Cu) (net 1))
  (segment (start 100.076 104.624) (end 100 104.7) (width 1) (layer F.Cu) (net 2))
  (segment (start 100.076 104.624) (end 100 104.7) (width 1) (layer B.Cu) (net 2))
  (segment (start 100.076 102) (end 100.076 104.624) (width 1) (layer B.Cu) (net 2))
  (segment (start 103.2 100.9) (end 104.1 100) (width 0.8) (layer B.Cu) (net 3))
  (segment (start 102 100.9) (end 103.2 100.9) (width 0.8) (layer B.Cu) (net 3))
  (segment (start 96.2 99.1) (end 97.3 98) (width 0.8) (layer B.Cu) (net 4))
  (segment (start 95.3 99.1) (end 96.2 99.1) (width 0.8) (layer B.Cu) (net 4))
  (segment (start 96.2 100.9) (end 97.3 102) (width 0.8) (layer B.Cu) (net 5))
  (segment (start 95.3 100.9) (end 96.2 100.9) (width 0.8) (layer B.Cu) (net 5))

)
