G04 #@! TF.FileFunction,Soldermask,Top*
%FSLAX46Y46*%
G04 Gerber Fmt 4.6, Leading zero omitted, Abs format (unit mm)*
G04 Created by KiCad (PCBNEW 4.0.6-e0-6349~53~ubuntu16.04.1) date Mon Mar 13 19:01:04 2017*
%MOMM*%
%LPD*%
G01*
G04 APERTURE LIST*
%ADD10C,0.100000*%
%ADD11C,0.150000*%
%ADD12R,2.800000X2.300000*%
%ADD13R,0.999440X1.449020*%
%ADD14R,1.449020X1.901140*%
%ADD15R,1.900000X0.680000*%
%ADD16R,0.680000X1.900000*%
%ADD17C,2.600000*%
%ADD18R,1.650000X1.400000*%
%ADD19R,1.150000X1.200000*%
%ADD20R,1.400000X1.650000*%
%ADD21R,1.200000X1.150000*%
%ADD22R,1.400000X2.200000*%
%ADD23R,0.900000X1.300000*%
%ADD24R,1.300000X0.900000*%
%ADD25R,1.950000X1.000000*%
%ADD26R,1.460000X1.050000*%
%ADD27R,1.050000X1.460000*%
%ADD28R,1.300000X1.200000*%
%ADD29R,1.416000X1.924000*%
%ADD30R,1.924000X1.416000*%
%ADD31R,1.000000X1.950000*%
%ADD32R,2.900000X1.500000*%
%ADD33O,2.900000X1.500000*%
%ADD34O,1.500000X2.800000*%
%ADD35R,1.200000X1.200000*%
%ADD36R,2.300000X5.700000*%
%ADD37R,1.900000X2.600000*%
%ADD38R,1.450000X1.400000*%
%ADD39R,2.600000X1.450000*%
%ADD40R,1.200000X1.300000*%
%ADD41R,1.700000X1.100000*%
%ADD42R,1.100000X1.700000*%
%ADD43R,0.800000X1.750000*%
%ADD44R,0.800000X0.650000*%
%ADD45R,1.200000X1.700000*%
%ADD46C,1.900000*%
%ADD47R,2.200000X1.400000*%
%ADD48O,4.550000X2.350000*%
%ADD49O,1.800000X1.400000*%
%ADD50R,1.400000X1.400000*%
%ADD51O,1.400000X1.400000*%
%ADD52R,10.400000X2.900000*%
%ADD53O,0.700000X1.150000*%
%ADD54O,1.150000X0.700000*%
%ADD55R,1.300000X1.300000*%
%ADD56R,2.100000X2.100000*%
%ADD57O,2.100000X2.100000*%
%ADD58C,1.400000*%
G04 APERTURE END LIST*
D10*
D11*
X87000000Y-75000000D02*
X86000000Y-75000000D01*
X182000000Y-74500000D02*
X182000000Y-118000000D01*
X95002409Y-113501020D02*
X95002409Y-118001020D01*
X90000000Y-75000000D02*
G75*
G03X95000000Y-70000000I0J5000000D01*
G01*
X90000000Y-75000000D02*
X87000000Y-75000000D01*
X83400000Y-77600000D02*
X86000000Y-75000000D01*
X83400000Y-97201020D02*
X83400000Y-77600000D01*
X87000000Y-100001020D02*
X86200000Y-100001020D01*
X83400000Y-97201020D02*
X86200000Y-100001020D01*
X87000000Y-100001020D02*
X95002409Y-100001020D01*
X95002409Y-100001020D02*
X96902409Y-101901020D01*
X96902409Y-101901020D02*
X96902409Y-111601020D01*
X95002409Y-113501020D02*
X96902409Y-111601020D01*
X182000000Y-70000000D02*
X182000000Y-70000000D01*
X182000000Y-74500000D02*
X182000000Y-70000000D01*
X95000000Y-122000000D02*
G75*
G03X97000000Y-124000000I2000000J0D01*
G01*
X140000000Y-124000000D02*
G75*
G03X142000000Y-122000000I0J2000000D01*
G01*
X152000000Y-122000000D02*
G75*
G03X154000000Y-124000000I2000000J0D01*
G01*
X180000000Y-124000000D02*
G75*
G03X182000000Y-122000000I0J2000000D01*
G01*
X182000000Y-66000000D02*
G75*
G03X180000000Y-64000000I-2000000J0D01*
G01*
X154000000Y-64000000D02*
G75*
G03X152000000Y-66000000I0J-2000000D01*
G01*
X142000000Y-66000000D02*
G75*
G03X140000000Y-64000000I-2000000J0D01*
G01*
X97000000Y-64000000D02*
G75*
G03X95000000Y-66000000I0J-2000000D01*
G01*
X95000000Y-122000000D02*
X95000000Y-118000000D01*
X140000000Y-124000000D02*
X97000000Y-124000000D01*
X142000000Y-118000000D02*
X142000000Y-122000000D01*
X152000000Y-122000000D02*
X152000000Y-118000000D01*
X180000000Y-124000000D02*
X154000000Y-124000000D01*
X182000000Y-118000000D02*
X182000000Y-122000000D01*
X152000000Y-118000000D02*
G75*
G03X142000000Y-118000000I-5000000J0D01*
G01*
X182000000Y-66000000D02*
X182000000Y-70000000D01*
X154000000Y-64000000D02*
X180000000Y-64000000D01*
X152000000Y-70000000D02*
X152000000Y-66000000D01*
X142000000Y-66000000D02*
X142000000Y-70000000D01*
X97000000Y-64000000D02*
X140000000Y-64000000D01*
X95000000Y-70000000D02*
X95000000Y-66000000D01*
X142000000Y-70000000D02*
G75*
G03X152000000Y-70000000I5000000J0D01*
G01*
D12*
X155675000Y-101100000D03*
X155675000Y-97000000D03*
D13*
X130924100Y-73975000D03*
X129824280Y-73975000D03*
X128724460Y-73975000D03*
X127624640Y-73975000D03*
X126524820Y-73975000D03*
X125425000Y-73975000D03*
X124325180Y-73975000D03*
X123225360Y-73975000D03*
D14*
X134480100Y-76504840D03*
X121028260Y-76504840D03*
X134480100Y-68105060D03*
X121028260Y-68105060D03*
D15*
X149100000Y-106000000D03*
X149100000Y-105500000D03*
X149100000Y-105000000D03*
X149100000Y-104500000D03*
X149100000Y-104000000D03*
X149100000Y-103500000D03*
X149100000Y-103000000D03*
X149100000Y-102500000D03*
X149100000Y-102000000D03*
X149100000Y-101500000D03*
X149100000Y-101000000D03*
X149100000Y-100500000D03*
X149100000Y-100000000D03*
X149100000Y-99500000D03*
X149100000Y-99000000D03*
X149100000Y-98500000D03*
X149100000Y-98000000D03*
X149100000Y-97500000D03*
X149100000Y-97000000D03*
X149100000Y-96500000D03*
X149100000Y-96000000D03*
X149100000Y-95500000D03*
X149100000Y-95000000D03*
X149100000Y-94500000D03*
X149100000Y-94000000D03*
D16*
X147200000Y-92100000D03*
X146700000Y-92100000D03*
X146200000Y-92100000D03*
X145700000Y-92100000D03*
X145200000Y-92100000D03*
X144700000Y-92100000D03*
X144200000Y-92100000D03*
X143700000Y-92100000D03*
X143200000Y-92100000D03*
X142700000Y-92100000D03*
X142200000Y-92100000D03*
X141700000Y-92100000D03*
X141200000Y-92100000D03*
X140700000Y-92100000D03*
X140200000Y-92100000D03*
X139700000Y-92100000D03*
X139200000Y-92100000D03*
X138700000Y-92100000D03*
X138200000Y-92100000D03*
X137700000Y-92100000D03*
X137200000Y-92100000D03*
X136700000Y-92100000D03*
X136200000Y-92100000D03*
X135700000Y-92100000D03*
X135200000Y-92100000D03*
D15*
X133300000Y-94000000D03*
X133300000Y-94500000D03*
X133300000Y-95000000D03*
X133300000Y-95500000D03*
X133300000Y-96000000D03*
X133300000Y-96500000D03*
X133300000Y-97000000D03*
X133300000Y-97500000D03*
X133300000Y-98000000D03*
X133300000Y-98500000D03*
X133300000Y-99000000D03*
X133300000Y-99500000D03*
X133300000Y-100000000D03*
X133300000Y-100500000D03*
X133300000Y-101000000D03*
X133300000Y-101500000D03*
X133300000Y-102000000D03*
X133300000Y-102500000D03*
X133300000Y-103000000D03*
X133300000Y-103500000D03*
X133300000Y-104000000D03*
X133300000Y-104500000D03*
X133300000Y-105000000D03*
X133300000Y-105500000D03*
X133300000Y-106000000D03*
D16*
X135200000Y-107900000D03*
X135700000Y-107900000D03*
X136200000Y-107900000D03*
X136700000Y-107900000D03*
X137200000Y-107900000D03*
X137700000Y-107900000D03*
X138200000Y-107900000D03*
X138700000Y-107900000D03*
X139200000Y-107900000D03*
X139700000Y-107900000D03*
X140200000Y-107900000D03*
X140700000Y-107900000D03*
X141200000Y-107900000D03*
X141700000Y-107900000D03*
X142200000Y-107900000D03*
X142700000Y-107900000D03*
X143200000Y-107900000D03*
X143700000Y-107900000D03*
X144200000Y-107900000D03*
X144700000Y-107900000D03*
X145200000Y-107900000D03*
X145700000Y-107900000D03*
X146200000Y-107900000D03*
X146700000Y-107900000D03*
X147200000Y-107900000D03*
D17*
X100000000Y-118000000D03*
X177000000Y-118000000D03*
X137000000Y-118000000D03*
X177000000Y-70000000D03*
X137000000Y-70000000D03*
D18*
X158900000Y-116350000D03*
X158900000Y-114350000D03*
X162750000Y-110700000D03*
X162750000Y-108700000D03*
D19*
X155050000Y-86800000D03*
X155050000Y-88300000D03*
X155050000Y-67550000D03*
X155050000Y-66050000D03*
X162250000Y-67700000D03*
X162250000Y-66200000D03*
X160500000Y-76300000D03*
X160500000Y-74800000D03*
D20*
X171100000Y-100350000D03*
X173100000Y-100350000D03*
X171150000Y-102700000D03*
X173150000Y-102700000D03*
X168250000Y-88500000D03*
X166250000Y-88500000D03*
X163500000Y-93250000D03*
X165500000Y-93250000D03*
X163500000Y-95350000D03*
X165500000Y-95350000D03*
X168550000Y-82600000D03*
X166550000Y-82600000D03*
X172550000Y-82550000D03*
X170550000Y-82550000D03*
X100700000Y-101300000D03*
X98700000Y-101300000D03*
D18*
X96700000Y-99250000D03*
X96700000Y-97250000D03*
X164950000Y-110700000D03*
X164950000Y-108700000D03*
D21*
X101000000Y-73100000D03*
X99500000Y-73100000D03*
D19*
X158400000Y-101250000D03*
X158400000Y-99750000D03*
X158400000Y-96750000D03*
X158400000Y-98250000D03*
D21*
X136500000Y-80450000D03*
X135000000Y-80450000D03*
X153075000Y-101725000D03*
X151575000Y-101725000D03*
X148450000Y-108925000D03*
X149950000Y-108925000D03*
D19*
X131000000Y-107650000D03*
X131000000Y-106150000D03*
X151650000Y-95550000D03*
X151650000Y-97050000D03*
D20*
X125650000Y-92200000D03*
X127650000Y-92200000D03*
D18*
X126800000Y-85350000D03*
X126800000Y-83350000D03*
D22*
X142000000Y-76600000D03*
X142000000Y-82700000D03*
X144000000Y-76600000D03*
X144000000Y-82700000D03*
X146000000Y-76600000D03*
X146000000Y-82700000D03*
X148000000Y-76600000D03*
X148000000Y-82700000D03*
X150000000Y-76600000D03*
X150000000Y-82700000D03*
X152000000Y-76600000D03*
X152000000Y-82700000D03*
D23*
X158900000Y-89700000D03*
X157400000Y-89700000D03*
D24*
X153000000Y-86050000D03*
X153000000Y-84550000D03*
X154900000Y-82150000D03*
X154900000Y-83650000D03*
X153000000Y-88750000D03*
X153000000Y-87250000D03*
D23*
X156400000Y-82400000D03*
X157900000Y-82400000D03*
D24*
X98100000Y-73600000D03*
X98100000Y-75100000D03*
D23*
X156450000Y-65050000D03*
X157950000Y-65050000D03*
X160800000Y-65050000D03*
X159300000Y-65050000D03*
X100650000Y-95550000D03*
X99150000Y-95550000D03*
D24*
X161600000Y-100750000D03*
X161600000Y-102250000D03*
X161600000Y-97900000D03*
X161600000Y-99400000D03*
D23*
X171500000Y-89700000D03*
X173000000Y-89700000D03*
X171500000Y-87950000D03*
X173000000Y-87950000D03*
D24*
X160625000Y-111100000D03*
X160625000Y-112600000D03*
X159075000Y-112600000D03*
X159075000Y-111100000D03*
D23*
X166000000Y-112600000D03*
X164500000Y-112600000D03*
X99600000Y-74900000D03*
X101100000Y-74900000D03*
X107850000Y-91300000D03*
X106350000Y-91300000D03*
X102800000Y-90350000D03*
X104300000Y-90350000D03*
D24*
X120050000Y-71350000D03*
X120050000Y-69850000D03*
D23*
X109850000Y-91300000D03*
X111350000Y-91300000D03*
D24*
X143500000Y-110550000D03*
X143500000Y-112050000D03*
D25*
X157000000Y-84245000D03*
X157000000Y-85515000D03*
X157000000Y-86785000D03*
X157000000Y-88055000D03*
X162400000Y-88055000D03*
X162400000Y-86785000D03*
X162400000Y-85515000D03*
X162400000Y-84245000D03*
X169050000Y-101105000D03*
X169050000Y-99835000D03*
X169050000Y-98565000D03*
X169050000Y-97295000D03*
X163650000Y-97295000D03*
X163650000Y-98565000D03*
X163650000Y-99835000D03*
X163650000Y-101105000D03*
D26*
X170450000Y-84300000D03*
X170450000Y-85250000D03*
X170450000Y-86200000D03*
X172650000Y-86200000D03*
X172650000Y-84300000D03*
D27*
X166650000Y-86550000D03*
X167600000Y-86550000D03*
X168550000Y-86550000D03*
X168550000Y-84350000D03*
X166650000Y-84350000D03*
D21*
X113050000Y-102700000D03*
X114550000Y-102700000D03*
D28*
X164550000Y-114350000D03*
X164550000Y-116250000D03*
X166550000Y-115300000D03*
D27*
X162800000Y-114100000D03*
X161850000Y-114100000D03*
X160900000Y-114100000D03*
X160900000Y-116300000D03*
X162800000Y-116300000D03*
X161850000Y-116300000D03*
D29*
X128510000Y-122280000D03*
X127240000Y-122280000D03*
X125970000Y-122280000D03*
X124700000Y-122280000D03*
X123430000Y-122280000D03*
X122160000Y-122280000D03*
X120890000Y-122280000D03*
X119620000Y-122280000D03*
X118350000Y-122280000D03*
X117080000Y-122280000D03*
X115810000Y-122280000D03*
X114540000Y-122280000D03*
X113270000Y-122280000D03*
X112000000Y-122280000D03*
X110730000Y-122280000D03*
X109460000Y-122280000D03*
X108190000Y-122280000D03*
X106920000Y-122280000D03*
X105650000Y-122280000D03*
X104380000Y-122280000D03*
X104380000Y-104500000D03*
D30*
X103110000Y-117200000D03*
X103110000Y-115930000D03*
X103110000Y-114660000D03*
X103110000Y-113390000D03*
X103110000Y-112120000D03*
X103110000Y-110850000D03*
X103110000Y-109580000D03*
D29*
X105650000Y-104500000D03*
X106920000Y-104500000D03*
X108190000Y-104500000D03*
X109460000Y-104500000D03*
X110730000Y-104500000D03*
X112000000Y-104500000D03*
X113270000Y-104500000D03*
X114540000Y-104500000D03*
X115810000Y-104500000D03*
X117080000Y-104500000D03*
X118350000Y-104500000D03*
X119620000Y-104500000D03*
X120890000Y-104500000D03*
X122160000Y-104500000D03*
X123430000Y-104500000D03*
X124700000Y-104500000D03*
X125970000Y-104500000D03*
X127240000Y-104500000D03*
X128510000Y-104500000D03*
D31*
X156695000Y-72950000D03*
X157965000Y-72950000D03*
X159235000Y-72950000D03*
X160505000Y-72950000D03*
X160505000Y-67550000D03*
X159235000Y-67550000D03*
X157965000Y-67550000D03*
X156695000Y-67550000D03*
D26*
X98700000Y-97350000D03*
X98700000Y-98300000D03*
X98700000Y-99250000D03*
X100900000Y-99250000D03*
X100900000Y-97350000D03*
D27*
X126700000Y-90400000D03*
X127650000Y-90400000D03*
X128600000Y-90400000D03*
X128600000Y-88200000D03*
X126700000Y-88200000D03*
D32*
X103100000Y-73300000D03*
D33*
X103100000Y-75300000D03*
X103100000Y-77300000D03*
X103100000Y-79300000D03*
X103100000Y-81300000D03*
X103100000Y-83300000D03*
X103100000Y-85300000D03*
X103100000Y-87300000D03*
X118500000Y-87300000D03*
X118400000Y-85300000D03*
X118500000Y-83300000D03*
X118500000Y-81300000D03*
X118500000Y-79300000D03*
X118500000Y-77300000D03*
X118500000Y-75300000D03*
X118500000Y-73300000D03*
D34*
X105790000Y-89050000D03*
X107790000Y-89050000D03*
X109790000Y-89050000D03*
X111790000Y-89050000D03*
X113790000Y-89050000D03*
X115790000Y-89050000D03*
D19*
X165200000Y-84900000D03*
X165200000Y-86400000D03*
X165300000Y-67550000D03*
X165300000Y-66050000D03*
X170650000Y-76250000D03*
X170650000Y-74750000D03*
X172250000Y-67200000D03*
X172250000Y-65700000D03*
D21*
X125500000Y-80800000D03*
X127000000Y-80800000D03*
X118900000Y-101800000D03*
X117400000Y-101800000D03*
D20*
X118550000Y-100150000D03*
X120550000Y-100150000D03*
D21*
X115300000Y-95100000D03*
X116800000Y-95100000D03*
D18*
X104650000Y-94650000D03*
X104650000Y-96650000D03*
D20*
X103400000Y-102150000D03*
X105400000Y-102150000D03*
D19*
X134200000Y-92100000D03*
X134200000Y-90600000D03*
D10*
G36*
X146801992Y-90511180D02*
X145988820Y-89698008D01*
X146837348Y-88849480D01*
X147650520Y-89662652D01*
X146801992Y-90511180D01*
X146801992Y-90511180D01*
G37*
G36*
X147862652Y-89450520D02*
X147049480Y-88637348D01*
X147898008Y-87788820D01*
X148711180Y-88601992D01*
X147862652Y-89450520D01*
X147862652Y-89450520D01*
G37*
D19*
X90300000Y-83450000D03*
X90300000Y-84950000D03*
D21*
X156925000Y-105775000D03*
X158425000Y-105775000D03*
X156925000Y-103225000D03*
X158425000Y-103225000D03*
D20*
X172500000Y-114800000D03*
X170500000Y-114800000D03*
X172500000Y-116600000D03*
X170500000Y-116600000D03*
D21*
X165700000Y-106650000D03*
X164200000Y-106650000D03*
X170750000Y-110450000D03*
X169250000Y-110450000D03*
X175050000Y-122200000D03*
X176550000Y-122200000D03*
D19*
X164350000Y-76300000D03*
X164350000Y-77800000D03*
D28*
X102750000Y-98300000D03*
X102750000Y-100200000D03*
X104750000Y-99250000D03*
D35*
X177500000Y-109500000D03*
X177500000Y-107900000D03*
D36*
X161950000Y-120300000D03*
X165350000Y-120300000D03*
D37*
X112990000Y-98250000D03*
X106750000Y-98250000D03*
D38*
X97925000Y-112100000D03*
X100975000Y-112100000D03*
D39*
X99450000Y-110625000D03*
X99450000Y-113575000D03*
D40*
X88075000Y-78975000D03*
X89975000Y-78975000D03*
X89025000Y-76975000D03*
D28*
X169200000Y-108850000D03*
X169200000Y-106950000D03*
X167200000Y-107900000D03*
X170700000Y-106950000D03*
X170700000Y-108850000D03*
X172700000Y-107900000D03*
X157950000Y-76800000D03*
X157950000Y-74900000D03*
X155950000Y-75850000D03*
X168200000Y-76900000D03*
X168200000Y-75000000D03*
X166200000Y-75950000D03*
D23*
X170850000Y-65250000D03*
X169350000Y-65250000D03*
X166650000Y-65250000D03*
X168150000Y-65250000D03*
D41*
X90900000Y-95700000D03*
X90900000Y-97600000D03*
D23*
X152825000Y-110900000D03*
X154325000Y-110900000D03*
X154325000Y-108050000D03*
X152825000Y-108050000D03*
D42*
X114150000Y-100950000D03*
X116050000Y-100950000D03*
D24*
X121050000Y-98600000D03*
X121050000Y-97100000D03*
X121050000Y-94500000D03*
X121050000Y-96000000D03*
X119450000Y-95700000D03*
X119450000Y-97200000D03*
D23*
X93500000Y-88450000D03*
X95000000Y-88450000D03*
X93500000Y-90350000D03*
X95000000Y-90350000D03*
D24*
X90300000Y-81900000D03*
X90300000Y-80400000D03*
D42*
X170950000Y-112900000D03*
X169050000Y-112900000D03*
X174250000Y-112900000D03*
X172350000Y-112900000D03*
X177450000Y-112900000D03*
X175550000Y-112900000D03*
D23*
X172550000Y-105300000D03*
X171050000Y-105300000D03*
X168500000Y-105350000D03*
X167000000Y-105350000D03*
X177450000Y-114700000D03*
X175950000Y-114700000D03*
X171250000Y-118400000D03*
X172750000Y-118400000D03*
X161700000Y-82350000D03*
X163200000Y-82350000D03*
X160550000Y-82350000D03*
X159050000Y-82350000D03*
D43*
X164325000Y-74300000D03*
X164325000Y-70000000D03*
X163675000Y-74300000D03*
X163675000Y-70000000D03*
X163025000Y-74300000D03*
X163025000Y-70000000D03*
X162375000Y-74300000D03*
X162375000Y-70000000D03*
D31*
X166845000Y-72950000D03*
X168115000Y-72950000D03*
X169385000Y-72950000D03*
X170655000Y-72950000D03*
X170655000Y-67550000D03*
X169385000Y-67550000D03*
X168115000Y-67550000D03*
X166845000Y-67550000D03*
D44*
X92100000Y-89200000D03*
X90650000Y-89200000D03*
X92100000Y-89700000D03*
X90650000Y-89700000D03*
X92100000Y-90200000D03*
X90650000Y-90200000D03*
D45*
X91375000Y-89700000D03*
D27*
X173450000Y-120000000D03*
X172500000Y-120000000D03*
X171550000Y-120000000D03*
X171550000Y-122200000D03*
X173450000Y-122200000D03*
D46*
X141700000Y-87200000D03*
X153750000Y-69350000D03*
X163500000Y-90950000D03*
X148000000Y-85450000D03*
X141100000Y-73100000D03*
X99800000Y-104250000D03*
X102500000Y-95550000D03*
X124700000Y-87600000D03*
X169150000Y-121100000D03*
X167200000Y-111300000D03*
X153750000Y-74350000D03*
D47*
X155000000Y-103225000D03*
X155000000Y-105725000D03*
D48*
X86950000Y-85800000D03*
D49*
X86150000Y-89400000D03*
X87750000Y-90050000D03*
X87750000Y-91350000D03*
X87750000Y-88750000D03*
X86150000Y-90700000D03*
D48*
X86950000Y-94300000D03*
D17*
X100000000Y-70000000D03*
D50*
X179970000Y-74530000D03*
D51*
X179970000Y-75800000D03*
X178700000Y-74530000D03*
X178700000Y-75800000D03*
X177430000Y-74530000D03*
X177430000Y-75800000D03*
X176160000Y-74530000D03*
X176160000Y-75800000D03*
X174890000Y-74530000D03*
X174890000Y-75800000D03*
X173620000Y-74530000D03*
X173620000Y-75800000D03*
D52*
X96200000Y-84500000D03*
X96200000Y-77500000D03*
D53*
X115550000Y-99425000D03*
X116050000Y-99425000D03*
X116550000Y-99425000D03*
X117050000Y-99425000D03*
D54*
X117775000Y-98700000D03*
X117775000Y-98200000D03*
X117775000Y-97700000D03*
X117775000Y-97200000D03*
D53*
X117050000Y-96475000D03*
X116550000Y-96475000D03*
X116050000Y-96475000D03*
X115550000Y-96475000D03*
D54*
X114825000Y-97200000D03*
X114825000Y-97700000D03*
X114825000Y-98200000D03*
X114825000Y-98700000D03*
D55*
X116750000Y-97500000D03*
X115850000Y-97500000D03*
X116750000Y-98400000D03*
X115850000Y-98400000D03*
D50*
X131960000Y-82800000D03*
D51*
X133230000Y-82800000D03*
X134500000Y-82800000D03*
X135770000Y-82800000D03*
X137040000Y-82800000D03*
X138310000Y-82800000D03*
D19*
X123950000Y-90750000D03*
X123950000Y-92250000D03*
X128550000Y-86650000D03*
X128550000Y-85150000D03*
X125050000Y-85400000D03*
X125050000Y-83900000D03*
D21*
X127600000Y-99050000D03*
X126100000Y-99050000D03*
X154300000Y-109475000D03*
X152800000Y-109475000D03*
D50*
X128820000Y-96950000D03*
D51*
X127550000Y-96950000D03*
X126280000Y-96950000D03*
X125010000Y-96950000D03*
D23*
X158950000Y-91250000D03*
X157450000Y-91250000D03*
D24*
X131100000Y-97600000D03*
X131100000Y-99100000D03*
D56*
X93600000Y-97590000D03*
D57*
X93600000Y-95050000D03*
D58*
X172875000Y-97600000D03*
M02*
