EESchema Schematic File Version 2
LIBS:power
LIBS:device
LIBS:transistors
LIBS:conn
LIBS:linear
LIBS:regul
LIBS:74xx
LIBS:cmos4000
LIBS:adc-dac
LIBS:memory
LIBS:xilinx
LIBS:microcontrollers
LIBS:dsp
LIBS:microchip
LIBS:analog_switches
LIBS:motorola
LIBS:texas
LIBS:intel
LIBS:audio
LIBS:interface
LIBS:digital-audio
LIBS:philips
LIBS:display
LIBS:cypress
LIBS:siliconi
LIBS:opto
LIBS:atmel
LIBS:contrib
LIBS:valves
LIBS:RadIIS_module-cache
EELAYER 25 0
EELAYER END
$Descr A4 11693 8268
encoding utf-8
Sheet 1 1
Title "RadIIs Module"
Date "2016-12-15"
Rev "1.0b"
Comp "RadIIS"
Comment1 ""
Comment2 ""
Comment3 ""
Comment4 ""
$EndDescr
Text GLabel 2100 3900 3    61   Input ~ 0
Bias_In+
Text GLabel 6800 2750 2    61   Output ~ 0
Pulse_Out
Text GLabel 6300 2450 2    61   Input ~ 0
A-2V0
$Comp
L C C3
U 1 1 5742FE7F
P 2250 2900
F 0 "C3" V 1998 2900 50  0000 C CNN
F 1 "100nF" V 2089 2900 50  0000 C CNN
F 2 "Capacitors_SMD:C_0603" H 2288 2750 50  0001 C CNN
F 3 "" H 2250 2900 50  0000 C CNN
	1    2250 2900
	0    1    1    0   
$EndComp
$Comp
L R R1
U 1 1 5742FE98
P 3550 2200
F 0 "R1" V 3343 2200 50  0000 C CNN
F 1 "470" V 3434 2200 50  0000 C CNN
F 2 "Resistors_SMD:R_0603" V 3480 2200 50  0001 C CNN
F 3 "" H 3550 2200 50  0000 C CNN
	1    3550 2200
	0    1    1    0   
$EndComp
Text GLabel 3550 2350 2    61   Input ~ 0
A3V3
Text GLabel 3550 2950 2    61   Input ~ 0
A-2V0
$Comp
L R R3
U 1 1 5742FEA7
P 4250 2650
F 0 "R3" V 4043 2650 50  0000 C CNN
F 1 "50" V 4134 2650 50  0000 C CNN
F 2 "Resistors_SMD:R_0603" V 4180 2650 50  0001 C CNN
F 3 "" H 4250 2650 50  0000 C CNN
	1    4250 2650
	0    1    1    0   
$EndComp
$Comp
L C C2
U 1 1 5742FEAE
P 5750 3150
F 0 "C2" V 5850 3250 50  0000 C CNN
F 1 "100nF" V 5850 3050 50  0000 C CNN
F 2 "Capacitors_SMD:C_0603" H 5788 3000 50  0001 C CNN
F 3 "" H 5750 3150 50  0000 C CNN
	1    5750 3150
	0    1    1    0   
$EndComp
$Comp
L C C1
U 1 1 5742FEBC
P 6300 2100
F 0 "C1" V 6048 2100 50  0000 C CNN
F 1 "100pF" V 6139 2100 50  0000 C CNN
F 2 "Capacitors_SMD:C_0603" H 6338 1950 50  0001 C CNN
F 3 "" H 6300 2100 50  0000 C CNN
	1    6300 2100
	0    1    1    0   
$EndComp
$Comp
L R R2
U 1 1 5742FEC3
P 6300 1650
F 0 "R2" V 6300 1650 50  0000 C CNN
F 1 "120k" V 6400 1650 50  0000 C CNN
F 2 "Resistors_SMD:R_0603" V 6230 1650 50  0001 C CNN
F 3 "" H 6300 1650 50  0000 C CNN
	1    6300 1650
	0    1    1    0   
$EndComp
Text GLabel 6300 3050 2    61   Input ~ 0
A3V3
Text GLabel 3450 3750 1    61   Input ~ 0
A-2V0
$Comp
L C C7
U 1 1 5742FEFB
P 3250 4000
F 0 "C7" H 3350 3900 50  0000 R CNN
F 1 "100nF" H 3500 4100 50  0000 R CNN
F 2 "Capacitors_SMD:C_0603" H 3288 3850 50  0001 C CNN
F 3 "" H 3250 4000 50  0000 C CNN
	1    3250 4000
	-1   0    0    1   
$EndComp
$Comp
L C C8
U 1 1 5742FF02
P 3450 4000
F 0 "C8" H 3400 3900 50  0000 R CNN
F 1 "100nF" H 3400 4100 50  0000 R CNN
F 2 "Capacitors_SMD:C_0603" H 3488 3850 50  0001 C CNN
F 3 "" H 3450 4000 50  0000 C CNN
	1    3450 4000
	-1   0    0    1   
$EndComp
$Comp
L C C5
U 1 1 5742FF09
P 4050 4000
F 0 "C5" H 4150 3900 50  0000 R CNN
F 1 "100nF" H 4300 4100 50  0000 R CNN
F 2 "Capacitors_SMD:C_0603" H 4088 3850 50  0001 C CNN
F 3 "" H 4050 4000 50  0000 C CNN
	1    4050 4000
	-1   0    0    1   
$EndComp
$Comp
L C C6
U 1 1 5742FF10
P 4250 4000
F 0 "C6" H 4200 3900 50  0000 R CNN
F 1 "100nF" H 4200 4100 50  0000 R CNN
F 2 "Capacitors_SMD:C_0603" H 4288 3850 50  0001 C CNN
F 3 "" H 4250 4000 50  0000 C CNN
	1    4250 4000
	-1   0    0    1   
$EndComp
Text GLabel 3250 3750 1    61   Input ~ 0
A3V3
Text GLabel 4250 3750 1    61   Input ~ 0
A-2V0
Text GLabel 4050 3750 1    61   Input ~ 0
A3V3
Text GLabel 9450 2000 0    61   Input ~ 0
Pulse_Out
Text GLabel 9450 1900 0    61   Output ~ 0
A-2V0
Text GLabel 9450 2200 0    61   Output ~ 0
A3V3
Text GLabel 9450 2400 0    61   Output ~ 0
Bias_In+
Text GLabel 9450 2300 0    60   Input ~ 0
Temp_Out
$Comp
L C C4
U 1 1 574D3A8A
P 7150 3850
F 0 "C4" H 7100 3750 50  0000 R CNN
F 1 "100nF" H 7100 3950 50  0000 R CNN
F 2 "Capacitors_SMD:C_0603" H 7188 3700 50  0001 C CNN
F 3 "" H 7150 3850 50  0000 C CNN
	1    7150 3850
	-1   0    0    1   
$EndComp
Text GLabel 7150 3600 1    61   Input ~ 0
A3V3
Text GLabel 8250 3400 1    61   Input ~ 0
A3V3
Text GLabel 8900 3850 2    60   Output ~ 0
Temp_Out
$Comp
L OPA356 U2
U 1 1 575FF65D
P 3550 2650
F 0 "U2" H 3700 2800 50  0000 L CNN
F 1 "AD8014" H 3650 2500 50  0000 L CNN
F 2 "TO_SOT_Packages_SMD:SOT-23-5" H 3550 2650 50  0001 C CNN
F 3 "" H 3550 2650 50  0000 C CNN
	1    3550 2650
	1    0    0    -1  
$EndComp
$Comp
L OPA356 U3
U 1 1 575FF6AB
P 6300 2750
F 0 "U3" H 6300 2272 50  0000 C CNN
F 1 "OPA356" H 6300 2363 50  0000 C CNN
F 2 "TO_SOT_Packages_SMD:SOT-23-5" H 6300 2750 50  0001 C CNN
F 3 "" H 6300 2750 50  0000 C CNN
	1    6300 2750
	1    0    0    1   
$EndComp
$Comp
L R R7
U 1 1 575FFD4A
P 4600 2800
F 0 "R7" H 4530 2754 50  0000 R CNN
F 1 "3k3" H 4530 2845 50  0000 R CNN
F 2 "Resistors_SMD:R_0603" V 4530 2800 50  0001 C CNN
F 3 "" H 4600 2800 50  0000 C CNN
	1    4600 2800
	0    -1   -1   0   
$EndComp
$Comp
L C C9
U 1 1 575FFDB4
P 4600 2500
F 0 "C9" H 4700 2400 50  0000 R CNN
F 1 "1nF" H 4850 2600 50  0000 R CNN
F 2 "Capacitors_SMD:C_0603" H 4638 2350 50  0001 C CNN
F 3 "" H 4600 2500 50  0000 C CNN
	1    4600 2500
	0    -1   -1   0   
$EndComp
$Comp
L R R4
U 1 1 57600196
P 5050 2650
F 0 "R4" V 4843 2650 50  0000 C CNN
F 1 "470" V 4934 2650 50  0000 C CNN
F 2 "Resistors_SMD:R_0603" V 4980 2650 50  0001 C CNN
F 3 "" H 5050 2650 50  0000 C CNN
	1    5050 2650
	0    1    1    0   
$EndComp
$Comp
L R R8
U 1 1 576001F2
P 4850 2850
F 0 "R8" V 4643 2850 50  0000 C CNN
F 1 "1k" V 4734 2850 50  0000 C CNN
F 2 "Resistors_SMD:R_0603" V 4780 2850 50  0001 C CNN
F 3 "" H 4850 2850 50  0000 C CNN
	1    4850 2850
	-1   0    0    1   
$EndComp
$Comp
L C C10
U 1 1 576002EE
P 5300 2850
F 0 "C10" H 5400 2750 50  0000 R CNN
F 1 "100p" H 5550 2950 50  0000 R CNN
F 2 "Capacitors_SMD:C_0603" H 5338 2700 50  0001 C CNN
F 3 "" H 5300 2850 50  0000 C CNN
	1    5300 2850
	1    0    0    -1  
$EndComp
$Comp
L R R6
U 1 1 57600651
P 5550 2650
F 0 "R6" V 5750 2700 50  0000 R CNN
F 1 "100" V 5650 2700 50  0000 R CNN
F 2 "Resistors_SMD:R_0603" V 5480 2650 50  0001 C CNN
F 3 "" H 5550 2650 50  0000 C CNN
	1    5550 2650
	0    -1   -1   0   
$EndComp
$Comp
L R R9
U 1 1 576010A2
P 5750 3000
F 0 "R9" V 5750 3050 50  0000 R CNN
F 1 "100" V 5850 3050 50  0000 R CNN
F 2 "Resistors_SMD:R_0603" V 5680 3000 50  0001 C CNN
F 3 "" H 5750 3000 50  0000 C CNN
	1    5750 3000
	0    -1   -1   0   
$EndComp
$Comp
L MicroFC-30035-SMT U1
U 1 1 57601CD4
P 2250 1750
F 0 "U1" H 2250 1363 60  0000 C CNN
F 1 "MicroFC-30035-SMT" H 2250 1469 60  0000 C CNN
F 2 "RadIIS_footprints_NEW:MicroFC-30035-SMT-C1" H 2200 1700 60  0001 C CNN
F 3 "" H 2200 1700 60  0001 C CNN
	1    2250 1750
	-1   0    0    1   
$EndComp
$Comp
L TMP36 U4
U 1 1 57617D9D
P 8150 3900
F 0 "U4" H 8741 4003 60  0000 L CNN
F 1 "TMP36" H 8741 3897 60  0000 L CNN
F 2 "TO_SOT_Packages_SMD:SOT-23-5" H 8200 3700 60  0001 C CNN
F 3 "" H 8200 3700 60  0001 C CNN
	1    8150 3900
	1    0    0    -1  
$EndComp
Text Notes 4050 2250 0    60   ~ 0
TODO: Filter vereinfachen!
$Comp
L CONN_01X06 P1
U 1 1 57937BCE
P 9750 2150
F 0 "P1" H 9750 2500 50  0000 C CNN
F 1 "CONN_01X06" V 9850 2150 50  0000 C CNN
F 2 "RadIIS_footprints_NEW:CardEdgeConnector" H 9750 2150 50  0001 C CNN
F 3 "" H 9750 2150 50  0000 C CNN
	1    9750 2150
	1    0    0    -1  
$EndComp
$Comp
L C C11
U 1 1 579664A6
P 1300 4050
F 0 "C11" H 1400 3950 50  0000 R CNN
F 1 "4µ7" H 1550 4150 50  0000 R CNN
F 2 "Capacitors_SMD:C_1206" H 1338 3900 50  0001 C CNN
F 3 "" H 1300 4050 50  0000 C CNN
	1    1300 4050
	-1   0    0    1   
$EndComp
$Comp
L C C12
U 1 1 579664AC
P 1500 4050
F 0 "C12" H 1450 3950 50  0000 R CNN
F 1 "4µ7" H 1450 4150 50  0000 R CNN
F 2 "Capacitors_SMD:C_1206" H 1538 3900 50  0001 C CNN
F 3 "" H 1500 4050 50  0000 C CNN
	1    1500 4050
	-1   0    0    1   
$EndComp
Text GLabel 1500 3800 1    61   Input ~ 0
A-2V0
Text GLabel 1300 3800 1    61   Input ~ 0
A3V3
$Comp
L C C13
U 1 1 579667A2
P 2250 3750
F 0 "C13" V 1998 3750 50  0000 C CNN
F 1 "100nF" V 2089 3750 50  0000 C CNN
F 2 "Capacitors_SMD:C_0603" H 2288 3600 50  0001 C CNN
F 3 "" H 2250 3750 50  0000 C CNN
	1    2250 3750
	0    1    1    0   
$EndComp
$Comp
L INDUCTOR L1
U 1 1 579668E0
P 2100 3300
F 0 "L1" V 2050 3300 50  0000 C CNN
F 1 "INDUCTOR" V 2200 3300 50  0000 C CNN
F 2 "Choke_SMD:Choke_SMD_1206_Standard" H 2100 3300 50  0001 C CNN
F 3 "" H 2100 3300 50  0000 C CNN
	1    2100 3300
	-1   0    0    1   
$EndComp
Text Label 1900 2100 0    60   ~ 0
BiasF
$Comp
L R R5
U 1 1 5817A1C2
P 6250 3200
F 0 "R5" V 6250 3250 50  0000 R CNN
F 1 "90k" V 6350 3250 50  0000 R CNN
F 2 "Resistors_SMD:R_0603" V 6180 3200 50  0001 C CNN
F 3 "" H 6250 3200 50  0000 C CNN
	1    6250 3200
	0    -1   -1   0   
$EndComp
Text GLabel 6450 3200 2    61   Input ~ 0
A3V3
$Comp
L R R10
U 1 1 581A1A37
P 6250 3300
F 0 "R10" V 6250 3350 50  0000 R CNN
F 1 "NA" V 6350 3350 50  0000 R CNN
F 2 "Resistors_SMD:R_0603" V 6180 3300 50  0001 C CNN
F 3 "" H 6250 3300 50  0000 C CNN
	1    6250 3300
	0    1    1    0   
$EndComp
Text GLabel 6450 3300 2    61   Input ~ 0
A-2V0
Text GLabel 1850 1600 0    60   Input ~ 0
AGND
Text GLabel 3050 2550 0    60   Input ~ 0
AGND
Text GLabel 2400 3900 3    60   Input ~ 0
AGND
Text GLabel 1400 4400 3    60   Input ~ 0
AGND
Text GLabel 3350 4300 3    60   Input ~ 0
AGND
Text GLabel 4150 4350 3    60   Input ~ 0
AGND
Text GLabel 7150 4100 3    60   Input ~ 0
AGND
Text GLabel 8250 4250 3    60   Input ~ 0
AGND
Text GLabel 4700 3300 3    60   Input ~ 0
AGND
Text GLabel 9450 2100 0    60   Output ~ 0
AGND
NoConn ~ 2550 1700
Wire Wire Line
	2100 2200 2100 3000
Wire Wire Line
	2400 2200 2400 2750
Connection ~ 2100 2900
Wire Wire Line
	3850 2650 4100 2650
Wire Wire Line
	2400 2750 3250 2750
Wire Wire Line
	3450 2350 3550 2350
Wire Wire Line
	3950 2650 3950 2200
Wire Wire Line
	3950 2200 3700 2200
Connection ~ 3950 2650
Wire Wire Line
	3400 2200 3150 2200
Wire Wire Line
	3550 2950 3450 2950
Wire Wire Line
	6300 3050 6200 3050
Wire Wire Line
	6300 2450 6200 2450
Wire Wire Line
	3450 3850 3450 3750
Wire Wire Line
	3250 3750 3250 3850
Wire Wire Line
	3250 4150 3450 4150
Wire Wire Line
	3350 4150 3350 4300
Connection ~ 3350 4150
Wire Wire Line
	4050 4150 4250 4150
Wire Wire Line
	4150 4150 4150 4350
Connection ~ 4150 4150
Wire Wire Line
	4050 3750 4050 3850
Wire Wire Line
	4250 3750 4250 3850
Wire Wire Line
	8900 3850 8700 3850
Wire Wire Line
	8250 4150 8250 4250
Wire Wire Line
	8250 3400 8250 3550
Wire Wire Line
	7700 3850 7650 3850
Wire Wire Line
	7650 3850 7650 3500
Wire Wire Line
	7650 3500 8250 3500
Connection ~ 8250 3500
Wire Wire Line
	7150 3600 7150 3700
Wire Wire Line
	7150 4000 7150 4100
Wire Wire Line
	1900 2200 2100 2200
Wire Wire Line
	1900 1800 1900 2200
Wire Wire Line
	2400 2200 2650 2200
Wire Wire Line
	2650 2200 2650 1900
Wire Wire Line
	4450 2500 4450 2800
Wire Wire Line
	4450 2650 4400 2650
Connection ~ 4450 2650
Wire Wire Line
	4750 2500 4750 2800
Wire Wire Line
	4750 2650 4900 2650
Connection ~ 4750 2650
Wire Wire Line
	6000 2650 5700 2650
Wire Wire Line
	5900 2650 5900 2100
Wire Wire Line
	5900 2100 6150 2100
Connection ~ 5900 2650
Wire Wire Line
	6600 2750 6800 2750
Wire Wire Line
	6750 1650 6750 2750
Wire Wire Line
	6750 2100 6450 2100
Wire Wire Line
	5400 2650 5200 2650
Wire Wire Line
	5300 1650 5300 2700
Connection ~ 5300 2650
Wire Wire Line
	4850 2700 4850 2650
Connection ~ 4850 2650
Wire Wire Line
	6150 1650 5300 1650
Wire Wire Line
	6450 1650 6750 1650
Connection ~ 6750 2100
Wire Wire Line
	6450 3200 6400 3200
Wire Wire Line
	6100 3200 5950 3200
Wire Wire Line
	5950 2850 5950 3300
Wire Wire Line
	5950 2850 6000 2850
Wire Wire Line
	5950 3150 5900 3150
Connection ~ 5950 3150
Wire Wire Line
	5900 3000 5950 3000
Connection ~ 5950 3000
Wire Wire Line
	5600 3000 5600 3150
Wire Wire Line
	4850 3000 5600 3000
Connection ~ 5300 3000
Wire Wire Line
	1950 1800 1900 1800
Wire Wire Line
	2650 1900 2550 1900
Wire Wire Line
	1850 1600 1950 1600
Connection ~ 6750 2750
Wire Wire Line
	5300 3000 5300 3300
Wire Wire Line
	5300 3300 4700 3300
Wire Wire Line
	9450 1900 9550 1900
Wire Wire Line
	9550 2000 9450 2000
Wire Wire Line
	9450 2100 9550 2100
Wire Wire Line
	9550 2200 9450 2200
Wire Wire Line
	9450 2300 9550 2300
Wire Wire Line
	9550 2400 9450 2400
Wire Wire Line
	1300 4200 1500 4200
Wire Wire Line
	1400 4200 1400 4400
Connection ~ 1400 4200
Wire Wire Line
	1300 3800 1300 3900
Wire Wire Line
	1500 3800 1500 3900
Wire Wire Line
	2100 3600 2100 3900
Connection ~ 2100 3750
Connection ~ 2400 3750
Connection ~ 3150 2750
Wire Wire Line
	3250 2550 3050 2550
Wire Wire Line
	3150 2200 3150 2750
Wire Wire Line
	5950 3300 6100 3300
Connection ~ 5950 3200
Wire Wire Line
	6450 3300 6400 3300
Wire Wire Line
	2400 2900 2400 3900
NoConn ~ 8700 4000
$EndSCHEMATC
