G04 #@! TF.GenerationSoftware,KiCad,Pcbnew,5.0.2-bee76a0~70~ubuntu16.04.1*
G04 #@! TF.CreationDate,2019-03-19T17:42:59+01:00*
G04 #@! TF.ProjectId,IO_PCB,494f5f50-4342-42e6-9b69-6361645f7063,rev?*
G04 #@! TF.SameCoordinates,Original*
G04 #@! TF.FileFunction,Copper,L2,Bot*
G04 #@! TF.FilePolarity,Positive*
%FSLAX46Y46*%
G04 Gerber Fmt 4.6, Leading zero omitted, Abs format (unit mm)*
G04 Created by KiCad (PCBNEW 5.0.2-bee76a0~70~ubuntu16.04.1) date Di 19 Mär 2019 17:42:59 CET*
%MOMM*%
%LPD*%
G01*
G04 APERTURE LIST*
G04 #@! TA.AperFunction,ComponentPad*
%ADD10C,1.300000*%
G04 #@! TD*
G04 #@! TA.AperFunction,SMDPad,CuDef*
%ADD11R,1.800000X2.200000*%
G04 #@! TD*
G04 #@! TA.AperFunction,SMDPad,CuDef*
%ADD12R,0.300000X1.300000*%
G04 #@! TD*
G04 APERTURE END LIST*
D10*
G04 #@! TO.P,J1,2*
G04 #@! TO.N,/Ext_AGND*
X100000000Y-98170000D03*
G04 #@! TO.P,J1,3*
G04 #@! TO.N,/Ext_Ain*
X101440000Y-98170000D03*
G04 #@! TO.P,J1,1*
G04 #@! TO.N,/Ext_DGND*
X98560000Y-98170000D03*
G04 #@! TO.P,J1,6*
G04 #@! TO.N,/Ext_Misc*
X100720000Y-99520000D03*
G04 #@! TO.P,J1,5*
G04 #@! TO.N,/Ext_GPIO0*
X99280000Y-99520000D03*
G04 #@! TO.P,J1,4*
G04 #@! TO.N,/Ext_Vin*
X97840000Y-99520000D03*
G04 #@! TO.P,J1,7*
G04 #@! TO.N,/Ext_-2Va*
X102160000Y-99520000D03*
G04 #@! TO.P,J1,10*
G04 #@! TO.N,/Ext_3.3Va*
X101440000Y-100870000D03*
G04 #@! TO.P,J1,9*
G04 #@! TO.N,/Ext_TX*
X100000000Y-100870000D03*
G04 #@! TO.P,J1,8*
G04 #@! TO.N,/Ext_RX*
X98560000Y-100870000D03*
G04 #@! TO.P,J1,12*
G04 #@! TO.N,/Ext_Bout*
X100720000Y-102220000D03*
G04 #@! TO.P,J1,11*
G04 #@! TO.N,/Ext_Bat*
X99280000Y-102220000D03*
G04 #@! TD*
D11*
G04 #@! TO.P,J2,MP*
G04 #@! TO.N,N/C*
X95550000Y-99100000D03*
X86250000Y-99100000D03*
D12*
G04 #@! TO.P,J2,1*
G04 #@! TO.N,/Ext_-2Va*
X88150000Y-102350000D03*
G04 #@! TO.P,J2,2*
G04 #@! TO.N,/Ext_Ain*
X88650000Y-102350000D03*
G04 #@! TO.P,J2,3*
G04 #@! TO.N,/Ext_AGND*
X89150000Y-102350000D03*
G04 #@! TO.P,J2,4*
G04 #@! TO.N,/Ext_Misc*
X89650000Y-102350000D03*
G04 #@! TO.P,J2,5*
G04 #@! TO.N,/Ext_3.3Va*
X90150000Y-102350000D03*
G04 #@! TO.P,J2,6*
G04 #@! TO.N,/Ext_Bout*
X90650000Y-102350000D03*
G04 #@! TO.P,J2,7*
G04 #@! TO.N,/Ext_Bat*
X91150000Y-102350000D03*
G04 #@! TO.P,J2,8*
G04 #@! TO.N,/Ext_TX*
X91650000Y-102350000D03*
G04 #@! TO.P,J2,9*
G04 #@! TO.N,/Ext_RX*
X92150000Y-102350000D03*
G04 #@! TO.P,J2,10*
G04 #@! TO.N,/Ext_GPIO0*
X92650000Y-102350000D03*
G04 #@! TO.P,J2,11*
G04 #@! TO.N,/Ext_Vin*
X93150000Y-102350000D03*
G04 #@! TO.P,J2,12*
G04 #@! TO.N,/Ext_DGND*
X93650000Y-102350000D03*
G04 #@! TD*
M02*
