(module XDFN4 (layer F.Cu) (tedit 5BC36C20)
  (fp_text reference REF** (at -2.21 -1.21) (layer F.SilkS)
    (effects (font (size 1 1) (thickness 0.15)))
  )
  (fp_text value XDFN4 (at 2.39 1.46) (layer F.Fab)
    (effects (font (size 1 1) (thickness 0.15)))
  )
  (fp_line (start -0.5 -0.5) (end 0.5 -0.5) (layer F.Fab) (width 0.05))
  (fp_line (start 0.5 -0.5) (end 0.5 0.5) (layer F.Fab) (width 0.05))
  (fp_line (start 0.5 0.5) (end -0.5 0.5) (layer F.Fab) (width 0.05))
  (fp_line (start -0.5 0.5) (end -0.5 -0.5) (layer F.Fab) (width 0.05))
  (pad 2 smd custom (at 0.325 0.5 180) (size 0.2 0.2) (layers F.Cu F.Paste F.Mask)
    (zone_connect 0)
    (options (clearance outline) (anchor rect))
    (primitives
      (gr_poly (pts
         (xy 0.13 -0.1) (xy -0.13 -0.1) (xy -0.13 0.29) (xy -0.02 0.29) (xy 0.13 0.14)
) (width 0))
    ))
  (pad 1 smd custom (at -0.325 0.5 180) (size 0.2 0.2) (layers F.Cu F.Paste F.Mask)
    (zone_connect 0)
    (options (clearance outline) (anchor rect))
    (primitives
      (gr_poly (pts
         (xy -0.13 -0.1) (xy 0.13 -0.1) (xy 0.13 0.29) (xy 0.02 0.29) (xy -0.13 0.14)
) (width 0))
    ))
  (pad 4 smd custom (at -0.325 -0.5) (size 0.2 0.2) (layers F.Cu F.Paste F.Mask)
    (zone_connect 0)
    (options (clearance outline) (anchor rect))
    (primitives
      (gr_poly (pts
         (xy 0.13 -0.1) (xy -0.13 -0.1) (xy -0.13 0.29) (xy -0.02 0.29) (xy 0.13 0.14)
) (width 0))
    ))
  (pad 3 smd custom (at 0.325 -0.5) (size 0.2 0.2) (layers F.Cu F.Paste F.Mask)
    (zone_connect 0)
    (options (clearance outline) (anchor rect))
    (primitives
      (gr_poly (pts
         (xy -0.13 -0.1) (xy 0.13 -0.1) (xy 0.13 0.29) (xy 0.02 0.29) (xy -0.13 0.14)
) (width 0))
    ))
  (pad "" smd rect (at 0 0 45) (size 0.52 0.52) (layers F.Cu F.Paste F.Mask))
)
