{
	"JSON": {
		"ID": "1ee81604-d4d6-6257-9578-17d1935f2a6bxx",
		"label": "",
		"comment": "UUID6 is used"
	},
    "comment": "here you can write down something important about this setup file",
    "info": "List below ALL components, you used in your experiment. By using the UUID there is no possibility to mix something up.",
	"setup": {
		"1ee81604-db6a-6c09-b5ca-1261a72c2e89xx": {
            "type": "group_number",
			"name": "no.87",
            "comment": ""
        },
		"1ee815fe-8c80-63b1-a823-0dc22b525e4fxy": {
            "type": "instrument",
			"name": "raspberry_pi",
            "comment": ""
        },
		"1ee815d7-4660-6ab8-a6f1-cdc9e4be8d71": {
            "type": "sensor",
			"name": "temperature_warm_water",
            "comment": ""
        },
		"1ee815e2-e647-6817-98e6-492905d55baf": {
            "type": "sensor",
			"name": "temperature_cold_water",
            "comment": ""
        },
		"1ee81600-1570-6eec-91ac-b1a2599f3bfayy": {
            "type": "probe",
			"name": "heat_capicity",
            "comment": ""
        },
		"1ee83156-6642-6b48-9d50-0a9076ea9c96":{
			"type": "created",
			"name" : "15.11.2023",
            "comment": ""
			
		},
		"1ee83156-fada-60d8-8e43-b4da4645ae17":{
			"type": "experiment",
			"name" : "calorimetry_home",
            "comment": ""
			
		},
		
		"1ee830b7-7ba2-6513-9750-cfe28dccdb62":{
			"type": "authors",
			"name" : "Maximilian Groß",
            "comment": ""
			
		}
	}
}