{
	"JSON": {
		"ID": "1ee815d7-4660-6ab8-a6f1-cdc9e4be8d71",
		"label": "",
		"comment": "UUID6 is used"
	},
	"sensor": {
		"name": "Temperature_Sensor",
		"type": "DS18B20",
		"manufacturer": "keyestudio",
		"serial": "3ce104570258",
		"comment": "",
		"range": {
			"min": -55,
			"max": 125,
			"units": "°C"
		},
		"accuracy": {
			"value": 0.5,
			"type": "absolute",
			"unit": "degree_celsius"
		}
	}
}
