<?xml version="1.0" encoding="UTF-8" standalone="no"?>
<svg
   xmlns:dc="http://purl.org/dc/elements/1.1/"
   xmlns:cc="http://creativecommons.org/ns#"
   xmlns:rdf="http://www.w3.org/1999/02/22-rdf-syntax-ns#"
   xmlns:svg="http://www.w3.org/2000/svg"
   xmlns="http://www.w3.org/2000/svg"
   xmlns:xlink="http://www.w3.org/1999/xlink"
   xmlns:sodipodi="http://sodipodi.sourceforge.net/DTD/sodipodi-0.dtd"
   xmlns:inkscape="http://www.inkscape.org/namespaces/inkscape"
   inkscape:version="1.0 (4035a4fb49, 2020-05-01)"
   inkscape:export-ydpi="300"
   inkscape:export-xdpi="300"
   inkscape:export-filename="C:\Users\mie\Documents\GIT_Repositories\scan_analyze\V02_hw.png"
   sodipodi:docname="V02_hw.svg"
   id="svg555"
   version="1.1"
   viewBox="0 0 360 360"
   height="360pt"
   width="360pt">
  <sodipodi:namedview
     inkscape:current-layer="svg555"
     inkscape:window-maximized="1"
     inkscape:window-y="456"
     inkscape:window-x="-8"
     inkscape:cy="231.19104"
     inkscape:cx="234.01171"
     inkscape:zoom="1.2521683"
     showgrid="false"
     id="namedview557"
     inkscape:window-height="1017"
     inkscape:window-width="1920"
     inkscape:pageshadow="2"
     inkscape:pageopacity="0"
     guidetolerance="10"
     gridtolerance="10"
     objecttolerance="10"
     borderopacity="1"
     bordercolor="#666666"
     pagecolor="#ffffff" />
  <metadata
     id="metadata2">
    <rdf:RDF>
      <cc:Work>
        <dc:type
           rdf:resource="http://purl.org/dc/dcmitype/StillImage" />
        <dc:date>2023-04-26T18:39:27.567939</dc:date>
        <dc:format>image/svg+xml</dc:format>
        <dc:creator>
          <cc:Agent>
            <dc:title>Matplotlib v3.7.0, https://matplotlib.org/</dc:title>
          </cc:Agent>
        </dc:creator>
      </cc:Work>
    </rdf:RDF>
  </metadata>
  <defs
     id="defs6">
    <style
       id="style4"
       type="text/css">*{stroke-linejoin: round; stroke-linecap: butt}</style>
  </defs>
  <g
     id="figure_1">
    <g
       id="patch_1">
      <path
         id="path8"
         style="fill: #ffffff"
         d="M 0 360  L 360 360  L 360 0  L 0 0  z " />
    </g>
    <g
       id="axes_1">
      <g
         id="patch_2">
        <path
           id="path11"
           style="fill: #ffffff"
           d="M 45 320.4  L 268.2 320.4  L 268.2 43.2  L 45 43.2  z " />
      </g>
      <g
         id="PathCollection_1">
        <defs
           id="defs15">
          <path
             d="M 0 3  C 0.795609 3 1.55874 2.683901 2.12132 2.12132  C 2.683901 1.55874 3 0.795609 3 -0  C 3 -0.795609 2.683901 -1.55874 2.12132 -2.12132  C 1.55874 -2.683901 0.795609 -3 0 -3  C -0.795609 -3 -1.55874 -2.683901 -2.12132 -2.12132  C -2.683901 -1.55874 -3 -0.795609 -3 0  C -3 0.795609 -2.683901 1.55874 -2.12132 2.12132  C -1.55874 2.683901 -0.795609 3 0 3  z "
             id="C0_0_765d7ec078" />
        </defs>
        <g
           id="g19"
           clip-path="url(#pb7414c37d0)">
          <use
             id="use17"
             style="fill: #3182bd; stroke: #3182bd"
             y="60.930393"
             x="55.145455"
             xlink:href="#C0_0_765d7ec078" />
        </g>
        <g
           id="g23"
           clip-path="url(#pb7414c37d0)">
          <use
             id="use21"
             style="fill: #6baed6; stroke: #6baed6"
             y="57.99874"
             x="99.469511"
             xlink:href="#C0_0_765d7ec078" />
        </g>
        <g
           id="g27"
           clip-path="url(#pb7414c37d0)">
          <use
             id="use25"
             style="fill: #9ecae1; stroke: #9ecae1"
             y="66.793698"
             x="115.880148"
             xlink:href="#C0_0_765d7ec078" />
        </g>
        <g
           id="g31"
           clip-path="url(#pb7414c37d0)">
          <use
             id="use29"
             style="fill: #e6550d; stroke: #e6550d"
             y="95.621619"
             x="129.223377"
             xlink:href="#C0_0_765d7ec078" />
        </g>
        <g
           id="g35"
           clip-path="url(#pb7414c37d0)">
          <use
             id="use33"
             style="fill: #fd8d3c; stroke: #fd8d3c"
             y="100.629859"
             x="148.241311"
             xlink:href="#C0_0_765d7ec078" />
        </g>
        <g
           id="g39"
           clip-path="url(#pb7414c37d0)">
          <use
             id="use37"
             style="fill: #fdd0a2; stroke: #fdd0a2"
             y="307.8"
             x="232.748423"
             xlink:href="#C0_0_765d7ec078" />
        </g>
        <g
           id="g43"
           clip-path="url(#pb7414c37d0)">
          <use
             id="use41"
             style="fill: #31a354; stroke: #31a354"
             y="55.8"
             x="226.920346"
             xlink:href="#C0_0_765d7ec078" />
        </g>
        <g
           id="g47"
           clip-path="url(#pb7414c37d0)">
          <use
             id="use45"
             style="fill: #a1d99b; stroke: #a1d99b"
             y="189.068056"
             x="258.054545"
             xlink:href="#C0_0_765d7ec078" />
        </g>
        <g
           id="g51"
           clip-path="url(#pb7414c37d0)">
          <use
             id="use49"
             style="fill: #c7e9c0; stroke: #c7e9c0"
             y="98.43112"
             x="250.692764"
             xlink:href="#C0_0_765d7ec078" />
        </g>
        <g
           id="g55"
           clip-path="url(#pb7414c37d0)">
          <use
             id="use53"
             style="fill: #756bb1; stroke: #756bb1"
             y="86.82666"
             x="218.484972"
             xlink:href="#C0_0_765d7ec078" />
        </g>
        <g
           id="g59"
           clip-path="url(#pb7414c37d0)">
          <use
             id="use57"
             style="fill: #bcbddc; stroke: #bcbddc"
             y="78.398158"
             x="159.437353"
             xlink:href="#C0_0_765d7ec078" />
        </g>
        <g
           id="g63"
           clip-path="url(#pb7414c37d0)">
          <use
             id="use61"
             style="fill: #dadaeb; stroke: #dadaeb"
             y="71.31333"
             x="151.155349"
             xlink:href="#C0_0_765d7ec078" />
        </g>
        <g
           id="g67"
           clip-path="url(#pb7414c37d0)">
          <use
             id="use65"
             style="fill: #969696; stroke: #969696"
             y="105.027339"
             x="155.296351"
             xlink:href="#C0_0_765d7ec078" />
        </g>
        <g
           id="g71"
           clip-path="url(#pb7414c37d0)">
          <use
             id="use69"
             style="fill: #bdbdbd; stroke: #bdbdbd"
             y="68.992438"
             x="136.125046"
             xlink:href="#C0_0_765d7ec078" />
        </g>
        <g
           id="g75"
           clip-path="url(#pb7414c37d0)">
          <use
             id="use73"
             style="fill: #d9d9d9; stroke: #d9d9d9"
             y="65.450024"
             x="132.750897"
             xlink:href="#C0_0_765d7ec078" />
        </g>
      </g>
      <g
         id="matplotlib.axis_1">
        <g
           id="xtick_1">
          <g
             id="line2d_1">
            <defs
               id="defs79">
              <path
                 style="stroke: #000000; stroke-width: 0.8"
                 d="M 0 0  L 0 3.5  "
                 id="m1aeae48c3f" />
            </defs>
            <g
               id="g83">
              <use
                 id="use81"
                 style="stroke: #000000; stroke-width: 0.8"
                 y="320.4"
                 x="90.420656"
                 xlink:href="#m1aeae48c3f" />
            </g>
          </g>
          <g
             id="text_1">
            <!-- 8 -->
            <g
               id="g91"
               transform="translate(87.239406 334.998438) scale(0.1 -0.1)">
              <defs
                 id="defs87">
                <path
                   transform="scale(0.015625)"
                   d="M 2034 2216  Q 1584 2216 1326 1975  Q 1069 1734 1069 1313  Q 1069 891 1326 650  Q 1584 409 2034 409  Q 2484 409 2743 651  Q 3003 894 3003 1313  Q 3003 1734 2745 1975  Q 2488 2216 2034 2216  z M 1403 2484  Q 997 2584 770 2862  Q 544 3141 544 3541  Q 544 4100 942 4425  Q 1341 4750 2034 4750  Q 2731 4750 3128 4425  Q 3525 4100 3525 3541  Q 3525 3141 3298 2862  Q 3072 2584 2669 2484  Q 3125 2378 3379 2068  Q 3634 1759 3634 1313  Q 3634 634 3220 271  Q 2806 -91 2034 -91  Q 1263 -91 848 271  Q 434 634 434 1313  Q 434 1759 690 2068  Q 947 2378 1403 2484  z M 1172 3481  Q 1172 3119 1398 2916  Q 1625 2713 2034 2713  Q 2441 2713 2670 2916  Q 2900 3119 2900 3481  Q 2900 3844 2670 4047  Q 2441 4250 2034 4250  Q 1625 4250 1398 4047  Q 1172 3844 1172 3481  z "
                   id="DejaVuSans-38" />
              </defs>
              <use
                 id="use89"
                 xlink:href="#DejaVuSans-38" />
            </g>
          </g>
        </g>
        <g
           id="xtick_2">
          <g
             id="line2d_2">
            <g
               id="g97">
              <use
                 id="use95"
                 style="stroke: #000000; stroke-width: 0.8"
                 y="320.4"
                 x="151.768831"
                 xlink:href="#m1aeae48c3f" />
            </g>
          </g>
          <g
             id="text_2">
            <!-- 10 -->
            <g
               id="g108"
               transform="translate(145.406331 334.998438) scale(0.1 -0.1)">
              <defs
                 id="defs102">
                <path
                   transform="scale(0.015625)"
                   d="M 794 531  L 1825 531  L 1825 4091  L 703 3866  L 703 4441  L 1819 4666  L 2450 4666  L 2450 531  L 3481 531  L 3481 0  L 794 0  L 794 531  z "
                   id="DejaVuSans-31" />
                <path
                   transform="scale(0.015625)"
                   d="M 2034 4250  Q 1547 4250 1301 3770  Q 1056 3291 1056 2328  Q 1056 1369 1301 889  Q 1547 409 2034 409  Q 2525 409 2770 889  Q 3016 1369 3016 2328  Q 3016 3291 2770 3770  Q 2525 4250 2034 4250  z M 2034 4750  Q 2819 4750 3233 4129  Q 3647 3509 3647 2328  Q 3647 1150 3233 529  Q 2819 -91 2034 -91  Q 1250 -91 836 529  Q 422 1150 422 2328  Q 422 3509 836 4129  Q 1250 4750 2034 4750  z "
                   id="DejaVuSans-30" />
              </defs>
              <use
                 id="use104"
                 xlink:href="#DejaVuSans-31" />
              <use
                 id="use106"
                 x="63.623047"
                 xlink:href="#DejaVuSans-30" />
            </g>
          </g>
        </g>
        <g
           id="xtick_3">
          <g
             id="line2d_3">
            <g
               id="g114">
              <use
                 id="use112"
                 style="stroke: #000000; stroke-width: 0.8"
                 y="320.4"
                 x="213.117007"
                 xlink:href="#m1aeae48c3f" />
            </g>
          </g>
          <g
             id="text_3">
            <!-- 12 -->
            <g
               id="g124"
               transform="translate(206.754507 334.998438) scale(0.1 -0.1)">
              <defs
                 id="defs118">
                <path
                   transform="scale(0.015625)"
                   d="M 1228 531  L 3431 531  L 3431 0  L 469 0  L 469 531  Q 828 903 1448 1529  Q 2069 2156 2228 2338  Q 2531 2678 2651 2914  Q 2772 3150 2772 3378  Q 2772 3750 2511 3984  Q 2250 4219 1831 4219  Q 1534 4219 1204 4116  Q 875 4013 500 3803  L 500 4441  Q 881 4594 1212 4672  Q 1544 4750 1819 4750  Q 2544 4750 2975 4387  Q 3406 4025 3406 3419  Q 3406 3131 3298 2873  Q 3191 2616 2906 2266  Q 2828 2175 2409 1742  Q 1991 1309 1228 531  z "
                   id="DejaVuSans-32" />
              </defs>
              <use
                 id="use120"
                 xlink:href="#DejaVuSans-31" />
              <use
                 id="use122"
                 x="63.623047"
                 xlink:href="#DejaVuSans-32" />
            </g>
          </g>
        </g>
        <g
           id="text_4">
          <!-- width [mm] -->
          <g
             id="g159"
             transform="translate(127.5875 348.676562) scale(0.1 -0.1)">
            <defs
               id="defs137">
              <path
                 transform="scale(0.015625)"
                 d="M 269 3500  L 844 3500  L 1563 769  L 2278 3500  L 2956 3500  L 3675 769  L 4391 3500  L 4966 3500  L 4050 0  L 3372 0  L 2619 2869  L 1863 0  L 1184 0  L 269 3500  z "
                 id="DejaVuSans-77" />
              <path
                 transform="scale(0.015625)"
                 d="M 603 3500  L 1178 3500  L 1178 0  L 603 0  L 603 3500  z M 603 4863  L 1178 4863  L 1178 4134  L 603 4134  L 603 4863  z "
                 id="DejaVuSans-69" />
              <path
                 transform="scale(0.015625)"
                 d="M 2906 2969  L 2906 4863  L 3481 4863  L 3481 0  L 2906 0  L 2906 525  Q 2725 213 2448 61  Q 2172 -91 1784 -91  Q 1150 -91 751 415  Q 353 922 353 1747  Q 353 2572 751 3078  Q 1150 3584 1784 3584  Q 2172 3584 2448 3432  Q 2725 3281 2906 2969  z M 947 1747  Q 947 1113 1208 752  Q 1469 391 1925 391  Q 2381 391 2643 752  Q 2906 1113 2906 1747  Q 2906 2381 2643 2742  Q 2381 3103 1925 3103  Q 1469 3103 1208 2742  Q 947 2381 947 1747  z "
                 id="DejaVuSans-64" />
              <path
                 transform="scale(0.015625)"
                 d="M 1172 4494  L 1172 3500  L 2356 3500  L 2356 3053  L 1172 3053  L 1172 1153  Q 1172 725 1289 603  Q 1406 481 1766 481  L 2356 481  L 2356 0  L 1766 0  Q 1100 0 847 248  Q 594 497 594 1153  L 594 3053  L 172 3053  L 172 3500  L 594 3500  L 594 4494  L 1172 4494  z "
                 id="DejaVuSans-74" />
              <path
                 transform="scale(0.015625)"
                 d="M 3513 2113  L 3513 0  L 2938 0  L 2938 2094  Q 2938 2591 2744 2837  Q 2550 3084 2163 3084  Q 1697 3084 1428 2787  Q 1159 2491 1159 1978  L 1159 0  L 581 0  L 581 4863  L 1159 4863  L 1159 2956  Q 1366 3272 1645 3428  Q 1925 3584 2291 3584  Q 2894 3584 3203 3211  Q 3513 2838 3513 2113  z "
                 id="DejaVuSans-68" />
              <path
                 transform="scale(0.015625)"
                 id="DejaVuSans-20" />
              <path
                 transform="scale(0.015625)"
                 d="M 550 4863  L 1875 4863  L 1875 4416  L 1125 4416  L 1125 -397  L 1875 -397  L 1875 -844  L 550 -844  L 550 4863  z "
                 id="DejaVuSans-5b" />
              <path
                 transform="scale(0.015625)"
                 d="M 3328 2828  Q 3544 3216 3844 3400  Q 4144 3584 4550 3584  Q 5097 3584 5394 3201  Q 5691 2819 5691 2113  L 5691 0  L 5113 0  L 5113 2094  Q 5113 2597 4934 2840  Q 4756 3084 4391 3084  Q 3944 3084 3684 2787  Q 3425 2491 3425 1978  L 3425 0  L 2847 0  L 2847 2094  Q 2847 2600 2669 2842  Q 2491 3084 2119 3084  Q 1678 3084 1418 2786  Q 1159 2488 1159 1978  L 1159 0  L 581 0  L 581 3500  L 1159 3500  L 1159 2956  Q 1356 3278 1631 3431  Q 1906 3584 2284 3584  Q 2666 3584 2933 3390  Q 3200 3197 3328 2828  z "
                 id="DejaVuSans-6d" />
              <path
                 transform="scale(0.015625)"
                 d="M 1947 4863  L 1947 -844  L 622 -844  L 622 -397  L 1369 -397  L 1369 4416  L 622 4416  L 622 4863  L 1947 4863  z "
                 id="DejaVuSans-5d" />
            </defs>
            <use
               id="use139"
               xlink:href="#DejaVuSans-77" />
            <use
               id="use141"
               x="81.787109"
               xlink:href="#DejaVuSans-69" />
            <use
               id="use143"
               x="109.570312"
               xlink:href="#DejaVuSans-64" />
            <use
               id="use145"
               x="173.046875"
               xlink:href="#DejaVuSans-74" />
            <use
               id="use147"
               x="212.255859"
               xlink:href="#DejaVuSans-68" />
            <use
               id="use149"
               x="275.634766"
               xlink:href="#DejaVuSans-20" />
            <use
               id="use151"
               x="307.421875"
               xlink:href="#DejaVuSans-5b" />
            <use
               id="use153"
               x="346.435547"
               xlink:href="#DejaVuSans-6d" />
            <use
               id="use155"
               x="443.847656"
               xlink:href="#DejaVuSans-6d" />
            <use
               id="use157"
               x="541.259766"
               xlink:href="#DejaVuSans-5d" />
          </g>
        </g>
      </g>
      <g
         id="matplotlib.axis_2">
        <g
           id="ytick_1">
          <g
             id="line2d_4">
            <defs
               id="defs164">
              <path
                 style="stroke: #000000; stroke-width: 0.8"
                 d="M 0 0  L -3.5 0  "
                 id="mb54ec1dcec" />
            </defs>
            <g
               id="g168">
              <use
                 id="use166"
                 style="stroke: #000000; stroke-width: 0.8"
                 y="314.640524"
                 x="45"
                 xlink:href="#mb54ec1dcec" />
            </g>
          </g>
          <g
             id="text_5">
            <!-- −0.5 -->
            <g
               id="g184"
               transform="translate(13.717187 318.439742) scale(0.1 -0.1)">
              <defs
                 id="defs174">
                <path
                   transform="scale(0.015625)"
                   d="M 678 2272  L 4684 2272  L 4684 1741  L 678 1741  L 678 2272  z "
                   id="DejaVuSans-2212" />
                <path
                   transform="scale(0.015625)"
                   d="M 684 794  L 1344 794  L 1344 0  L 684 0  L 684 794  z "
                   id="DejaVuSans-2e" />
                <path
                   transform="scale(0.015625)"
                   d="M 691 4666  L 3169 4666  L 3169 4134  L 1269 4134  L 1269 2991  Q 1406 3038 1543 3061  Q 1681 3084 1819 3084  Q 2600 3084 3056 2656  Q 3513 2228 3513 1497  Q 3513 744 3044 326  Q 2575 -91 1722 -91  Q 1428 -91 1123 -41  Q 819 9 494 109  L 494 744  Q 775 591 1075 516  Q 1375 441 1709 441  Q 2250 441 2565 725  Q 2881 1009 2881 1497  Q 2881 1984 2565 2268  Q 2250 2553 1709 2553  Q 1456 2553 1204 2497  Q 953 2441 691 2322  L 691 4666  z "
                   id="DejaVuSans-35" />
              </defs>
              <use
                 id="use176"
                 xlink:href="#DejaVuSans-2212" />
              <use
                 id="use178"
                 x="83.789062"
                 xlink:href="#DejaVuSans-30" />
              <use
                 id="use180"
                 x="147.412109"
                 xlink:href="#DejaVuSans-2e" />
              <use
                 id="use182"
                 x="179.199219"
                 xlink:href="#DejaVuSans-35" />
            </g>
          </g>
        </g>
        <g
           id="ytick_2">
          <g
             id="line2d_5">
            <g
               id="g190">
              <use
                 id="use188"
                 style="stroke: #000000; stroke-width: 0.8"
                 y="253.564421"
                 x="45"
                 xlink:href="#mb54ec1dcec" />
            </g>
          </g>
          <g
             id="text_6">
            <!-- 0.0 -->
            <g
               id="g199"
               transform="translate(22.096875 257.363639) scale(0.1 -0.1)">
              <use
                 id="use193"
                 xlink:href="#DejaVuSans-30" />
              <use
                 id="use195"
                 x="63.623047"
                 xlink:href="#DejaVuSans-2e" />
              <use
                 id="use197"
                 x="95.410156"
                 xlink:href="#DejaVuSans-30" />
            </g>
          </g>
        </g>
        <g
           id="ytick_3">
          <g
             id="line2d_6">
            <g
               id="g205">
              <use
                 id="use203"
                 style="stroke: #000000; stroke-width: 0.8"
                 y="192.488318"
                 x="45"
                 xlink:href="#mb54ec1dcec" />
            </g>
          </g>
          <g
             id="text_7">
            <!-- 0.5 -->
            <g
               id="g214"
               transform="translate(22.096875 196.287537) scale(0.1 -0.1)">
              <use
                 id="use208"
                 xlink:href="#DejaVuSans-30" />
              <use
                 id="use210"
                 x="63.623047"
                 xlink:href="#DejaVuSans-2e" />
              <use
                 id="use212"
                 x="95.410156"
                 xlink:href="#DejaVuSans-35" />
            </g>
          </g>
        </g>
        <g
           id="ytick_4">
          <g
             id="line2d_7">
            <g
               id="g220">
              <use
                 id="use218"
                 style="stroke: #000000; stroke-width: 0.8"
                 y="131.412215"
                 x="45"
                 xlink:href="#mb54ec1dcec" />
            </g>
          </g>
          <g
             id="text_8">
            <!-- 1.0 -->
            <g
               id="g229"
               transform="translate(22.096875 135.211434) scale(0.1 -0.1)">
              <use
                 id="use223"
                 xlink:href="#DejaVuSans-31" />
              <use
                 id="use225"
                 x="63.623047"
                 xlink:href="#DejaVuSans-2e" />
              <use
                 id="use227"
                 x="95.410156"
                 xlink:href="#DejaVuSans-30" />
            </g>
          </g>
        </g>
        <g
           id="ytick_5">
          <g
             id="line2d_8">
            <g
               id="g235">
              <use
                 id="use233"
                 style="stroke: #000000; stroke-width: 0.8"
                 y="70.336112"
                 x="45"
                 xlink:href="#mb54ec1dcec" />
            </g>
          </g>
          <g
             id="text_9">
            <!-- 1.5 -->
            <g
               id="g244"
               transform="translate(22.096875 74.135331) scale(0.1 -0.1)">
              <use
                 id="use238"
                 xlink:href="#DejaVuSans-31" />
              <use
                 id="use240"
                 x="63.623047"
                 xlink:href="#DejaVuSans-2e" />
              <use
                 id="use242"
                 x="95.410156"
                 xlink:href="#DejaVuSans-35" />
            </g>
          </g>
        </g>
        <g
           id="text_10">
          <!-- height [mm] -->
          <g
             id="g274"
             transform="translate(7.6375 212.96875) rotate(-90) scale(0.1 -0.1)">
            <defs
               id="defs250">
              <path
                 transform="scale(0.015625)"
                 d="M 3597 1894  L 3597 1613  L 953 1613  Q 991 1019 1311 708  Q 1631 397 2203 397  Q 2534 397 2845 478  Q 3156 559 3463 722  L 3463 178  Q 3153 47 2828 -22  Q 2503 -91 2169 -91  Q 1331 -91 842 396  Q 353 884 353 1716  Q 353 2575 817 3079  Q 1281 3584 2069 3584  Q 2775 3584 3186 3129  Q 3597 2675 3597 1894  z M 3022 2063  Q 3016 2534 2758 2815  Q 2500 3097 2075 3097  Q 1594 3097 1305 2825  Q 1016 2553 972 2059  L 3022 2063  z "
                 id="DejaVuSans-65" />
              <path
                 transform="scale(0.015625)"
                 d="M 2906 1791  Q 2906 2416 2648 2759  Q 2391 3103 1925 3103  Q 1463 3103 1205 2759  Q 947 2416 947 1791  Q 947 1169 1205 825  Q 1463 481 1925 481  Q 2391 481 2648 825  Q 2906 1169 2906 1791  z M 3481 434  Q 3481 -459 3084 -895  Q 2688 -1331 1869 -1331  Q 1566 -1331 1297 -1286  Q 1028 -1241 775 -1147  L 775 -588  Q 1028 -725 1275 -790  Q 1522 -856 1778 -856  Q 2344 -856 2625 -561  Q 2906 -266 2906 331  L 2906 616  Q 2728 306 2450 153  Q 2172 0 1784 0  Q 1141 0 747 490  Q 353 981 353 1791  Q 353 2603 747 3093  Q 1141 3584 1784 3584  Q 2172 3584 2450 3431  Q 2728 3278 2906 2969  L 2906 3500  L 3481 3500  L 3481 434  z "
                 id="DejaVuSans-67" />
            </defs>
            <use
               id="use252"
               xlink:href="#DejaVuSans-68" />
            <use
               id="use254"
               x="63.378906"
               xlink:href="#DejaVuSans-65" />
            <use
               id="use256"
               x="124.902344"
               xlink:href="#DejaVuSans-69" />
            <use
               id="use258"
               x="152.685547"
               xlink:href="#DejaVuSans-67" />
            <use
               id="use260"
               x="216.162109"
               xlink:href="#DejaVuSans-68" />
            <use
               id="use262"
               x="279.541016"
               xlink:href="#DejaVuSans-74" />
            <use
               id="use264"
               x="318.75"
               xlink:href="#DejaVuSans-20" />
            <use
               id="use266"
               x="350.537109"
               xlink:href="#DejaVuSans-5b" />
            <use
               id="use268"
               x="389.550781"
               xlink:href="#DejaVuSans-6d" />
            <use
               id="use270"
               x="486.962891"
               xlink:href="#DejaVuSans-6d" />
            <use
               id="use272"
               x="584.375"
               xlink:href="#DejaVuSans-5d" />
          </g>
        </g>
      </g>
      <g
         id="patch_3">
        <path
           id="path278"
           style="fill: none; stroke: #000000; stroke-width: 0.8; stroke-linejoin: miter; stroke-linecap: square"
           d="M 45 320.4  L 45 43.2  " />
      </g>
      <g
         id="patch_4">
        <path
           id="path281"
           style="fill: none; stroke: #000000; stroke-width: 0.8; stroke-linejoin: miter; stroke-linecap: square"
           d="M 268.2 320.4  L 268.2 43.2  " />
      </g>
      <g
         id="patch_5">
        <path
           id="path284"
           style="fill: none; stroke: #000000; stroke-width: 0.8; stroke-linejoin: miter; stroke-linecap: square"
           d="M 45 320.4  L 268.2 320.4  " />
      </g>
      <g
         id="patch_6">
        <path
           id="path287"
           style="fill: none; stroke: #000000; stroke-width: 0.8; stroke-linejoin: miter; stroke-linecap: square"
           d="M 45 43.2  L 268.2 43.2  " />
      </g>
    </g>
    <g
       id="axes_2">
      <g
         id="patch_7">
        <path
           id="path291"
           style="fill: #ffffff"
           d="M 282.15 320.4  L 296.01 320.4  L 296.01 43.2  L 282.15 43.2  z " />
      </g>
      <g
         id="QuadMesh_1">
        <path
           id="path294"
           style="fill: #3182bd"
           clip-path="url(#p7856992bc9)"
           d="M 282.15 320.4  L 296.01 320.4  L 296.01 301.92  L 282.15 301.92  L 282.15 320.4  " />
        <path
           id="path296"
           style="fill: #6baed6"
           clip-path="url(#p7856992bc9)"
           d="M 282.15 301.92  L 296.01 301.92  L 296.01 283.44  L 282.15 283.44  L 282.15 301.92  " />
        <path
           id="path298"
           style="fill: #9ecae1"
           clip-path="url(#p7856992bc9)"
           d="M 282.15 283.44  L 296.01 283.44  L 296.01 264.96  L 282.15 264.96  L 282.15 283.44  " />
        <path
           id="path300"
           style="fill: #e6550d"
           clip-path="url(#p7856992bc9)"
           d="M 282.15 264.96  L 296.01 264.96  L 296.01 246.48  L 282.15 246.48  L 282.15 264.96  " />
        <path
           id="path302"
           style="fill: #fd8d3c"
           clip-path="url(#p7856992bc9)"
           d="M 282.15 246.48  L 296.01 246.48  L 296.01 228  L 282.15 228  L 282.15 246.48  " />
        <path
           id="path304"
           style="fill: #fdd0a2"
           clip-path="url(#p7856992bc9)"
           d="M 282.15 228  L 296.01 228  L 296.01 209.52  L 282.15 209.52  L 282.15 228  " />
        <path
           id="path306"
           style="fill: #31a354"
           clip-path="url(#p7856992bc9)"
           d="M 282.15 209.52  L 296.01 209.52  L 296.01 191.04  L 282.15 191.04  L 282.15 209.52  " />
        <path
           id="path308"
           style="fill: #a1d99b"
           clip-path="url(#p7856992bc9)"
           d="M 282.15 191.04  L 296.01 191.04  L 296.01 172.56  L 282.15 172.56  L 282.15 191.04  " />
        <path
           id="path310"
           style="fill: #c7e9c0"
           clip-path="url(#p7856992bc9)"
           d="M 282.15 172.56  L 296.01 172.56  L 296.01 154.08  L 282.15 154.08  L 282.15 172.56  " />
        <path
           id="path312"
           style="fill: #756bb1"
           clip-path="url(#p7856992bc9)"
           d="M 282.15 154.08  L 296.01 154.08  L 296.01 135.6  L 282.15 135.6  L 282.15 154.08  " />
        <path
           id="path314"
           style="fill: #bcbddc"
           clip-path="url(#p7856992bc9)"
           d="M 282.15 135.6  L 296.01 135.6  L 296.01 117.12  L 282.15 117.12  L 282.15 135.6  " />
        <path
           id="path316"
           style="fill: #dadaeb"
           clip-path="url(#p7856992bc9)"
           d="M 282.15 117.12  L 296.01 117.12  L 296.01 98.64  L 282.15 98.64  L 282.15 117.12  " />
        <path
           id="path318"
           style="fill: #969696"
           clip-path="url(#p7856992bc9)"
           d="M 282.15 98.64  L 296.01 98.64  L 296.01 80.16  L 282.15 80.16  L 282.15 98.64  " />
        <path
           id="path320"
           style="fill: #bdbdbd"
           clip-path="url(#p7856992bc9)"
           d="M 282.15 80.16  L 296.01 80.16  L 296.01 61.68  L 282.15 61.68  L 282.15 80.16  " />
        <path
           id="path322"
           style="fill: #d9d9d9"
           clip-path="url(#p7856992bc9)"
           d="M 282.15 61.68  L 296.01 61.68  L 296.01 43.2  L 282.15 43.2  L 282.15 61.68  " />
      </g>
      <g
         id="matplotlib.axis_3" />
      <g
         id="matplotlib.axis_4">
        <g
           id="ytick_6">
          <g
             id="line2d_9">
            <defs
               id="defs327">
              <path
                 style="stroke: #000000; stroke-width: 0.8"
                 d="M 0 0  L 3.5 0  "
                 id="ma27dadd272" />
            </defs>
            <g
               id="g331">
              <use
                 id="use329"
                 style="stroke: #000000; stroke-width: 0.8"
                 y="310.5"
                 x="296.01"
                 xlink:href="#ma27dadd272" />
            </g>
          </g>
          <g
             id="text_11">
            <!-- 1 -->
            <g
               id="g336"
               transform="translate(303.01 314.299219) scale(0.1 -0.1)">
              <use
                 id="use334"
                 xlink:href="#DejaVuSans-31" />
            </g>
          </g>
        </g>
        <g
           id="ytick_7">
          <g
             id="line2d_10">
            <g
               id="g342">
              <use
                 id="use340"
                 style="stroke: #000000; stroke-width: 0.8"
                 y="292.02"
                 x="296.01"
                 xlink:href="#ma27dadd272" />
            </g>
          </g>
          <g
             id="text_12">
            <!-- 2 -->
            <g
               id="g347"
               transform="translate(303.01 295.819219) scale(0.1 -0.1)">
              <use
                 id="use345"
                 xlink:href="#DejaVuSans-32" />
            </g>
          </g>
        </g>
        <g
           id="ytick_8">
          <g
             id="line2d_11">
            <g
               id="g353">
              <use
                 id="use351"
                 style="stroke: #000000; stroke-width: 0.8"
                 y="273.54"
                 x="296.01"
                 xlink:href="#ma27dadd272" />
            </g>
          </g>
          <g
             id="text_13">
            <!-- 3 -->
            <g
               id="g361"
               transform="translate(303.01 277.339219) scale(0.1 -0.1)">
              <defs
                 id="defs357">
                <path
                   transform="scale(0.015625)"
                   d="M 2597 2516  Q 3050 2419 3304 2112  Q 3559 1806 3559 1356  Q 3559 666 3084 287  Q 2609 -91 1734 -91  Q 1441 -91 1130 -33  Q 819 25 488 141  L 488 750  Q 750 597 1062 519  Q 1375 441 1716 441  Q 2309 441 2620 675  Q 2931 909 2931 1356  Q 2931 1769 2642 2001  Q 2353 2234 1838 2234  L 1294 2234  L 1294 2753  L 1863 2753  Q 2328 2753 2575 2939  Q 2822 3125 2822 3475  Q 2822 3834 2567 4026  Q 2313 4219 1838 4219  Q 1578 4219 1281 4162  Q 984 4106 628 3988  L 628 4550  Q 988 4650 1302 4700  Q 1616 4750 1894 4750  Q 2613 4750 3031 4423  Q 3450 4097 3450 3541  Q 3450 3153 3228 2886  Q 3006 2619 2597 2516  z "
                   id="DejaVuSans-33" />
              </defs>
              <use
                 id="use359"
                 xlink:href="#DejaVuSans-33" />
            </g>
          </g>
        </g>
        <g
           id="ytick_9">
          <g
             id="line2d_12">
            <g
               id="g367">
              <use
                 id="use365"
                 style="stroke: #000000; stroke-width: 0.8"
                 y="255.06"
                 x="296.01"
                 xlink:href="#ma27dadd272" />
            </g>
          </g>
          <g
             id="text_14">
            <!-- 4 -->
            <g
               id="g375"
               transform="translate(303.01 258.859219) scale(0.1 -0.1)">
              <defs
                 id="defs371">
                <path
                   transform="scale(0.015625)"
                   d="M 2419 4116  L 825 1625  L 2419 1625  L 2419 4116  z M 2253 4666  L 3047 4666  L 3047 1625  L 3713 1625  L 3713 1100  L 3047 1100  L 3047 0  L 2419 0  L 2419 1100  L 313 1100  L 313 1709  L 2253 4666  z "
                   id="DejaVuSans-34" />
              </defs>
              <use
                 id="use373"
                 xlink:href="#DejaVuSans-34" />
            </g>
          </g>
        </g>
        <g
           id="ytick_10">
          <g
             id="line2d_13">
            <g
               id="g381">
              <use
                 id="use379"
                 style="stroke: #000000; stroke-width: 0.8"
                 y="236.58"
                 x="296.01"
                 xlink:href="#ma27dadd272" />
            </g>
          </g>
          <g
             id="text_15">
            <!-- 5 -->
            <g
               id="g386"
               transform="translate(303.01 240.379219) scale(0.1 -0.1)">
              <use
                 id="use384"
                 xlink:href="#DejaVuSans-35" />
            </g>
          </g>
        </g>
        <g
           id="ytick_11">
          <g
             id="line2d_14">
            <g
               id="g392">
              <use
                 id="use390"
                 style="stroke: #000000; stroke-width: 0.8"
                 y="218.1"
                 x="296.01"
                 xlink:href="#ma27dadd272" />
            </g>
          </g>
          <g
             id="text_16">
            <!-- 6 -->
            <g
               id="g400"
               transform="translate(303.01 221.899219) scale(0.1 -0.1)">
              <defs
                 id="defs396">
                <path
                   transform="scale(0.015625)"
                   d="M 2113 2584  Q 1688 2584 1439 2293  Q 1191 2003 1191 1497  Q 1191 994 1439 701  Q 1688 409 2113 409  Q 2538 409 2786 701  Q 3034 994 3034 1497  Q 3034 2003 2786 2293  Q 2538 2584 2113 2584  z M 3366 4563  L 3366 3988  Q 3128 4100 2886 4159  Q 2644 4219 2406 4219  Q 1781 4219 1451 3797  Q 1122 3375 1075 2522  Q 1259 2794 1537 2939  Q 1816 3084 2150 3084  Q 2853 3084 3261 2657  Q 3669 2231 3669 1497  Q 3669 778 3244 343  Q 2819 -91 2113 -91  Q 1303 -91 875 529  Q 447 1150 447 2328  Q 447 3434 972 4092  Q 1497 4750 2381 4750  Q 2619 4750 2861 4703  Q 3103 4656 3366 4563  z "
                   id="DejaVuSans-36" />
              </defs>
              <use
                 id="use398"
                 xlink:href="#DejaVuSans-36" />
            </g>
          </g>
        </g>
        <g
           id="ytick_12">
          <g
             id="line2d_15">
            <g
               id="g406">
              <use
                 id="use404"
                 style="stroke: #000000; stroke-width: 0.8"
                 y="199.62"
                 x="296.01"
                 xlink:href="#ma27dadd272" />
            </g>
          </g>
          <g
             id="text_17">
            <!-- 7 -->
            <g
               id="g414"
               transform="translate(303.01 203.419219) scale(0.1 -0.1)">
              <defs
                 id="defs410">
                <path
                   transform="scale(0.015625)"
                   d="M 525 4666  L 3525 4666  L 3525 4397  L 1831 0  L 1172 0  L 2766 4134  L 525 4134  L 525 4666  z "
                   id="DejaVuSans-37" />
              </defs>
              <use
                 id="use412"
                 xlink:href="#DejaVuSans-37" />
            </g>
          </g>
        </g>
        <g
           id="ytick_13">
          <g
             id="line2d_16">
            <g
               id="g420">
              <use
                 id="use418"
                 style="stroke: #000000; stroke-width: 0.8"
                 y="181.14"
                 x="296.01"
                 xlink:href="#ma27dadd272" />
            </g>
          </g>
          <g
             id="text_18">
            <!-- 8 -->
            <g
               id="g425"
               transform="translate(303.01 184.939219) scale(0.1 -0.1)">
              <use
                 id="use423"
                 xlink:href="#DejaVuSans-38" />
            </g>
          </g>
        </g>
        <g
           id="ytick_14">
          <g
             id="line2d_17">
            <g
               id="g431">
              <use
                 id="use429"
                 style="stroke: #000000; stroke-width: 0.8"
                 y="162.66"
                 x="296.01"
                 xlink:href="#ma27dadd272" />
            </g>
          </g>
          <g
             id="text_19">
            <!-- 9 -->
            <g
               id="g439"
               transform="translate(303.01 166.459219) scale(0.1 -0.1)">
              <defs
                 id="defs435">
                <path
                   transform="scale(0.015625)"
                   d="M 703 97  L 703 672  Q 941 559 1184 500  Q 1428 441 1663 441  Q 2288 441 2617 861  Q 2947 1281 2994 2138  Q 2813 1869 2534 1725  Q 2256 1581 1919 1581  Q 1219 1581 811 2004  Q 403 2428 403 3163  Q 403 3881 828 4315  Q 1253 4750 1959 4750  Q 2769 4750 3195 4129  Q 3622 3509 3622 2328  Q 3622 1225 3098 567  Q 2575 -91 1691 -91  Q 1453 -91 1209 -44  Q 966 3 703 97  z M 1959 2075  Q 2384 2075 2632 2365  Q 2881 2656 2881 3163  Q 2881 3666 2632 3958  Q 2384 4250 1959 4250  Q 1534 4250 1286 3958  Q 1038 3666 1038 3163  Q 1038 2656 1286 2365  Q 1534 2075 1959 2075  z "
                   id="DejaVuSans-39" />
              </defs>
              <use
                 id="use437"
                 xlink:href="#DejaVuSans-39" />
            </g>
          </g>
        </g>
        <g
           id="ytick_15">
          <g
             id="line2d_18">
            <g
               id="g445">
              <use
                 id="use443"
                 style="stroke: #000000; stroke-width: 0.8"
                 y="144.18"
                 x="296.01"
                 xlink:href="#ma27dadd272" />
            </g>
          </g>
          <g
             id="text_20">
            <!-- 10 -->
            <g
               id="g452"
               transform="translate(303.01 147.979219) scale(0.1 -0.1)">
              <use
                 id="use448"
                 xlink:href="#DejaVuSans-31" />
              <use
                 id="use450"
                 x="63.623047"
                 xlink:href="#DejaVuSans-30" />
            </g>
          </g>
        </g>
        <g
           id="ytick_16">
          <g
             id="line2d_19">
            <g
               id="g458">
              <use
                 id="use456"
                 style="stroke: #000000; stroke-width: 0.8"
                 y="125.7"
                 x="296.01"
                 xlink:href="#ma27dadd272" />
            </g>
          </g>
          <g
             id="text_21">
            <!-- 11 -->
            <g
               id="g465"
               transform="translate(303.01 129.499219) scale(0.1 -0.1)">
              <use
                 id="use461"
                 xlink:href="#DejaVuSans-31" />
              <use
                 id="use463"
                 x="63.623047"
                 xlink:href="#DejaVuSans-31" />
            </g>
          </g>
        </g>
        <g
           id="ytick_17">
          <g
             id="line2d_20">
            <g
               id="g471">
              <use
                 id="use469"
                 style="stroke: #000000; stroke-width: 0.8"
                 y="107.22"
                 x="296.01"
                 xlink:href="#ma27dadd272" />
            </g>
          </g>
          <g
             id="text_22">
            <!-- 12 -->
            <g
               id="g478"
               transform="translate(303.01 111.019219) scale(0.1 -0.1)">
              <use
                 id="use474"
                 xlink:href="#DejaVuSans-31" />
              <use
                 id="use476"
                 x="63.623047"
                 xlink:href="#DejaVuSans-32" />
            </g>
          </g>
        </g>
        <g
           id="ytick_18">
          <g
             id="line2d_21">
            <g
               id="g484">
              <use
                 id="use482"
                 style="stroke: #000000; stroke-width: 0.8"
                 y="88.74"
                 x="296.01"
                 xlink:href="#ma27dadd272" />
            </g>
          </g>
          <g
             id="text_23">
            <!-- 13 -->
            <g
               id="g491"
               transform="translate(303.01 92.539219) scale(0.1 -0.1)">
              <use
                 id="use487"
                 xlink:href="#DejaVuSans-31" />
              <use
                 id="use489"
                 x="63.623047"
                 xlink:href="#DejaVuSans-33" />
            </g>
          </g>
        </g>
        <g
           id="ytick_19">
          <g
             id="line2d_22">
            <g
               id="g497">
              <use
                 id="use495"
                 style="stroke: #000000; stroke-width: 0.8"
                 y="70.26"
                 x="296.01"
                 xlink:href="#ma27dadd272" />
            </g>
          </g>
          <g
             id="text_24">
            <!-- 14 -->
            <g
               id="g504"
               transform="translate(303.01 74.059219) scale(0.1 -0.1)">
              <use
                 id="use500"
                 xlink:href="#DejaVuSans-31" />
              <use
                 id="use502"
                 x="63.623047"
                 xlink:href="#DejaVuSans-34" />
            </g>
          </g>
        </g>
        <g
           id="ytick_20">
          <g
             id="line2d_23">
            <g
               id="g510">
              <use
                 id="use508"
                 style="stroke: #000000; stroke-width: 0.8"
                 y="51.78"
                 x="296.01"
                 xlink:href="#ma27dadd272" />
            </g>
          </g>
          <g
             id="text_25">
            <!-- 15 -->
            <g
               id="g517"
               transform="translate(303.01 55.579219) scale(0.1 -0.1)">
              <use
                 id="use513"
                 xlink:href="#DejaVuSans-31" />
              <use
                 id="use515"
                 x="63.623047"
                 xlink:href="#DejaVuSans-35" />
            </g>
          </g>
        </g>
        <g
           id="text_26">
          <!-- Layer -->
          <g
             id="g537"
             transform="translate(323.136563 167.858594) rotate(-270) scale(0.1 -0.1)">
            <defs
               id="defs525">
              <path
                 transform="scale(0.015625)"
                 d="M 628 4666  L 1259 4666  L 1259 531  L 3531 531  L 3531 0  L 628 0  L 628 4666  z "
                 id="DejaVuSans-4c" />
              <path
                 transform="scale(0.015625)"
                 d="M 2194 1759  Q 1497 1759 1228 1600  Q 959 1441 959 1056  Q 959 750 1161 570  Q 1363 391 1709 391  Q 2188 391 2477 730  Q 2766 1069 2766 1631  L 2766 1759  L 2194 1759  z M 3341 1997  L 3341 0  L 2766 0  L 2766 531  Q 2569 213 2275 61  Q 1981 -91 1556 -91  Q 1019 -91 701 211  Q 384 513 384 1019  Q 384 1609 779 1909  Q 1175 2209 1959 2209  L 2766 2209  L 2766 2266  Q 2766 2663 2505 2880  Q 2244 3097 1772 3097  Q 1472 3097 1187 3025  Q 903 2953 641 2809  L 641 3341  Q 956 3463 1253 3523  Q 1550 3584 1831 3584  Q 2591 3584 2966 3190  Q 3341 2797 3341 1997  z "
                 id="DejaVuSans-61" />
              <path
                 transform="scale(0.015625)"
                 d="M 2059 -325  Q 1816 -950 1584 -1140  Q 1353 -1331 966 -1331  L 506 -1331  L 506 -850  L 844 -850  Q 1081 -850 1212 -737  Q 1344 -625 1503 -206  L 1606 56  L 191 3500  L 800 3500  L 1894 763  L 2988 3500  L 3597 3500  L 2059 -325  z "
                 id="DejaVuSans-79" />
              <path
                 transform="scale(0.015625)"
                 d="M 2631 2963  Q 2534 3019 2420 3045  Q 2306 3072 2169 3072  Q 1681 3072 1420 2755  Q 1159 2438 1159 1844  L 1159 0  L 581 0  L 581 3500  L 1159 3500  L 1159 2956  Q 1341 3275 1631 3429  Q 1922 3584 2338 3584  Q 2397 3584 2469 3576  Q 2541 3569 2628 3553  L 2631 2963  z "
                 id="DejaVuSans-72" />
            </defs>
            <use
               id="use527"
               xlink:href="#DejaVuSans-4c" />
            <use
               id="use529"
               x="55.712891"
               xlink:href="#DejaVuSans-61" />
            <use
               id="use531"
               x="116.992188"
               xlink:href="#DejaVuSans-79" />
            <use
               id="use533"
               x="176.171875"
               xlink:href="#DejaVuSans-65" />
            <use
               id="use535"
               x="237.695312"
               xlink:href="#DejaVuSans-72" />
          </g>
        </g>
      </g>
      <g
         id="LineCollection_1" />
      <g
         id="patch_8">
        <path
           id="path542"
           style="fill: none; stroke: #000000; stroke-width: 0.8; stroke-linejoin: miter; stroke-linecap: square"
           d="M 282.15 320.4  L 289.08 320.4  L 296.01 320.4  L 296.01 43.2  L 289.08 43.2  L 282.15 43.2  L 282.15 320.4  z " />
      </g>
    </g>
  </g>
  <defs
     id="defs553">
    <clipPath
       id="pb7414c37d0">
      <rect
         id="rect547"
         height="277.2"
         width="223.2"
         y="43.2"
         x="45" />
    </clipPath>
    <clipPath
       id="p7856992bc9">
      <rect
         id="rect550"
         height="277.2"
         width="13.86"
         y="43.2"
         x="282.15" />
    </clipPath>
  </defs>
</svg>
