{
	"JSON": {
		"ID": "1ee5ec2a-9a12-6199-af26-20cb6ca9e9ca",
		"label": "",
		"comment": "UUID6 is used"
	},
    "comment": "this setup is used to measure the specific heat capacity of a probe",
	"setup": {
		"1ee5ec0a-1830-63f5-ac3e-6f8ce4468546": {
            "type": "group_info",
			"name": "group_info",
            "comment": ""
        },
		"1ee5ec0d-e77c-68b7-90f7-2e33485ff91c": {
            "type": "instrument",
			"name": "raspberry_pi",
            "comment": ""
        },
        "1ee5ec0c-0b57-68cd-9d39-c9b7e9b18753": {
            "type": "calorimeter",
			"name": "calorimeter",
            "comment": ""
        },
		"1ee21750-5282-63bc-86e9-b4de622ee43e": {
            "type": "actor",
			"name": "sous_vide heater",
            "comment": "this heater is used to heat the water in the hot water bath for the samples"
        },
		"1ee5ec00-4a00-68a1-bb1e-873c2dd4dbde": {
            "type": "sensor",
			"name": "temperature_calorimeter_1",
            "comment": ""
        },
		"1ee5ec03-7e64-6071-8ca3-98dbab0a7719": {
            "type": "sensor",
			"name": "temperature_calorimeter_2",
            "comment": ""
        },
		"1ee5ec04-30cd-678f-a64b-0ce7544ef5e8": {
            "type": "sensor",
			"name": "temperature_calorimeter_3",
            "comment": ""
        },
		"1ee5ec04-c845-69e2-853a-25c11543466f": {
            "type": "sensor",
			"name": "temperature_environment",
            "comment": ""
        },
		"1ee5ec05-4aea-68f6-ad82-53b16fffae49": {
            "type": "sensor",
			"name": "temperature_hot_water_bath",
            "comment": ""
        },
		"1ee8d2e6-ddc1-697d-9dbe-20f5560edcb1": {
            "type": "probe",
			"name": "probe_PDC024",
            "comment": "ABS"
        }
	}
}