{
	"JSON": {
		"ID": "1ee83adc-dc5b-6758-81c2-726fc0d5d4e7",
		"label": "",
		"comment": "UUID6 is used"
	},
    "comment": "here you can write down something important about this setup file",
    "info": "List below ALL components, you used in your experiment. By using the UUID there is no possibility to mix something up.",
	"setup": {
		"1ee83a89-e621-6075-b8d5-a567ab7fcd78": {
            "type": "group_info",
			"name": "group_info",
            "comment": ""
        },
		"1ee83a8c-c4a8-6550-8e8f-90a07fba22dd": {
            "type": "instrument",
			"name": "raspberry_pi",
            "comment": ""
        },
		"1ee83a6f-bc37-65e9-89ed-ee6663466c1b": {
            "type": "sensor",
			"name": "temperature_cup_sensor",
            "comment": ""
        },
		"1ee83af4-f353-6eb1-816c-5e62e1810ee3": {
            "type": "probe",
			"name": "probe_description",
            "comment": ""
        },
		"1ee83a70-66be-62bc-882d-6ad21c723eef": {
			"type": "sensor",
			"name": "temperature_environment_sensor",
			"comment": ""
		}
	}
}