{
	"JSON": {
		"ID": "1ee83a89-e621-6075-b8d5-a567ab7fcd78",
		"label": "",
		"comment": "UUID6 is used"
	},
	"group": {
		"number": "25",
		"author": "Maurizio Fell",
		"experiment": "Kalorimetrie"
	}
}