EESchema Schematic File Version 4
EELAYER 30 0
EELAYER END
$Descr A4 11693 8268
encoding utf-8
Sheet 6 8
Title "7 Seg multiplexed"
Date "2020-08-02"
Rev "1.0"
Comp "EON ERC"
Comment1 "Designer: D. Wienands, S. Melcher, L. Jeske, D. Moll"
Comment2 "Supervisor: C. Guarnieri"
Comment3 ""
Comment4 ""
$EndDescr
Wire Wire Line
	8300 1500 8250 1500
Wire Wire Line
	8250 1500 8250 1200
Wire Wire Line
	8300 1600 8200 1600
Wire Wire Line
	8200 1600 8200 1400
Wire Wire Line
	8300 2300 7900 2300
Wire Wire Line
	7900 2300 7900 2200
Wire Wire Line
	8300 2400 7850 2400
Wire Wire Line
	7900 2200 7850 2200
Wire Wire Line
	7850 2000 7900 2000
Wire Wire Line
	7850 1800 7950 1800
Wire Wire Line
	7850 1600 8000 1600
$Comp
L Device:R_Small R?
U 1 1 5F2ABF0E
P 7750 1200
AR Path="/5F1AEAD2/5F2ABF0E" Ref="R?"  Part="1" 
AR Path="/5F276426/5F2ABF0E" Ref="R?"  Part="1" 
AR Path="/5F3DC4D2/5F2ABF0E" Ref="R?"  Part="1" 
F 0 "R?" V 7620 1200 39  0000 C CNN
F 1 "110" V 7680 1200 39  0000 C CNN
F 2 "Resistor_SMD:R_0603_1608Metric" H 7750 1200 50  0001 C CNN
F 3 "~" H 7750 1200 50  0001 C CNN
	1    7750 1200
	0    1    1    0   
$EndComp
Text Notes 8850 1200 0    118  ~ 0
1. Digit
Wire Wire Line
	7900 2000 7900 2100
Wire Wire Line
	7900 2100 8300 2100
Wire Wire Line
	7950 2000 7950 1800
Wire Wire Line
	7950 2000 8300 2000
Wire Wire Line
	8000 1800 8000 1600
Wire Wire Line
	8000 1800 8300 1800
Wire Wire Line
	7850 1400 8200 1400
Wire Wire Line
	7850 1200 8250 1200
Text Label 7550 1400 2    39   ~ 0
D
Text Label 7550 1200 2    39   ~ 0
E
Text Label 7550 1600 2    39   ~ 0
C
Text Label 7550 1800 2    39   ~ 0
B
Text Label 7550 2000 2    39   ~ 0
A
Text Label 7550 2200 2    39   ~ 0
F
Text Label 7550 2400 2    39   ~ 0
G
Wire Wire Line
	7650 1200 7550 1200
Wire Wire Line
	7550 1400 7650 1400
Wire Wire Line
	7650 1600 7550 1600
Wire Wire Line
	7550 1800 7650 1800
Wire Wire Line
	7650 2000 7550 2000
Wire Wire Line
	7550 2200 7650 2200
Wire Wire Line
	7650 2400 7550 2400
NoConn ~ 8300 1900
Text Label 8200 1700 2    39   ~ 0
S1
Text Label 8200 2200 2    39   ~ 0
S1
Wire Wire Line
	8300 2200 8200 2200
Wire Wire Line
	8300 1700 8200 1700
Wire Wire Line
	8300 3050 8250 3050
Wire Wire Line
	8250 3050 8250 2750
Wire Wire Line
	8300 3150 8200 3150
Wire Wire Line
	8200 3150 8200 2950
Wire Wire Line
	8300 3850 7900 3850
Wire Wire Line
	7900 3850 7900 3750
Wire Wire Line
	8300 3950 7850 3950
Wire Wire Line
	7900 3750 7850 3750
Wire Wire Line
	7850 3550 7900 3550
Wire Wire Line
	7850 3350 7950 3350
Wire Wire Line
	7850 3150 8000 3150
Text Notes 8850 2750 0    118  ~ 0
2. Digit
Wire Wire Line
	7900 3550 7900 3650
Wire Wire Line
	7900 3650 8300 3650
Wire Wire Line
	7950 3550 7950 3350
Wire Wire Line
	7950 3550 8300 3550
Wire Wire Line
	8000 3350 8000 3150
Wire Wire Line
	8000 3350 8300 3350
Wire Wire Line
	7850 2950 8200 2950
Wire Wire Line
	7850 2750 8250 2750
Text Label 7550 2950 2    39   ~ 0
D
Text Label 7550 2750 2    39   ~ 0
E
Text Label 7550 3150 2    39   ~ 0
C
Text Label 7550 3350 2    39   ~ 0
B
Text Label 7550 3550 2    39   ~ 0
A
Text Label 7550 3750 2    39   ~ 0
F
Text Label 7550 3950 2    39   ~ 0
G
Wire Wire Line
	7650 2750 7550 2750
Wire Wire Line
	7550 2950 7650 2950
Wire Wire Line
	7650 3150 7550 3150
Wire Wire Line
	7550 3350 7650 3350
Wire Wire Line
	7650 3550 7550 3550
Wire Wire Line
	7550 3750 7650 3750
Wire Wire Line
	7650 3950 7550 3950
NoConn ~ 8300 3450
Text Label 8200 3250 2    39   ~ 0
S2
Text Label 8200 3750 2    39   ~ 0
S2
Wire Wire Line
	8300 3750 8200 3750
Wire Wire Line
	8300 3250 8200 3250
$Comp
L Device:R_Small R?
U 1 1 5F32125A
P 4800 1050
AR Path="/5F1AEAD2/5F32125A" Ref="R?"  Part="1" 
AR Path="/5F276426/5F32125A" Ref="R?"  Part="1" 
AR Path="/5F3DC4D2/5F32125A" Ref="R?"  Part="1" 
F 0 "R?" H 4700 1100 39  0000 C CNN
F 1 "10k" H 4700 1050 39  0000 C CNN
F 2 "Resistor_SMD:R_0603_1608Metric" H 4800 1050 50  0001 C CNN
F 3 "~" H 4800 1050 50  0001 C CNN
	1    4800 1050
	1    0    0    -1  
$EndComp
Text HLabel 1600 4550 0    39   Input ~ 0
Digit2
Text Label 2250 3300 0    39   ~ 0
S1
Text Label 2250 4250 0    39   ~ 0
S2
$Comp
L Device:R_Small R?
U 1 1 5F4A03CE
P 7750 1400
AR Path="/5F1AEAD2/5F4A03CE" Ref="R?"  Part="1" 
AR Path="/5F276426/5F4A03CE" Ref="R?"  Part="1" 
AR Path="/5F3DC4D2/5F4A03CE" Ref="R?"  Part="1" 
F 0 "R?" V 7620 1400 39  0000 C CNN
F 1 "110" V 7680 1400 39  0000 C CNN
F 2 "Resistor_SMD:R_0603_1608Metric" H 7750 1400 50  0001 C CNN
F 3 "~" H 7750 1400 50  0001 C CNN
	1    7750 1400
	0    1    1    0   
$EndComp
$Comp
L Device:R_Small R?
U 1 1 5F4A06D6
P 7750 1600
AR Path="/5F1AEAD2/5F4A06D6" Ref="R?"  Part="1" 
AR Path="/5F276426/5F4A06D6" Ref="R?"  Part="1" 
AR Path="/5F3DC4D2/5F4A06D6" Ref="R?"  Part="1" 
F 0 "R?" V 7620 1600 39  0000 C CNN
F 1 "110" V 7680 1600 39  0000 C CNN
F 2 "Resistor_SMD:R_0603_1608Metric" H 7750 1600 50  0001 C CNN
F 3 "~" H 7750 1600 50  0001 C CNN
	1    7750 1600
	0    1    1    0   
$EndComp
$Comp
L Device:R_Small R?
U 1 1 5F4A08D3
P 7750 1800
AR Path="/5F1AEAD2/5F4A08D3" Ref="R?"  Part="1" 
AR Path="/5F276426/5F4A08D3" Ref="R?"  Part="1" 
AR Path="/5F3DC4D2/5F4A08D3" Ref="R?"  Part="1" 
F 0 "R?" V 7620 1800 39  0000 C CNN
F 1 "110" V 7680 1800 39  0000 C CNN
F 2 "Resistor_SMD:R_0603_1608Metric" H 7750 1800 50  0001 C CNN
F 3 "~" H 7750 1800 50  0001 C CNN
	1    7750 1800
	0    1    1    0   
$EndComp
$Comp
L Device:R_Small R?
U 1 1 5F4A0D22
P 7750 2000
AR Path="/5F1AEAD2/5F4A0D22" Ref="R?"  Part="1" 
AR Path="/5F276426/5F4A0D22" Ref="R?"  Part="1" 
AR Path="/5F3DC4D2/5F4A0D22" Ref="R?"  Part="1" 
F 0 "R?" V 7620 2000 39  0000 C CNN
F 1 "110" V 7680 2000 39  0000 C CNN
F 2 "Resistor_SMD:R_0603_1608Metric" H 7750 2000 50  0001 C CNN
F 3 "~" H 7750 2000 50  0001 C CNN
	1    7750 2000
	0    1    1    0   
$EndComp
$Comp
L Device:R_Small R?
U 1 1 5F4A8423
P 7750 2200
AR Path="/5F1AEAD2/5F4A8423" Ref="R?"  Part="1" 
AR Path="/5F276426/5F4A8423" Ref="R?"  Part="1" 
AR Path="/5F3DC4D2/5F4A8423" Ref="R?"  Part="1" 
F 0 "R?" V 7620 2200 39  0000 C CNN
F 1 "110" V 7680 2200 39  0000 C CNN
F 2 "Resistor_SMD:R_0603_1608Metric" H 7750 2200 50  0001 C CNN
F 3 "~" H 7750 2200 50  0001 C CNN
	1    7750 2200
	0    1    1    0   
$EndComp
$Comp
L Device:R_Small R?
U 1 1 5F4AFA1F
P 7750 2400
AR Path="/5F1AEAD2/5F4AFA1F" Ref="R?"  Part="1" 
AR Path="/5F276426/5F4AFA1F" Ref="R?"  Part="1" 
AR Path="/5F3DC4D2/5F4AFA1F" Ref="R?"  Part="1" 
F 0 "R?" V 7620 2400 39  0000 C CNN
F 1 "110" V 7680 2400 39  0000 C CNN
F 2 "Resistor_SMD:R_0603_1608Metric" H 7750 2400 50  0001 C CNN
F 3 "~" H 7750 2400 50  0001 C CNN
	1    7750 2400
	0    1    1    0   
$EndComp
$Comp
L Device:R_Small R?
U 1 1 5F4B7069
P 7750 2750
AR Path="/5F1AEAD2/5F4B7069" Ref="R?"  Part="1" 
AR Path="/5F276426/5F4B7069" Ref="R?"  Part="1" 
AR Path="/5F3DC4D2/5F4B7069" Ref="R?"  Part="1" 
F 0 "R?" V 7620 2750 39  0000 C CNN
F 1 "110" V 7680 2750 39  0000 C CNN
F 2 "Resistor_SMD:R_0603_1608Metric" H 7750 2750 50  0001 C CNN
F 3 "~" H 7750 2750 50  0001 C CNN
	1    7750 2750
	0    1    1    0   
$EndComp
$Comp
L Device:R_Small R?
U 1 1 5F4BE6B4
P 7750 2950
AR Path="/5F1AEAD2/5F4BE6B4" Ref="R?"  Part="1" 
AR Path="/5F276426/5F4BE6B4" Ref="R?"  Part="1" 
AR Path="/5F3DC4D2/5F4BE6B4" Ref="R?"  Part="1" 
F 0 "R?" V 7620 2950 39  0000 C CNN
F 1 "110" V 7680 2950 39  0000 C CNN
F 2 "Resistor_SMD:R_0603_1608Metric" H 7750 2950 50  0001 C CNN
F 3 "~" H 7750 2950 50  0001 C CNN
	1    7750 2950
	0    1    1    0   
$EndComp
$Comp
L Device:R_Small R?
U 1 1 5F4C5CAA
P 7750 3150
AR Path="/5F1AEAD2/5F4C5CAA" Ref="R?"  Part="1" 
AR Path="/5F276426/5F4C5CAA" Ref="R?"  Part="1" 
AR Path="/5F3DC4D2/5F4C5CAA" Ref="R?"  Part="1" 
F 0 "R?" V 7620 3150 39  0000 C CNN
F 1 "110" V 7680 3150 39  0000 C CNN
F 2 "Resistor_SMD:R_0603_1608Metric" H 7750 3150 50  0001 C CNN
F 3 "~" H 7750 3150 50  0001 C CNN
	1    7750 3150
	0    1    1    0   
$EndComp
$Comp
L Device:R_Small R?
U 1 1 5F4CD2E6
P 7750 3350
AR Path="/5F1AEAD2/5F4CD2E6" Ref="R?"  Part="1" 
AR Path="/5F276426/5F4CD2E6" Ref="R?"  Part="1" 
AR Path="/5F3DC4D2/5F4CD2E6" Ref="R?"  Part="1" 
F 0 "R?" V 7620 3350 39  0000 C CNN
F 1 "110" V 7680 3350 39  0000 C CNN
F 2 "Resistor_SMD:R_0603_1608Metric" H 7750 3350 50  0001 C CNN
F 3 "~" H 7750 3350 50  0001 C CNN
	1    7750 3350
	0    1    1    0   
$EndComp
$Comp
L Device:R_Small R?
U 1 1 5F4D493C
P 7750 3550
AR Path="/5F1AEAD2/5F4D493C" Ref="R?"  Part="1" 
AR Path="/5F276426/5F4D493C" Ref="R?"  Part="1" 
AR Path="/5F3DC4D2/5F4D493C" Ref="R?"  Part="1" 
F 0 "R?" V 7620 3550 39  0000 C CNN
F 1 "110" V 7680 3550 39  0000 C CNN
F 2 "Resistor_SMD:R_0603_1608Metric" H 7750 3550 50  0001 C CNN
F 3 "~" H 7750 3550 50  0001 C CNN
	1    7750 3550
	0    1    1    0   
$EndComp
$Comp
L Device:R_Small R?
U 1 1 5F4DBF85
P 7750 3750
AR Path="/5F1AEAD2/5F4DBF85" Ref="R?"  Part="1" 
AR Path="/5F276426/5F4DBF85" Ref="R?"  Part="1" 
AR Path="/5F3DC4D2/5F4DBF85" Ref="R?"  Part="1" 
F 0 "R?" V 7620 3750 39  0000 C CNN
F 1 "110" V 7680 3750 39  0000 C CNN
F 2 "Resistor_SMD:R_0603_1608Metric" H 7750 3750 50  0001 C CNN
F 3 "~" H 7750 3750 50  0001 C CNN
	1    7750 3750
	0    1    1    0   
$EndComp
$Comp
L Device:R_Small R?
U 1 1 5F4E356B
P 7750 3950
AR Path="/5F1AEAD2/5F4E356B" Ref="R?"  Part="1" 
AR Path="/5F276426/5F4E356B" Ref="R?"  Part="1" 
AR Path="/5F3DC4D2/5F4E356B" Ref="R?"  Part="1" 
F 0 "R?" V 7620 3950 39  0000 C CNN
F 1 "110" V 7680 3950 39  0000 C CNN
F 2 "Resistor_SMD:R_0603_1608Metric" H 7750 3950 50  0001 C CNN
F 3 "~" H 7750 3950 50  0001 C CNN
	1    7750 3950
	0    1    1    0   
$EndComp
$Comp
L LEGOS:ACSC03-41SEKWA-F01 LED?
U 1 1 5F4347E5
P 8300 3100
F 0 "LED?" H 9930 4296 50  0000 L CNN
F 1 "ACSC03-41SEKWA-F01" H 9930 4205 50  0000 L CNN
F 2 "LEGOS:ACSA03-41SURKWA-F01" H 9950 4650 50  0001 L CNN
F 3 "https://www.mouser.de/datasheet/2/216/ACSC03-41SEKWA-F01-31243.pdf" H 9950 4600 50  0001 L CNN
F 4 "LED Displays & Accessories Single Red 630 nm Common Anode" H 9950 4500 50  0001 L CNN "Description"
F 5 "4" H 9950 4400 50  0001 L CNN "Height"
F 6 "Kingbright" H 9950 4300 50  0001 L CNN "Manufacturer_Name"
F 7 "ACSA03-41SURKWA-F01" H 9950 4200 50  0001 L CNN "Manufacturer_Part_Number"
F 8 "ACSA03-41SURKWA-F01" H 9950 4100 50  0001 L CNN "Arrow Part Number"
F 9 "https://www.arrow.com/en/products/acsa03-41surkwa-f01/kingbright" H 9950 3950 50  0001 L CNN "Arrow Price/Stock"
F 10 "604-ACSA03-41SURKWA" H 9950 3850 50  0001 L CNN "Mouser Part Number"
F 11 "https://www.mouser.com/Search/Refine.aspx?Keyword=604-ACSA03-41SURKWA" H 9950 3750 50  0001 L CNN "Mouser Price/Stock"
	1    8300 3100
	1    0    0    -1  
$EndComp
$Comp
L LEGOS:ACSC03-41SEKWA-F01 LED?
U 1 1 5F4377B6
P 8300 4650
F 0 "LED?" H 9930 5846 50  0000 L CNN
F 1 "ACSC03-41SEKWA-F01" H 9930 5755 50  0000 L CNN
F 2 "LEGOS:ACSA03-41SURKWA-F01" H 9950 6200 50  0001 L CNN
F 3 "https://www.mouser.de/datasheet/2/216/ACSC03-41SEKWA-F01-31243.pdf" H 9950 6150 50  0001 L CNN
F 4 "LED Displays & Accessories Single Red 630 nm Common Anode" H 9950 6050 50  0001 L CNN "Description"
F 5 "4" H 9950 5950 50  0001 L CNN "Height"
F 6 "Kingbright" H 9950 5850 50  0001 L CNN "Manufacturer_Name"
F 7 "ACSA03-41SURKWA-F01" H 9950 5750 50  0001 L CNN "Manufacturer_Part_Number"
F 8 "ACSA03-41SURKWA-F01" H 9950 5650 50  0001 L CNN "Arrow Part Number"
F 9 "https://www.arrow.com/en/products/acsa03-41surkwa-f01/kingbright" H 9950 5500 50  0001 L CNN "Arrow Price/Stock"
F 10 "604-ACSA03-41SURKWA" H 9950 5400 50  0001 L CNN "Mouser Part Number"
F 11 "https://www.mouser.com/Search/Refine.aspx?Keyword=604-ACSA03-41SURKWA" H 9950 5300 50  0001 L CNN "Mouser Price/Stock"
	1    8300 4650
	1    0    0    -1  
$EndComp
$Comp
L Device:R_Small R?
U 1 1 5F43CF49
P 1700 4750
AR Path="/5F1AEAD2/5F43CF49" Ref="R?"  Part="1" 
AR Path="/5F276426/5F43CF49" Ref="R?"  Part="1" 
AR Path="/5F3DC4D2/5F43CF49" Ref="R?"  Part="1" 
F 0 "R?" H 1600 4800 39  0000 C CNN
F 1 "10k" H 1600 4750 39  0000 C CNN
F 2 "Resistor_SMD:R_0603_1608Metric" H 1700 4750 50  0001 C CNN
F 3 "~" H 1700 4750 50  0001 C CNN
	1    1700 4750
	1    0    0    -1  
$EndComp
Wire Wire Line
	1700 4650 1700 4550
$Comp
L power:GND #PWR?
U 1 1 5F43CF50
P 2100 4850
F 0 "#PWR?" H 2100 4600 50  0001 C CNN
F 1 "GND" H 2105 4685 39  0000 C CNN
F 2 "" H 2100 4850 50  0001 C CNN
F 3 "" H 2100 4850 50  0001 C CNN
	1    2100 4850
	1    0    0    -1  
$EndComp
$Comp
L power:GND #PWR?
U 1 1 5F43CF56
P 1700 4850
F 0 "#PWR?" H 1700 4600 50  0001 C CNN
F 1 "GND" H 1705 4685 39  0000 C CNN
F 2 "" H 1700 4850 50  0001 C CNN
F 3 "" H 1700 4850 50  0001 C CNN
	1    1700 4850
	1    0    0    -1  
$EndComp
Wire Wire Line
	2100 4750 2100 4850
Wire Wire Line
	1600 4550 1700 4550
Connection ~ 1700 4550
Wire Wire Line
	1700 4550 1800 4550
$Comp
L Device:Q_NMOS_GSD Q?
U 1 1 5F43CF64
P 2000 4550
AR Path="/5F111AF8/5F43CF64" Ref="Q?"  Part="1" 
AR Path="/5F276426/5F43CF64" Ref="Q?"  Part="1" 
AR Path="/5F3DC4D2/5F43CF64" Ref="Q?"  Part="1" 
F 0 "Q?" H 2204 4596 39  0000 L CNN
F 1 "2N7002NXA" H 2204 4505 39  0000 L CNN
F 2 "Package_TO_SOT_SMD:SOT-23" H 2200 4650 50  0001 C CNN
F 3 "https://eu.mouser.com/datasheet/2/916/2N7002NXAK-1651343.pdf" H 2000 4550 50  0001 C CNN
	1    2000 4550
	1    0    0    -1  
$EndComp
$Comp
L Device:R_Small R?
U 1 1 5F451B02
P 1700 3800
AR Path="/5F1AEAD2/5F451B02" Ref="R?"  Part="1" 
AR Path="/5F276426/5F451B02" Ref="R?"  Part="1" 
AR Path="/5F3DC4D2/5F451B02" Ref="R?"  Part="1" 
F 0 "R?" H 1600 3850 39  0000 C CNN
F 1 "10k" H 1600 3800 39  0000 C CNN
F 2 "Resistor_SMD:R_0603_1608Metric" H 1700 3800 50  0001 C CNN
F 3 "~" H 1700 3800 50  0001 C CNN
	1    1700 3800
	1    0    0    -1  
$EndComp
Wire Wire Line
	1700 3700 1700 3600
$Comp
L power:GND #PWR?
U 1 1 5F451B09
P 2100 3900
F 0 "#PWR?" H 2100 3650 50  0001 C CNN
F 1 "GND" H 2105 3735 39  0000 C CNN
F 2 "" H 2100 3900 50  0001 C CNN
F 3 "" H 2100 3900 50  0001 C CNN
	1    2100 3900
	1    0    0    -1  
$EndComp
$Comp
L power:GND #PWR?
U 1 1 5F451B0F
P 1700 3900
F 0 "#PWR?" H 1700 3650 50  0001 C CNN
F 1 "GND" H 1705 3735 39  0000 C CNN
F 2 "" H 1700 3900 50  0001 C CNN
F 3 "" H 1700 3900 50  0001 C CNN
	1    1700 3900
	1    0    0    -1  
$EndComp
Wire Wire Line
	2100 3800 2100 3900
Wire Wire Line
	1600 3600 1700 3600
Connection ~ 1700 3600
Wire Wire Line
	1700 3600 1800 3600
$Comp
L Device:Q_NMOS_GSD Q?
U 1 1 5F451B1D
P 2000 3600
AR Path="/5F111AF8/5F451B1D" Ref="Q?"  Part="1" 
AR Path="/5F276426/5F451B1D" Ref="Q?"  Part="1" 
AR Path="/5F3DC4D2/5F451B1D" Ref="Q?"  Part="1" 
F 0 "Q?" H 2204 3646 39  0000 L CNN
F 1 "2N7002NXA" H 2204 3555 39  0000 L CNN
F 2 "Package_TO_SOT_SMD:SOT-23" H 2200 3700 50  0001 C CNN
F 3 "https://eu.mouser.com/datasheet/2/916/2N7002NXAK-1651343.pdf" H 2000 3600 50  0001 C CNN
	1    2000 3600
	1    0    0    -1  
$EndComp
Text HLabel 1600 3600 0    39   Input ~ 0
Digit1
$Comp
L power:+5V #PWR?
U 1 1 5F47E1F5
P 2150 950
F 0 "#PWR?" H 2150 800 50  0001 C CNN
F 1 "+5V" H 2165 1115 39  0000 C CNN
F 2 "" H 2150 950 50  0001 C CNN
F 3 "" H 2150 950 50  0001 C CNN
	1    2150 950 
	1    0    0    -1  
$EndComp
$Comp
L power:GND #PWR?
U 1 1 5F47E8F6
P 2150 2150
F 0 "#PWR?" H 2150 1900 50  0001 C CNN
F 1 "GND" H 2155 1985 39  0000 C CNN
F 2 "" H 2150 2150 50  0001 C CNN
F 3 "" H 2150 2150 50  0001 C CNN
	1    2150 2150
	1    0    0    -1  
$EndComp
$Comp
L Device:Q_PMOS_GDS Q?
U 1 1 5F4B06CD
P 5100 1250
F 0 "Q?" H 5305 1204 50  0000 L CNN
F 1 "Q_PMOS_GDS" H 5305 1295 50  0000 L CNN
F 2 "" H 5300 1350 50  0001 C CNN
F 3 "~" H 5100 1250 50  0001 C CNN
	1    5100 1250
	1    0    0    1   
$EndComp
$Comp
L power:+5V #PWR?
U 1 1 5F4C892E
P 4800 950
F 0 "#PWR?" H 4800 800 50  0001 C CNN
F 1 "+5V" H 4815 1115 39  0000 C CNN
F 2 "" H 4800 950 50  0001 C CNN
F 3 "" H 4800 950 50  0001 C CNN
	1    4800 950 
	1    0    0    -1  
$EndComp
$Comp
L power:+5V #PWR?
U 1 1 5F4C9944
P 5200 950
F 0 "#PWR?" H 5200 800 50  0001 C CNN
F 1 "+5V" H 5215 1115 39  0000 C CNN
F 2 "" H 5200 950 50  0001 C CNN
F 3 "" H 5200 950 50  0001 C CNN
	1    5200 950 
	1    0    0    -1  
$EndComp
Wire Wire Line
	4800 1150 4800 1250
Wire Wire Line
	4800 1250 4900 1250
Wire Wire Line
	5200 1050 5200 950 
Wire Wire Line
	5200 1450 5200 1500
$Comp
L Device:R_Small R?
U 1 1 5F4F8496
P 4800 1850
AR Path="/5F1AEAD2/5F4F8496" Ref="R?"  Part="1" 
AR Path="/5F276426/5F4F8496" Ref="R?"  Part="1" 
AR Path="/5F3DC4D2/5F4F8496" Ref="R?"  Part="1" 
F 0 "R?" H 4700 1900 39  0000 C CNN
F 1 "10k" H 4700 1850 39  0000 C CNN
F 2 "Resistor_SMD:R_0603_1608Metric" H 4800 1850 50  0001 C CNN
F 3 "~" H 4800 1850 50  0001 C CNN
	1    4800 1850
	1    0    0    -1  
$EndComp
$Comp
L Device:Q_PMOS_GDS Q?
U 1 1 5F4F849C
P 5100 2050
F 0 "Q?" H 5305 2004 50  0000 L CNN
F 1 "Q_PMOS_GDS" H 5305 2095 50  0000 L CNN
F 2 "" H 5300 2150 50  0001 C CNN
F 3 "~" H 5100 2050 50  0001 C CNN
	1    5100 2050
	1    0    0    1   
$EndComp
$Comp
L power:+5V #PWR?
U 1 1 5F4F84A2
P 4800 1750
F 0 "#PWR?" H 4800 1600 50  0001 C CNN
F 1 "+5V" H 4815 1915 39  0000 C CNN
F 2 "" H 4800 1750 50  0001 C CNN
F 3 "" H 4800 1750 50  0001 C CNN
	1    4800 1750
	1    0    0    -1  
$EndComp
$Comp
L power:+5V #PWR?
U 1 1 5F4F84A8
P 5200 1750
F 0 "#PWR?" H 5200 1600 50  0001 C CNN
F 1 "+5V" H 5215 1915 39  0000 C CNN
F 2 "" H 5200 1750 50  0001 C CNN
F 3 "" H 5200 1750 50  0001 C CNN
	1    5200 1750
	1    0    0    -1  
$EndComp
Wire Wire Line
	4800 1950 4800 2050
Wire Wire Line
	4800 2050 4900 2050
Wire Wire Line
	5200 1850 5200 1750
Wire Wire Line
	5200 2250 5200 2300
$Comp
L Device:R_Small R?
U 1 1 5F4FE7D6
P 4800 2650
AR Path="/5F1AEAD2/5F4FE7D6" Ref="R?"  Part="1" 
AR Path="/5F276426/5F4FE7D6" Ref="R?"  Part="1" 
AR Path="/5F3DC4D2/5F4FE7D6" Ref="R?"  Part="1" 
F 0 "R?" H 4700 2700 39  0000 C CNN
F 1 "10k" H 4700 2650 39  0000 C CNN
F 2 "Resistor_SMD:R_0603_1608Metric" H 4800 2650 50  0001 C CNN
F 3 "~" H 4800 2650 50  0001 C CNN
	1    4800 2650
	1    0    0    -1  
$EndComp
$Comp
L Device:Q_PMOS_GDS Q?
U 1 1 5F4FE7DC
P 5100 2850
F 0 "Q?" H 5305 2804 50  0000 L CNN
F 1 "Q_PMOS_GDS" H 5305 2895 50  0000 L CNN
F 2 "" H 5300 2950 50  0001 C CNN
F 3 "~" H 5100 2850 50  0001 C CNN
	1    5100 2850
	1    0    0    1   
$EndComp
$Comp
L power:+5V #PWR?
U 1 1 5F4FE7E2
P 4800 2550
F 0 "#PWR?" H 4800 2400 50  0001 C CNN
F 1 "+5V" H 4815 2715 39  0000 C CNN
F 2 "" H 4800 2550 50  0001 C CNN
F 3 "" H 4800 2550 50  0001 C CNN
	1    4800 2550
	1    0    0    -1  
$EndComp
$Comp
L power:+5V #PWR?
U 1 1 5F4FE7E8
P 5200 2550
F 0 "#PWR?" H 5200 2400 50  0001 C CNN
F 1 "+5V" H 5215 2715 39  0000 C CNN
F 2 "" H 5200 2550 50  0001 C CNN
F 3 "" H 5200 2550 50  0001 C CNN
	1    5200 2550
	1    0    0    -1  
$EndComp
Wire Wire Line
	4800 2750 4800 2850
Wire Wire Line
	4800 2850 4900 2850
Wire Wire Line
	5200 2650 5200 2550
Wire Wire Line
	5200 3050 5200 3100
$Comp
L Device:R_Small R?
U 1 1 5F5049FB
P 4800 3450
AR Path="/5F1AEAD2/5F5049FB" Ref="R?"  Part="1" 
AR Path="/5F276426/5F5049FB" Ref="R?"  Part="1" 
AR Path="/5F3DC4D2/5F5049FB" Ref="R?"  Part="1" 
F 0 "R?" H 4700 3500 39  0000 C CNN
F 1 "10k" H 4700 3450 39  0000 C CNN
F 2 "Resistor_SMD:R_0603_1608Metric" H 4800 3450 50  0001 C CNN
F 3 "~" H 4800 3450 50  0001 C CNN
	1    4800 3450
	1    0    0    -1  
$EndComp
$Comp
L Device:Q_PMOS_GDS Q?
U 1 1 5F504A01
P 5100 3650
F 0 "Q?" H 5305 3604 50  0000 L CNN
F 1 "Q_PMOS_GDS" H 5305 3695 50  0000 L CNN
F 2 "" H 5300 3750 50  0001 C CNN
F 3 "~" H 5100 3650 50  0001 C CNN
	1    5100 3650
	1    0    0    1   
$EndComp
$Comp
L power:+5V #PWR?
U 1 1 5F504A07
P 4800 3350
F 0 "#PWR?" H 4800 3200 50  0001 C CNN
F 1 "+5V" H 4815 3515 39  0000 C CNN
F 2 "" H 4800 3350 50  0001 C CNN
F 3 "" H 4800 3350 50  0001 C CNN
	1    4800 3350
	1    0    0    -1  
$EndComp
$Comp
L power:+5V #PWR?
U 1 1 5F504A0D
P 5200 3350
F 0 "#PWR?" H 5200 3200 50  0001 C CNN
F 1 "+5V" H 5215 3515 39  0000 C CNN
F 2 "" H 5200 3350 50  0001 C CNN
F 3 "" H 5200 3350 50  0001 C CNN
	1    5200 3350
	1    0    0    -1  
$EndComp
Wire Wire Line
	4800 3550 4800 3650
Wire Wire Line
	4800 3650 4900 3650
Wire Wire Line
	5200 3450 5200 3350
Wire Wire Line
	5200 3850 5200 3900
$Comp
L Device:R_Small R?
U 1 1 5F511FBA
P 4800 4250
AR Path="/5F1AEAD2/5F511FBA" Ref="R?"  Part="1" 
AR Path="/5F276426/5F511FBA" Ref="R?"  Part="1" 
AR Path="/5F3DC4D2/5F511FBA" Ref="R?"  Part="1" 
F 0 "R?" H 4700 4300 39  0000 C CNN
F 1 "10k" H 4700 4250 39  0000 C CNN
F 2 "Resistor_SMD:R_0603_1608Metric" H 4800 4250 50  0001 C CNN
F 3 "~" H 4800 4250 50  0001 C CNN
	1    4800 4250
	1    0    0    -1  
$EndComp
$Comp
L Device:Q_PMOS_GDS Q?
U 1 1 5F511FC0
P 5100 4450
F 0 "Q?" H 5305 4404 50  0000 L CNN
F 1 "Q_PMOS_GDS" H 5305 4495 50  0000 L CNN
F 2 "" H 5300 4550 50  0001 C CNN
F 3 "~" H 5100 4450 50  0001 C CNN
	1    5100 4450
	1    0    0    1   
$EndComp
$Comp
L power:+5V #PWR?
U 1 1 5F511FC6
P 4800 4150
F 0 "#PWR?" H 4800 4000 50  0001 C CNN
F 1 "+5V" H 4815 4315 39  0000 C CNN
F 2 "" H 4800 4150 50  0001 C CNN
F 3 "" H 4800 4150 50  0001 C CNN
	1    4800 4150
	1    0    0    -1  
$EndComp
$Comp
L power:+5V #PWR?
U 1 1 5F511FCC
P 5200 4150
F 0 "#PWR?" H 5200 4000 50  0001 C CNN
F 1 "+5V" H 5215 4315 39  0000 C CNN
F 2 "" H 5200 4150 50  0001 C CNN
F 3 "" H 5200 4150 50  0001 C CNN
	1    5200 4150
	1    0    0    -1  
$EndComp
Wire Wire Line
	4800 4350 4800 4450
Wire Wire Line
	4800 4450 4900 4450
Wire Wire Line
	5200 4250 5200 4150
Wire Wire Line
	5200 4650 5200 4700
$Comp
L Device:R_Small R?
U 1 1 5F5158B5
P 4800 5050
AR Path="/5F1AEAD2/5F5158B5" Ref="R?"  Part="1" 
AR Path="/5F276426/5F5158B5" Ref="R?"  Part="1" 
AR Path="/5F3DC4D2/5F5158B5" Ref="R?"  Part="1" 
F 0 "R?" H 4700 5100 39  0000 C CNN
F 1 "10k" H 4700 5050 39  0000 C CNN
F 2 "Resistor_SMD:R_0603_1608Metric" H 4800 5050 50  0001 C CNN
F 3 "~" H 4800 5050 50  0001 C CNN
	1    4800 5050
	1    0    0    -1  
$EndComp
$Comp
L Device:Q_PMOS_GDS Q?
U 1 1 5F5158BB
P 5100 5250
F 0 "Q?" H 5305 5204 50  0000 L CNN
F 1 "Q_PMOS_GDS" H 5305 5295 50  0000 L CNN
F 2 "" H 5300 5350 50  0001 C CNN
F 3 "~" H 5100 5250 50  0001 C CNN
	1    5100 5250
	1    0    0    1   
$EndComp
$Comp
L power:+5V #PWR?
U 1 1 5F5158C1
P 4800 4950
F 0 "#PWR?" H 4800 4800 50  0001 C CNN
F 1 "+5V" H 4815 5115 39  0000 C CNN
F 2 "" H 4800 4950 50  0001 C CNN
F 3 "" H 4800 4950 50  0001 C CNN
	1    4800 4950
	1    0    0    -1  
$EndComp
$Comp
L power:+5V #PWR?
U 1 1 5F5158C7
P 5200 4950
F 0 "#PWR?" H 5200 4800 50  0001 C CNN
F 1 "+5V" H 5215 5115 39  0000 C CNN
F 2 "" H 5200 4950 50  0001 C CNN
F 3 "" H 5200 4950 50  0001 C CNN
	1    5200 4950
	1    0    0    -1  
$EndComp
Wire Wire Line
	4800 5150 4800 5250
Wire Wire Line
	4800 5250 4900 5250
Wire Wire Line
	5200 5050 5200 4950
Wire Wire Line
	5200 5450 5200 5500
$Comp
L Device:R_Small R?
U 1 1 5F51ADC0
P 4800 5850
AR Path="/5F1AEAD2/5F51ADC0" Ref="R?"  Part="1" 
AR Path="/5F276426/5F51ADC0" Ref="R?"  Part="1" 
AR Path="/5F3DC4D2/5F51ADC0" Ref="R?"  Part="1" 
F 0 "R?" H 4700 5900 39  0000 C CNN
F 1 "10k" H 4700 5850 39  0000 C CNN
F 2 "Resistor_SMD:R_0603_1608Metric" H 4800 5850 50  0001 C CNN
F 3 "~" H 4800 5850 50  0001 C CNN
	1    4800 5850
	1    0    0    -1  
$EndComp
$Comp
L Device:Q_PMOS_GDS Q?
U 1 1 5F51ADC6
P 5100 6050
F 0 "Q?" H 5305 6004 50  0000 L CNN
F 1 "Q_PMOS_GDS" H 5305 6095 50  0000 L CNN
F 2 "" H 5300 6150 50  0001 C CNN
F 3 "~" H 5100 6050 50  0001 C CNN
	1    5100 6050
	1    0    0    1   
$EndComp
$Comp
L power:+5V #PWR?
U 1 1 5F51ADCC
P 4800 5750
F 0 "#PWR?" H 4800 5600 50  0001 C CNN
F 1 "+5V" H 4815 5915 39  0000 C CNN
F 2 "" H 4800 5750 50  0001 C CNN
F 3 "" H 4800 5750 50  0001 C CNN
	1    4800 5750
	1    0    0    -1  
$EndComp
$Comp
L power:+5V #PWR?
U 1 1 5F51ADD2
P 5200 5750
F 0 "#PWR?" H 5200 5600 50  0001 C CNN
F 1 "+5V" H 5215 5915 39  0000 C CNN
F 2 "" H 5200 5750 50  0001 C CNN
F 3 "" H 5200 5750 50  0001 C CNN
	1    5200 5750
	1    0    0    -1  
$EndComp
Wire Wire Line
	4800 5950 4800 6050
Wire Wire Line
	4800 6050 4900 6050
Wire Wire Line
	5200 5850 5200 5750
Wire Wire Line
	5200 6250 5200 6300
Text Label 5350 3900 0    39   ~ 0
D
Text Label 5350 4700 0    39   ~ 0
E
Text Label 5350 3100 0    39   ~ 0
C
Text Label 5350 2300 0    39   ~ 0
B
Text Label 5350 1500 0    39   ~ 0
A
Text Label 5350 5500 0    39   ~ 0
F
Text Label 5350 6300 0    39   ~ 0
G
Wire Wire Line
	5200 1500 5350 1500
Wire Wire Line
	5200 2300 5350 2300
Wire Wire Line
	5200 3100 5350 3100
Wire Wire Line
	5200 3900 5350 3900
Wire Wire Line
	5200 4700 5350 4700
Wire Wire Line
	5200 5500 5350 5500
Wire Wire Line
	5200 6300 5350 6300
Text HLabel 1500 1250 0    39   Input ~ 0
BCD_A
Text HLabel 1500 1350 0    39   Input ~ 0
BCD_B
Text HLabel 1500 1450 0    39   Input ~ 0
BCD_C
Text HLabel 1500 1550 0    39   Input ~ 0
BCD_D
Wire Wire Line
	1500 1250 1650 1250
Wire Wire Line
	1500 1350 1650 1350
Wire Wire Line
	1500 1450 1650 1450
Wire Wire Line
	1500 1550 1650 1550
Wire Wire Line
	2100 4250 2250 4250
Wire Wire Line
	2100 3300 2250 3300
Wire Wire Line
	2100 4250 2100 4350
Wire Wire Line
	2100 3300 2100 3400
Wire Wire Line
	4800 1250 2650 1250
Connection ~ 4800 1250
Wire Wire Line
	4800 2050 4250 2050
Wire Wire Line
	4250 2050 4250 1350
Wire Wire Line
	4250 1350 2650 1350
Connection ~ 4800 2050
Wire Wire Line
	4800 2850 4150 2850
Wire Wire Line
	4150 2850 4150 1450
Wire Wire Line
	4150 1450 2650 1450
Connection ~ 4800 2850
Wire Wire Line
	4800 3650 4050 3650
Wire Wire Line
	4050 3650 4050 1550
Wire Wire Line
	4050 1550 2650 1550
Connection ~ 4800 3650
Wire Wire Line
	4800 4450 3950 4450
Connection ~ 4800 4450
Wire Wire Line
	3950 4450 3950 1650
Wire Wire Line
	2650 1650 3950 1650
Wire Wire Line
	4800 5250 3850 5250
Wire Wire Line
	3850 5250 3850 1750
Wire Wire Line
	3850 1750 2650 1750
Connection ~ 4800 5250
Wire Wire Line
	4800 6050 3750 6050
Wire Wire Line
	3750 6050 3750 1850
Wire Wire Line
	3750 1850 2650 1850
Connection ~ 4800 6050
$Comp
L 74xx:74LS49 U?
U 1 1 5F62EA69
P 2150 1550
F 0 "U?" H 1900 2100 50  0000 C CNN
F 1 "74LS49" H 1900 2000 50  0000 C CNN
F 2 "" H 2150 1550 50  0001 C CNN
F 3 "http://www.ti.com/lit/gpn/sn74ls47" H 2150 1550 50  0001 C CNN
	1    2150 1550
	1    0    0    -1  
$EndComp
$Comp
L Device:R_Small R?
U 1 1 5F63CBF3
P 1100 1700
AR Path="/5F1AEAD2/5F63CBF3" Ref="R?"  Part="1" 
AR Path="/5F276426/5F63CBF3" Ref="R?"  Part="1" 
AR Path="/5F3DC4D2/5F63CBF3" Ref="R?"  Part="1" 
F 0 "R?" H 1000 1750 39  0000 C CNN
F 1 "10k" H 1000 1700 39  0000 C CNN
F 2 "Resistor_SMD:R_0603_1608Metric" H 1100 1700 50  0001 C CNN
F 3 "~" H 1100 1700 50  0001 C CNN
	1    1100 1700
	1    0    0    -1  
$EndComp
$Comp
L power:+5V #PWR?
U 1 1 5F63CBF9
P 1100 1600
F 0 "#PWR?" H 1100 1450 50  0001 C CNN
F 1 "+5V" H 1115 1765 39  0000 C CNN
F 2 "" H 1100 1600 50  0001 C CNN
F 3 "" H 1100 1600 50  0001 C CNN
	1    1100 1600
	1    0    0    -1  
$EndComp
Wire Wire Line
	1650 1850 1100 1850
Wire Wire Line
	1100 1850 1100 1800
$EndSCHEMATC
