EESchema Schematic File Version 4
EELAYER 30 0
EELAYER END
$Descr A4 11693 8268
encoding utf-8
Sheet 1 1
Title "Supply"
Date "2020-10-20"
Rev "1.0"
Comp "Institute for Automation of Complex Power Systems - E.ON ERC - RWTH Aachen University"
Comment1 "Designer: D. Wienands, S. Melcher, L. Jeske, D. Moll"
Comment2 "Supervisor: C. Guarnieri Calò Carducci"
Comment3 ""
Comment4 ""
$EndDescr
Text Label 4975 2900 0    38   ~ 0
ID_1
$Comp
L power:GND #PWR0101
U 1 1 5F0ABE1F
P 4325 2600
F 0 "#PWR0101" H 4325 2350 50  0001 C CNN
F 1 "GND" V 4325 2400 39  0000 C CNN
F 2 "" H 4325 2600 50  0001 C CNN
F 3 "" H 4325 2600 50  0001 C CNN
	1    4325 2600
	0    1    1    0   
$EndComp
$Comp
L power:+5V #PWR0102
U 1 1 5F0AC387
P 4325 2700
F 0 "#PWR0102" H 4325 2550 50  0001 C CNN
F 1 "+5V" V 4325 2900 39  0000 C CNN
F 2 "" H 4325 2700 50  0001 C CNN
F 3 "" H 4325 2700 50  0001 C CNN
	1    4325 2700
	0    -1   -1   0   
$EndComp
$Comp
L power:+5V #PWR0103
U 1 1 5F0AD18E
P 4325 3000
F 0 "#PWR0103" H 4325 2850 50  0001 C CNN
F 1 "+5V" V 4325 3200 39  0000 C CNN
F 2 "" H 4325 3000 50  0001 C CNN
F 3 "" H 4325 3000 50  0001 C CNN
	1    4325 3000
	0    -1   -1   0   
$EndComp
$Comp
L power:GND #PWR0104
U 1 1 5F0AD3B6
P 4325 3100
F 0 "#PWR0104" H 4325 2850 50  0001 C CNN
F 1 "GND" V 4325 2900 39  0000 C CNN
F 2 "" H 4325 3100 50  0001 C CNN
F 3 "" H 4325 3100 50  0001 C CNN
	1    4325 3100
	0    1    1    0   
$EndComp
$Comp
L power:GND #PWR0105
U 1 1 5F0AD61F
P 4825 3100
F 0 "#PWR0105" H 4825 2850 50  0001 C CNN
F 1 "GND" V 4825 2900 39  0000 C CNN
F 2 "" H 4825 3100 50  0001 C CNN
F 3 "" H 4825 3100 50  0001 C CNN
	1    4825 3100
	0    -1   1    0   
$EndComp
$Comp
L power:GND #PWR0106
U 1 1 5F0ADE27
P 4825 2600
F 0 "#PWR0106" H 4825 2350 50  0001 C CNN
F 1 "GND" V 4825 2400 39  0000 C CNN
F 2 "" H 4825 2600 50  0001 C CNN
F 3 "" H 4825 2600 50  0001 C CNN
	1    4825 2600
	0    -1   1    0   
$EndComp
Wire Wire Line
	4975 2700 4825 2700
Text Label 4975 2700 0    38   ~ 0
~EN_1
$Comp
L LEGOS:VBUS #PWR0107
U 1 1 5F0B1289
P 4325 2800
F 0 "#PWR0107" H 4325 2650 50  0001 C CNN
F 1 "VBUS" V 4325 2950 39  0000 L CNN
F 2 "" H 4325 2800 50  0001 C CNN
F 3 "" H 4325 2800 50  0001 C CNN
	1    4325 2800
	0    -1   -1   0   
$EndComp
Wire Wire Line
	4825 2900 4975 2900
Text Label 4975 4400 0    38   ~ 0
ID_2
$Comp
L power:GND #PWR0108
U 1 1 5F0CFD4C
P 4325 4100
F 0 "#PWR0108" H 4325 3850 50  0001 C CNN
F 1 "GND" V 4325 3900 39  0000 C CNN
F 2 "" H 4325 4100 50  0001 C CNN
F 3 "" H 4325 4100 50  0001 C CNN
	1    4325 4100
	0    1    1    0   
$EndComp
$Comp
L power:+5V #PWR0109
U 1 1 5F0CFD52
P 4325 4200
F 0 "#PWR0109" H 4325 4050 50  0001 C CNN
F 1 "+5V" V 4325 4400 39  0000 C CNN
F 2 "" H 4325 4200 50  0001 C CNN
F 3 "" H 4325 4200 50  0001 C CNN
	1    4325 4200
	0    -1   -1   0   
$EndComp
$Comp
L power:+5V #PWR0110
U 1 1 5F0CFD58
P 4325 4500
F 0 "#PWR0110" H 4325 4350 50  0001 C CNN
F 1 "+5V" V 4325 4700 39  0000 C CNN
F 2 "" H 4325 4500 50  0001 C CNN
F 3 "" H 4325 4500 50  0001 C CNN
	1    4325 4500
	0    -1   -1   0   
$EndComp
$Comp
L power:GND #PWR0111
U 1 1 5F0CFD5E
P 4325 4600
F 0 "#PWR0111" H 4325 4350 50  0001 C CNN
F 1 "GND" V 4325 4400 39  0000 C CNN
F 2 "" H 4325 4600 50  0001 C CNN
F 3 "" H 4325 4600 50  0001 C CNN
	1    4325 4600
	0    1    1    0   
$EndComp
$Comp
L power:GND #PWR0112
U 1 1 5F0CFD64
P 4825 4600
F 0 "#PWR0112" H 4825 4350 50  0001 C CNN
F 1 "GND" V 4825 4400 39  0000 C CNN
F 2 "" H 4825 4600 50  0001 C CNN
F 3 "" H 4825 4600 50  0001 C CNN
	1    4825 4600
	0    -1   1    0   
$EndComp
$Comp
L power:GND #PWR0113
U 1 1 5F0CFD6A
P 4825 4100
F 0 "#PWR0113" H 4825 3850 50  0001 C CNN
F 1 "GND" V 4825 3900 39  0000 C CNN
F 2 "" H 4825 4100 50  0001 C CNN
F 3 "" H 4825 4100 50  0001 C CNN
	1    4825 4100
	0    -1   1    0   
$EndComp
Wire Wire Line
	4975 4200 4825 4200
Text Label 4975 4200 0    38   ~ 0
~EN_2
$Comp
L LEGOS:VBUS #PWR0114
U 1 1 5F0CFD72
P 4325 4300
F 0 "#PWR0114" H 4325 4150 50  0001 C CNN
F 1 "VBUS" V 4325 4450 39  0000 L CNN
F 2 "" H 4325 4300 50  0001 C CNN
F 3 "" H 4325 4300 50  0001 C CNN
	1    4325 4300
	0    -1   -1   0   
$EndComp
Wire Wire Line
	4825 4400 4975 4400
$Comp
L Connector_Generic:Conn_02x06_Odd_Even J1
U 1 1 5F2FBE0C
P 4525 2800
F 0 "J1" H 4575 3217 39  0000 C CNN
F 1 "TLW-106-06-G-D" H 4575 3126 39  0000 C CNN
F 2 "LEGOS:TLW-106-06-G-D" H 4525 2800 50  0001 C CNN
F 3 "https://www.samtec.com/products/tlw-106-06-g-d" H 4525 2800 50  0001 C CNN
	1    4525 2800
	1    0    0    -1  
$EndComp
$Comp
L LEGOS:VBUS #PWR0115
U 1 1 5F30FA91
P 4325 2900
F 0 "#PWR0115" H 4325 2750 50  0001 C CNN
F 1 "VBUS" V 4325 3050 39  0000 L CNN
F 2 "" H 4325 2900 50  0001 C CNN
F 3 "" H 4325 2900 50  0001 C CNN
	1    4325 2900
	0    -1   -1   0   
$EndComp
$Comp
L LEGOS:VBUS #PWR0116
U 1 1 5F311D3C
P 4325 4400
F 0 "#PWR0116" H 4325 4250 50  0001 C CNN
F 1 "VBUS" V 4325 4550 39  0000 L CNN
F 2 "" H 4325 4400 50  0001 C CNN
F 3 "" H 4325 4400 50  0001 C CNN
	1    4325 4400
	0    -1   -1   0   
$EndComp
$Comp
L power:GND #PWR0117
U 1 1 5F31C181
P 4825 2800
F 0 "#PWR0117" H 4825 2550 50  0001 C CNN
F 1 "GND" V 4825 2600 39  0000 C CNN
F 2 "" H 4825 2800 50  0001 C CNN
F 3 "" H 4825 2800 50  0001 C CNN
	1    4825 2800
	0    -1   1    0   
$EndComp
Wire Wire Line
	4975 3000 4825 3000
Text Label 4975 3000 0    38   ~ 0
~IRQ_1
$Comp
L power:GND #PWR0118
U 1 1 5F3250BC
P 4825 4300
F 0 "#PWR0118" H 4825 4050 50  0001 C CNN
F 1 "GND" V 4825 4100 39  0000 C CNN
F 2 "" H 4825 4300 50  0001 C CNN
F 3 "" H 4825 4300 50  0001 C CNN
	1    4825 4300
	0    -1   1    0   
$EndComp
Wire Wire Line
	4975 4500 4825 4500
Text Label 4975 4500 0    38   ~ 0
~IRQ_2
$Comp
L Connector_Generic:Conn_02x06_Odd_Even J2
U 1 1 5F9055AA
P 4525 4300
F 0 "J2" H 4575 4717 39  0000 C CNN
F 1 "TLW-106-06-G-D" H 4575 4626 39  0000 C CNN
F 2 "LEGOS:TLW-106-06-G-D" H 4525 4300 50  0001 C CNN
F 3 "https://www.samtec.com/products/tlw-106-06-g-d" H 4525 4300 50  0001 C CNN
	1    4525 4300
	1    0    0    -1  
$EndComp
$Comp
L Connector_Generic:Conn_01x02 J3
U 1 1 5F90F52B
P 5850 3525
F 0 "J3" H 5768 3200 39  0000 C CNN
F 1 "Conn_01x02" H 5768 3291 39  0000 C CNN
F 2 "LEGOS:TerminalBlock_Phoenix_SPT-1,5-2-H-5.08_1x02_P5.08mm_Horizontal" H 5850 3525 50  0001 C CNN
F 3 "https://www.phoenixcontact.com/online/portal/pi?uri=pxc-oc-itemdetail:pid=1824857" H 5850 3525 50  0001 C CNN
F 4 "1824857" H 5850 3525 50  0001 C CNN "Mfr"
	1    5850 3525
	-1   0    0    1   
$EndComp
$Comp
L power:GND #PWR0119
U 1 1 5F910450
P 6425 3625
F 0 "#PWR0119" H 6425 3375 50  0001 C CNN
F 1 "GND" H 6425 3475 39  0000 C CNN
F 2 "" H 6425 3625 50  0001 C CNN
F 3 "" H 6425 3625 50  0001 C CNN
	1    6425 3625
	-1   0    0    -1  
$EndComp
$Comp
L power:+5V #PWR0120
U 1 1 5F910C68
P 6425 3325
F 0 "#PWR0120" H 6425 3175 50  0001 C CNN
F 1 "+5V" H 6425 3475 39  0000 C CNN
F 2 "" H 6425 3325 50  0001 C CNN
F 3 "" H 6425 3325 50  0001 C CNN
	1    6425 3325
	1    0    0    -1  
$EndComp
$Comp
L Converter_ACDC:HLK-PM01 PS1
U 1 1 5F9151CA
P 7300 3450
F 0 "PS1" H 7300 3775 39  0000 C CNN
F 1 "LPV-100-5" H 7300 3684 39  0000 C CNN
F 2 "" H 7300 3150 50  0001 C CNN
F 3 "https://www.meanwell.com/Upload/PDF/LPV-100/LPV-100-SPEC.PDF" H 7700 3100 50  0001 C CNN
	1    7300 3450
	-1   0    0    -1  
$EndComp
Wire Wire Line
	6900 3550 6700 3550
Wire Wire Line
	6050 3525 6250 3525
Wire Wire Line
	6050 3425 6250 3425
Wire Wire Line
	6900 3350 6700 3350
$Comp
L Connector:Conn_WallPlug P1
U 1 1 5F919308
P 8150 3450
F 0 "P1" H 7940 3496 50  0000 R CNN
F 1 "Conn_WallPlug" H 7940 3405 50  0000 R CNN
F 2 "" H 8550 3450 50  0001 C CNN
F 3 "~" H 8550 3450 50  0001 C CNN
	1    8150 3450
	-1   0    0    -1  
$EndComp
Wire Wire Line
	7950 3350 7700 3350
Wire Wire Line
	7950 3550 7700 3550
$Comp
L Device:D_TVS D1
U 1 1 5F9311C8
P 6425 3475
F 0 "D1" V 6387 3555 39  0000 L CNN
F 1 "D_TVS" V 6462 3555 39  0000 L CNN
F 2 "Diode_SMD:D_SOT-23_ANK" H 6425 3475 50  0001 C CNN
F 3 "https://eu.mouser.com/datasheet/2/54/CDSOT23-T03_T36C-777341.pdf" H 6425 3475 50  0001 C CNN
F 4 "CDSOT23-T05" V 6425 3475 50  0001 C CNN "Mfr"
	1    6425 3475
	0    1    1    0   
$EndComp
Wire Wire Line
	6425 3325 6700 3325
Wire Wire Line
	6700 3325 6700 3350
Connection ~ 6425 3325
Wire Wire Line
	6425 3625 6700 3625
Wire Wire Line
	6700 3625 6700 3550
Connection ~ 6425 3625
Wire Wire Line
	6425 3325 6250 3325
Wire Wire Line
	6250 3325 6250 3425
Wire Wire Line
	6250 3525 6250 3625
Wire Wire Line
	6250 3625 6425 3625
$EndSCHEMATC
