EESchema Schematic File Version 4
EELAYER 30 0
EELAYER END
$Descr A4 11693 8268
encoding utf-8
Sheet 4 6
Title "Uninterruptable Power Supply (UPS)"
Date "2020-08-15"
Rev "1.1"
Comp "Institute for Automation of Complex Power Systems - E.ON ERC - RWTH Aachen University"
Comment1 "Designer: D. Wienands, S. Melcher, L. Jeske, D. Moll"
Comment2 "Supervisor: C. Guarnieri Calò Carducci"
Comment3 ""
Comment4 ""
$EndDescr
Wire Wire Line
	3650 5500 3650 5450
$Comp
L Device:R_Small R29
U 1 1 5F33E0AE
P 2400 4600
AR Path="/5EF831DD/5F33E0AE" Ref="R29"  Part="1" 
AR Path="/5F5538A6/5F33E0AE" Ref="R?"  Part="1" 
F 0 "R29" H 2459 4646 39  0000 L CNN
F 1 "1k" H 2459 4555 39  0000 L CNN
F 2 "Resistor_SMD:R_0603_1608Metric" H 2400 4600 50  0001 C CNN
F 3 "~" H 2400 4600 50  0001 C CNN
	1    2400 4600
	1    0    0    -1  
$EndComp
$Comp
L power:GND #PWR053
U 1 1 5F33E0B4
P 1900 5650
AR Path="/5EF831DD/5F33E0B4" Ref="#PWR053"  Part="1" 
AR Path="/5F5538A6/5F33E0B4" Ref="#PWR?"  Part="1" 
F 0 "#PWR053" H 1900 5400 50  0001 C CNN
F 1 "GND" H 1905 5477 39  0000 C CNN
F 2 "" H 1900 5650 50  0001 C CNN
F 3 "" H 1900 5650 50  0001 C CNN
	1    1900 5650
	1    0    0    -1  
$EndComp
Wire Wire Line
	3650 5050 3650 4850
Connection ~ 4900 4850
Connection ~ 3000 5250
Wire Wire Line
	3000 5150 3000 5250
$Comp
L Device:Q_NMOS_GSD Q14
U 1 1 5F4EF1C5
P 3000 4950
AR Path="/5EF831DD/5F4EF1C5" Ref="Q14"  Part="1" 
AR Path="/5F5538A6/5F4EF1C5" Ref="Q?"  Part="1" 
F 0 "Q14" V 3318 4950 39  0000 C CNN
F 1 "Si2302CDS" V 3243 4950 39  0000 C CNN
F 2 "Package_TO_SOT_SMD:SOT-23" H 3200 5050 50  0001 C CNN
F 3 "https://eu.mouser.com/datasheet/2/427/si2302cds-1764899.pdf" H 3000 4950 50  0001 C CNN
	1    3000 4950
	0    1    -1   0   
$EndComp
$Comp
L Device:Q_NMOS_GSD Q15
U 1 1 5F4F2B42
P 3550 5250
AR Path="/5EF831DD/5F4F2B42" Ref="Q15"  Part="1" 
AR Path="/5F5538A6/5F4F2B42" Ref="Q?"  Part="1" 
F 0 "Q15" H 3755 5212 39  0000 L CNN
F 1 "Si2302CDS" H 3755 5287 39  0000 L CNN
F 2 "Package_TO_SOT_SMD:SOT-23" H 3750 5350 50  0001 C CNN
F 3 "https://eu.mouser.com/datasheet/2/427/si2302cds-1764899.pdf" H 3550 5250 50  0001 C CNN
	1    3550 5250
	1    0    0    1   
$EndComp
$Comp
L Device:R_Small R30
U 1 1 5F4F709C
P 3650 5600
AR Path="/5EF831DD/5F4F709C" Ref="R30"  Part="1" 
AR Path="/5F5538A6/5F4F709C" Ref="R?"  Part="1" 
F 0 "R30" H 3709 5646 39  0000 L CNN
F 1 "4.3 - 1/2W" H 3709 5555 39  0000 L CNN
F 2 "Resistor_SMD:R_0805_2012Metric" H 3650 5600 50  0001 C CNN
F 3 "https://eu.mouser.com/datasheet/2/348/esr-e-1139161.pdf" H 3650 5600 50  0001 C CNN
F 4 "ESR10EZPF4R30 " H 3650 5600 50  0001 C CNN "Mfr"
	1    3650 5600
	1    0    0    -1  
$EndComp
$Comp
L Device:Battery BT1
U 1 1 5F0742A4
P 4900 6050
AR Path="/5EF831DD/5F0742A4" Ref="BT1"  Part="1" 
AR Path="/5F5538A6/5F0742A4" Ref="BT?"  Part="1" 
F 0 "BT1" H 5008 6096 50  0000 L CNN
F 1 "18650 LiFePO4" H 5008 6005 50  0000 L CNN
F 2 "Battery:BatteryHolder_Keystone_1042_1x18650" V 4900 6110 50  0001 C CNN
F 3 "https://www.conrad.de/de/p/3-2-volt-solar-akku-lithium-18650-ifr-lifepo4-akku-mit-kopf-ungeschuetzt-1400-1500mah-abmessungen-ca-66-1x18mm-803842313.html" V 4900 6110 50  0001 C CNN
	1    4900 6050
	1    0    0    -1  
$EndComp
$Comp
L Power_Supervisor:LM809 U2
U 1 1 5F51530F
P 1900 5250
AR Path="/5EF831DD/5F51530F" Ref="U2"  Part="1" 
AR Path="/5F5538A6/5F51530F" Ref="U?"  Part="1" 
F 0 "U2" H 1670 5288 39  0000 R CNN
F 1 "TLV803E" H 1670 5213 39  0000 R CNN
F 2 "Package_TO_SOT_SMD:SOT-23" H 2200 5350 50  0001 C CNN
F 3 "https://www.ti.com/lit/ds/symlink/tlv810e.pdf" H 2200 5350 50  0001 C CNN
	1    1900 5250
	1    0    0    -1  
$EndComp
Wire Wire Line
	1900 4850 2800 4850
$Comp
L power:+5V #PWR?
U 1 1 5F51F680
P 2400 4400
AR Path="/5F10B8E7/5F51F680" Ref="#PWR?"  Part="1" 
AR Path="/5EF831DD/5F51F680" Ref="#PWR056"  Part="1" 
AR Path="/5F5538A6/5F51F680" Ref="#PWR?"  Part="1" 
F 0 "#PWR056" H 2400 4250 50  0001 C CNN
F 1 "+5V" H 2400 4573 39  0000 C CNN
F 2 "" H 2400 4400 50  0001 C CNN
F 3 "" H 2400 4400 50  0001 C CNN
	1    2400 4400
	1    0    0    -1  
$EndComp
Wire Wire Line
	2200 5250 2400 5250
Wire Wire Line
	2400 4400 2400 4500
Wire Wire Line
	2400 4700 2400 5250
Connection ~ 2400 5250
Wire Wire Line
	2400 5250 3000 5250
$Comp
L Device:Q_NMOS_GSD Q16
U 1 1 5F384E6F
P 4050 6050
AR Path="/5EF831DD/5F384E6F" Ref="Q16"  Part="1" 
AR Path="/5F5538A6/5F384E6F" Ref="Q?"  Part="1" 
F 0 "Q16" H 4255 6012 39  0000 L CNN
F 1 "Si2302CDS" H 4255 6087 39  0000 L CNN
F 2 "Package_TO_SOT_SMD:SOT-23" H 4250 6150 50  0001 C CNN
F 3 "https://eu.mouser.com/datasheet/2/427/si2302cds-1764899.pdf" H 4050 6050 50  0001 C CNN
	1    4050 6050
	1    0    0    -1  
$EndComp
Wire Wire Line
	3000 6050 3000 5250
$Comp
L power:+5V #PWR?
U 1 1 5F38B593
P 4150 4400
AR Path="/5F10B8E7/5F38B593" Ref="#PWR?"  Part="1" 
AR Path="/5EF831DD/5F38B593" Ref="#PWR059"  Part="1" 
AR Path="/5F5538A6/5F38B593" Ref="#PWR?"  Part="1" 
F 0 "#PWR059" H 4150 4250 50  0001 C CNN
F 1 "+5V" H 4150 4573 39  0000 C CNN
F 2 "" H 4150 4400 50  0001 C CNN
F 3 "" H 4150 4400 50  0001 C CNN
	1    4150 4400
	1    0    0    -1  
$EndComp
Wire Wire Line
	4150 4400 4150 4500
$Comp
L Device:Q_NMOS_GSD Q18
U 1 1 5F38CA7F
P 4800 5250
AR Path="/5EF831DD/5F38CA7F" Ref="Q18"  Part="1" 
AR Path="/5F5538A6/5F38CA7F" Ref="Q?"  Part="1" 
F 0 "Q18" H 5005 5212 39  0000 L CNN
F 1 "Si2302CDS" H 5005 5287 39  0000 L CNN
F 2 "Package_TO_SOT_SMD:SOT-23" H 5000 5350 50  0001 C CNN
F 3 "https://eu.mouser.com/datasheet/2/427/si2302cds-1764899.pdf" H 4800 5250 50  0001 C CNN
	1    4800 5250
	1    0    0    1   
$EndComp
Wire Wire Line
	4900 5750 4900 5850
Wire Wire Line
	3650 5700 3650 5750
$Comp
L power:GND #PWR065
U 1 1 5F2D12F7
P 4900 6250
AR Path="/5EF831DD/5F2D12F7" Ref="#PWR065"  Part="1" 
AR Path="/5F5538A6/5F2D12F7" Ref="#PWR?"  Part="1" 
F 0 "#PWR065" H 4900 6000 50  0001 C CNN
F 1 "GND" H 4900 6100 39  0000 C CNN
F 2 "" H 4900 6250 50  0001 C CNN
F 3 "" H 4900 6250 50  0001 C CNN
	1    4900 6250
	1    0    0    -1  
$EndComp
$Comp
L power:GND #PWR060
U 1 1 5F38FE29
P 4150 6250
AR Path="/5EF831DD/5F38FE29" Ref="#PWR060"  Part="1" 
AR Path="/5F5538A6/5F38FE29" Ref="#PWR?"  Part="1" 
F 0 "#PWR060" H 4150 6000 50  0001 C CNN
F 1 "GND" H 4150 6100 39  0000 C CNN
F 2 "" H 4150 6250 50  0001 C CNN
F 3 "" H 4150 6250 50  0001 C CNN
	1    4150 6250
	1    0    0    -1  
$EndComp
Wire Wire Line
	4900 5450 4900 5750
Wire Wire Line
	3650 5750 4900 5750
Wire Wire Line
	4900 5050 4900 4850
Wire Wire Line
	4150 5250 4600 5250
$Comp
L Device:R_Small R31
U 1 1 5F3998A8
P 4150 4600
AR Path="/5EF831DD/5F3998A8" Ref="R31"  Part="1" 
AR Path="/5F5538A6/5F3998A8" Ref="R?"  Part="1" 
F 0 "R31" H 4209 4646 39  0000 L CNN
F 1 "4.7k" H 4209 4555 39  0000 L CNN
F 2 "Resistor_SMD:R_0603_1608Metric" H 4150 4600 50  0001 C CNN
F 3 "~" H 4150 4600 50  0001 C CNN
	1    4150 4600
	1    0    0    -1  
$EndComp
Text Notes 2500 5050 0    39   ~ 0
Anti Discharge
Text Notes 3200 5450 0    39   ~ 0
Charge Path
Text Notes 4350 5450 0    39   ~ 0
Discharge Path
Text Notes 3800 6250 0    39   ~ 0
Inverter
Connection ~ 4900 5750
Wire Wire Line
	3000 6050 3850 6050
Connection ~ 4150 5250
Wire Wire Line
	4150 4700 4150 5250
Wire Wire Line
	4150 5250 4150 5850
Connection ~ 3650 4850
Wire Wire Line
	3650 4850 4900 4850
Wire Wire Line
	3200 4850 3650 4850
Wire Wire Line
	3350 5250 3000 5250
$Comp
L Device:Q_NMOS_GSD Q17
U 1 1 5F3C2A65
P 4050 7350
AR Path="/5EF831DD/5F3C2A65" Ref="Q17"  Part="1" 
AR Path="/5F5538A6/5F3C2A65" Ref="Q?"  Part="1" 
F 0 "Q17" H 4255 7312 39  0000 L CNN
F 1 "Si2302CDS" H 4255 7387 39  0000 L CNN
F 2 "Package_TO_SOT_SMD:SOT-23" H 4250 7450 50  0001 C CNN
F 3 "https://eu.mouser.com/datasheet/2/427/si2302cds-1764899.pdf" H 4050 7350 50  0001 C CNN
	1    4050 7350
	1    0    0    -1  
$EndComp
$Comp
L power:GND #PWR062
U 1 1 5F3C315B
P 4150 7550
AR Path="/5EF831DD/5F3C315B" Ref="#PWR062"  Part="1" 
AR Path="/5F5538A6/5F3C315B" Ref="#PWR?"  Part="1" 
F 0 "#PWR062" H 4150 7300 50  0001 C CNN
F 1 "GND" H 4150 7400 39  0000 C CNN
F 2 "" H 4150 7550 50  0001 C CNN
F 3 "" H 4150 7550 50  0001 C CNN
	1    4150 7550
	1    0    0    -1  
$EndComp
Wire Wire Line
	4150 6750 4150 6850
$Comp
L Device:R_Small R32
U 1 1 5F3CD0B8
P 4150 6950
AR Path="/5EF831DD/5F3CD0B8" Ref="R32"  Part="1" 
AR Path="/5F5538A6/5F3CD0B8" Ref="R?"  Part="1" 
F 0 "R32" H 4209 6996 39  0000 L CNN
F 1 "10k" H 4209 6905 39  0000 L CNN
F 2 "Resistor_SMD:R_0603_1608Metric" H 4150 6950 50  0001 C CNN
F 3 "~" H 4150 6950 50  0001 C CNN
	1    4150 6950
	1    0    0    -1  
$EndComp
Wire Wire Line
	4150 7050 4150 7100
Wire Wire Line
	3000 6050 3000 7350
Wire Wire Line
	3000 7350 3850 7350
Connection ~ 3000 6050
Wire Wire Line
	4150 7100 4400 7100
Connection ~ 4150 7100
Wire Wire Line
	4150 7100 4150 7150
Text HLabel 4400 7100 2    39   Input ~ 0
~GRID
Wire Wire Line
	1900 4850 1550 4850
Connection ~ 1900 4850
Text HLabel 1550 4850 0    39   Input ~ 0
IN
Text HLabel 5100 4850 2    39   Input ~ 0
OUT
Wire Wire Line
	5100 4850 4900 4850
$Comp
L power:+3.3V #PWR061
U 1 1 5F3F7F87
P 4150 6750
AR Path="/5EF831DD/5F3F7F87" Ref="#PWR061"  Part="1" 
AR Path="/5F5538A6/5F3F7F87" Ref="#PWR?"  Part="1" 
F 0 "#PWR061" H 4150 6600 50  0001 C CNN
F 1 "+3.3V" H 4165 6915 39  0000 C CNN
F 2 "" H 4150 6750 50  0001 C CNN
F 3 "" H 4150 6750 50  0001 C CNN
	1    4150 6750
	1    0    0    -1  
$EndComp
$Comp
L Device:Q_NMOS_GSD Q13
U 1 1 5F4255F7
P 1950 2300
AR Path="/5EF831DD/5F4255F7" Ref="Q13"  Part="1" 
AR Path="/5F5538A6/5F4255F7" Ref="Q?"  Part="1" 
F 0 "Q13" H 2155 2262 39  0000 L CNN
F 1 "Si2302CDS" H 2155 2337 39  0000 L CNN
F 2 "Package_TO_SOT_SMD:SOT-23" H 2150 2400 50  0001 C CNN
F 3 "https://eu.mouser.com/datasheet/2/427/si2302cds-1764899.pdf" H 1950 2300 50  0001 C CNN
	1    1950 2300
	1    0    0    -1  
$EndComp
$Comp
L power:GND #PWR055
U 1 1 5F426A77
P 2050 2600
AR Path="/5EF831DD/5F426A77" Ref="#PWR055"  Part="1" 
AR Path="/5F5538A6/5F426A77" Ref="#PWR?"  Part="1" 
F 0 "#PWR055" H 2050 2350 50  0001 C CNN
F 1 "GND" H 2055 2427 39  0000 C CNN
F 2 "" H 2050 2600 50  0001 C CNN
F 3 "" H 2050 2600 50  0001 C CNN
	1    2050 2600
	1    0    0    -1  
$EndComp
$Comp
L Device:R_Small R27
U 1 1 5F4277A5
P 1650 2450
AR Path="/5EF831DD/5F4277A5" Ref="R27"  Part="1" 
AR Path="/5F5538A6/5F4277A5" Ref="R?"  Part="1" 
F 0 "R27" H 1709 2496 39  0000 L CNN
F 1 "10k" H 1709 2405 39  0000 L CNN
F 2 "Resistor_SMD:R_0603_1608Metric" H 1650 2450 50  0001 C CNN
F 3 "~" H 1650 2450 50  0001 C CNN
	1    1650 2450
	-1   0    0    -1  
$EndComp
Wire Wire Line
	1750 2300 1650 2300
Wire Wire Line
	1650 2300 1650 2350
Wire Wire Line
	1650 2300 1550 2300
Connection ~ 1650 2300
$Comp
L power:GND #PWR052
U 1 1 5F428B9B
P 1650 2600
AR Path="/5EF831DD/5F428B9B" Ref="#PWR052"  Part="1" 
AR Path="/5F5538A6/5F428B9B" Ref="#PWR?"  Part="1" 
F 0 "#PWR052" H 1650 2350 50  0001 C CNN
F 1 "GND" H 1655 2427 39  0000 C CNN
F 2 "" H 1650 2600 50  0001 C CNN
F 3 "" H 1650 2600 50  0001 C CNN
	1    1650 2600
	1    0    0    -1  
$EndComp
Wire Wire Line
	1650 2550 1650 2600
Wire Wire Line
	2050 2500 2050 2600
$Comp
L Device:LED D14
U 1 1 5F42B784
P 2050 1150
AR Path="/5EF831DD/5F42B784" Ref="D14"  Part="1" 
AR Path="/5F5538A6/5F42B784" Ref="D?"  Part="1" 
F 0 "D14" V 2081 1032 39  0000 R CNN
F 1 "IN-S126AT5UW" V 2006 1032 39  0000 R CNN
F 2 "LED_SMD:LED_1206_3216Metric_Castellated" H 2050 1150 50  0001 C CNN
F 3 "http://inolux-corp.com/datasheet/SMDLED/Mono%20Color%20Top%20View/IN-S126AT%20Series_V1.0.pdf" H 2050 1150 50  0001 C CNN
	1    2050 1150
	0    -1   -1   0   
$EndComp
Wire Wire Line
	2050 1300 2050 1400
$Comp
L Device:Q_NMOS_GSD Q19
U 1 1 5F4336C6
P 4950 2300
AR Path="/5EF831DD/5F4336C6" Ref="Q19"  Part="1" 
AR Path="/5F5538A6/5F4336C6" Ref="Q?"  Part="1" 
F 0 "Q19" H 5155 2262 39  0000 L CNN
F 1 "Si2302CDS" H 5155 2337 39  0000 L CNN
F 2 "Package_TO_SOT_SMD:SOT-23" H 5150 2400 50  0001 C CNN
F 3 "https://eu.mouser.com/datasheet/2/427/si2302cds-1764899.pdf" H 4950 2300 50  0001 C CNN
	1    4950 2300
	1    0    0    -1  
$EndComp
$Comp
L power:GND #PWR067
U 1 1 5F4336CC
P 5050 2600
AR Path="/5EF831DD/5F4336CC" Ref="#PWR067"  Part="1" 
AR Path="/5F5538A6/5F4336CC" Ref="#PWR?"  Part="1" 
F 0 "#PWR067" H 5050 2350 50  0001 C CNN
F 1 "GND" H 5055 2427 39  0000 C CNN
F 2 "" H 5050 2600 50  0001 C CNN
F 3 "" H 5050 2600 50  0001 C CNN
	1    5050 2600
	1    0    0    -1  
$EndComp
$Comp
L Device:R_Small R33
U 1 1 5F4336D2
P 4650 2450
AR Path="/5EF831DD/5F4336D2" Ref="R33"  Part="1" 
AR Path="/5F5538A6/5F4336D2" Ref="R?"  Part="1" 
F 0 "R33" H 4709 2496 39  0000 L CNN
F 1 "10k" H 4709 2405 39  0000 L CNN
F 2 "Resistor_SMD:R_0603_1608Metric" H 4650 2450 50  0001 C CNN
F 3 "~" H 4650 2450 50  0001 C CNN
	1    4650 2450
	-1   0    0    -1  
$EndComp
Wire Wire Line
	4750 2300 4650 2300
Wire Wire Line
	4650 2300 4650 2350
Wire Wire Line
	4650 2300 4550 2300
Connection ~ 4650 2300
$Comp
L power:GND #PWR064
U 1 1 5F4336DC
P 4650 2600
AR Path="/5EF831DD/5F4336DC" Ref="#PWR064"  Part="1" 
AR Path="/5F5538A6/5F4336DC" Ref="#PWR?"  Part="1" 
F 0 "#PWR064" H 4650 2350 50  0001 C CNN
F 1 "GND" H 4655 2427 39  0000 C CNN
F 2 "" H 4650 2600 50  0001 C CNN
F 3 "" H 4650 2600 50  0001 C CNN
	1    4650 2600
	1    0    0    -1  
$EndComp
Wire Wire Line
	4650 2550 4650 2600
Wire Wire Line
	5050 2500 5050 2600
$Comp
L Device:LED D15
U 1 1 5F4340AC
P 2800 1150
AR Path="/5EF831DD/5F4340AC" Ref="D15"  Part="1" 
AR Path="/5F5538A6/5F4340AC" Ref="D?"  Part="1" 
F 0 "D15" V 2831 1032 39  0000 R CNN
F 1 "IN-S126AT5UW" V 2756 1032 39  0000 R CNN
F 2 "LED_SMD:LED_1206_3216Metric_Castellated" H 2800 1150 50  0001 C CNN
F 3 "http://inolux-corp.com/datasheet/SMDLED/Mono%20Color%20Top%20View/IN-S126AT%20Series_V1.0.pdf" H 2800 1150 50  0001 C CNN
	1    2800 1150
	0    -1   -1   0   
$EndComp
$Comp
L Device:Q_NMOS_GSD Q20
U 1 1 5F43936F
P 7950 2300
AR Path="/5EF831DD/5F43936F" Ref="Q20"  Part="1" 
AR Path="/5F5538A6/5F43936F" Ref="Q?"  Part="1" 
F 0 "Q20" H 8155 2262 39  0000 L CNN
F 1 "Si2302CDS" H 8155 2337 39  0000 L CNN
F 2 "Package_TO_SOT_SMD:SOT-23" H 8150 2400 50  0001 C CNN
F 3 "https://eu.mouser.com/datasheet/2/427/si2302cds-1764899.pdf" H 7950 2300 50  0001 C CNN
	1    7950 2300
	1    0    0    -1  
$EndComp
$Comp
L power:GND #PWR073
U 1 1 5F439375
P 8050 2600
AR Path="/5EF831DD/5F439375" Ref="#PWR073"  Part="1" 
AR Path="/5F5538A6/5F439375" Ref="#PWR?"  Part="1" 
F 0 "#PWR073" H 8050 2350 50  0001 C CNN
F 1 "GND" H 8055 2427 39  0000 C CNN
F 2 "" H 8050 2600 50  0001 C CNN
F 3 "" H 8050 2600 50  0001 C CNN
	1    8050 2600
	1    0    0    -1  
$EndComp
$Comp
L Device:R_Small R35
U 1 1 5F43937B
P 7650 2450
AR Path="/5EF831DD/5F43937B" Ref="R35"  Part="1" 
AR Path="/5F5538A6/5F43937B" Ref="R?"  Part="1" 
F 0 "R35" H 7709 2496 39  0000 L CNN
F 1 "10k" H 7709 2405 39  0000 L CNN
F 2 "Resistor_SMD:R_0603_1608Metric" H 7650 2450 50  0001 C CNN
F 3 "~" H 7650 2450 50  0001 C CNN
	1    7650 2450
	-1   0    0    -1  
$EndComp
Wire Wire Line
	7750 2300 7650 2300
Wire Wire Line
	7650 2300 7650 2350
Wire Wire Line
	7650 2300 7550 2300
Connection ~ 7650 2300
$Comp
L power:GND #PWR071
U 1 1 5F439385
P 7650 2600
AR Path="/5EF831DD/5F439385" Ref="#PWR071"  Part="1" 
AR Path="/5F5538A6/5F439385" Ref="#PWR?"  Part="1" 
F 0 "#PWR071" H 7650 2350 50  0001 C CNN
F 1 "GND" H 7655 2427 39  0000 C CNN
F 2 "" H 7650 2600 50  0001 C CNN
F 3 "" H 7650 2600 50  0001 C CNN
	1    7650 2600
	1    0    0    -1  
$EndComp
Wire Wire Line
	7650 2550 7650 2600
Wire Wire Line
	8050 2500 8050 2600
$Comp
L Device:LED D16
U 1 1 5F43A069
P 3550 1150
AR Path="/5EF831DD/5F43A069" Ref="D16"  Part="1" 
AR Path="/5F5538A6/5F43A069" Ref="D?"  Part="1" 
F 0 "D16" V 3581 1032 39  0000 R CNN
F 1 "IN-S126AT5UW" V 3506 1032 39  0000 R CNN
F 2 "LED_SMD:LED_1206_3216Metric_Castellated" H 3550 1150 50  0001 C CNN
F 3 "http://inolux-corp.com/datasheet/SMDLED/Mono%20Color%20Top%20View/IN-S126AT%20Series_V1.0.pdf" H 3550 1150 50  0001 C CNN
	1    3550 1150
	0    -1   -1   0   
$EndComp
Wire Wire Line
	2800 1300 2800 1550
Wire Wire Line
	3550 1300 3550 1700
$Comp
L Device:LED D17
U 1 1 5F46DF33
P 4300 1150
AR Path="/5EF831DD/5F46DF33" Ref="D17"  Part="1" 
AR Path="/5F5538A6/5F46DF33" Ref="D?"  Part="1" 
F 0 "D17" V 4331 1032 39  0000 R CNN
F 1 "IN-S126AT5UW" V 4256 1032 39  0000 R CNN
F 2 "LED_SMD:LED_1206_3216Metric_Castellated" H 4300 1150 50  0001 C CNN
F 3 "http://inolux-corp.com/datasheet/SMDLED/Mono%20Color%20Top%20View/IN-S126AT%20Series_V1.0.pdf" H 4300 1150 50  0001 C CNN
	1    4300 1150
	0    -1   -1   0   
$EndComp
$Comp
L Device:LED D18
U 1 1 5F46DF39
P 5050 1150
AR Path="/5EF831DD/5F46DF39" Ref="D18"  Part="1" 
AR Path="/5F5538A6/5F46DF39" Ref="D?"  Part="1" 
F 0 "D18" V 5081 1032 39  0000 R CNN
F 1 "IN-S126AT5UW" V 5006 1032 39  0000 R CNN
F 2 "LED_SMD:LED_1206_3216Metric_Castellated" H 5050 1150 50  0001 C CNN
F 3 "http://inolux-corp.com/datasheet/SMDLED/Mono%20Color%20Top%20View/IN-S126AT%20Series_V1.0.pdf" H 5050 1150 50  0001 C CNN
	1    5050 1150
	0    -1   -1   0   
$EndComp
$Comp
L Device:LED D19
U 1 1 5F46DF3F
P 5800 1150
AR Path="/5EF831DD/5F46DF3F" Ref="D19"  Part="1" 
AR Path="/5F5538A6/5F46DF3F" Ref="D?"  Part="1" 
F 0 "D19" V 5831 1032 39  0000 R CNN
F 1 "IN-S126AT5UW" V 5756 1032 39  0000 R CNN
F 2 "LED_SMD:LED_1206_3216Metric_Castellated" H 5800 1150 50  0001 C CNN
F 3 "http://inolux-corp.com/datasheet/SMDLED/Mono%20Color%20Top%20View/IN-S126AT%20Series_V1.0.pdf" H 5800 1150 50  0001 C CNN
	1    5800 1150
	0    -1   -1   0   
$EndComp
$Comp
L Device:LED D20
U 1 1 5F470346
P 6550 1150
AR Path="/5EF831DD/5F470346" Ref="D20"  Part="1" 
AR Path="/5F5538A6/5F470346" Ref="D?"  Part="1" 
F 0 "D20" V 6581 1032 39  0000 R CNN
F 1 "IN-S126AT5UW" V 6506 1032 39  0000 R CNN
F 2 "LED_SMD:LED_1206_3216Metric_Castellated" H 6550 1150 50  0001 C CNN
F 3 "http://inolux-corp.com/datasheet/SMDLED/Mono%20Color%20Top%20View/IN-S126AT%20Series_V1.0.pdf" H 6550 1150 50  0001 C CNN
	1    6550 1150
	0    -1   -1   0   
$EndComp
$Comp
L Device:LED D21
U 1 1 5F47034C
P 7300 1150
AR Path="/5EF831DD/5F47034C" Ref="D21"  Part="1" 
AR Path="/5F5538A6/5F47034C" Ref="D?"  Part="1" 
F 0 "D21" V 7331 1032 39  0000 R CNN
F 1 "IN-S126AT5UW" V 7256 1032 39  0000 R CNN
F 2 "LED_SMD:LED_1206_3216Metric_Castellated" H 7300 1150 50  0001 C CNN
F 3 "http://inolux-corp.com/datasheet/SMDLED/Mono%20Color%20Top%20View/IN-S126AT%20Series_V1.0.pdf" H 7300 1150 50  0001 C CNN
	1    7300 1150
	0    -1   -1   0   
$EndComp
$Comp
L Device:LED D22
U 1 1 5F470352
P 8050 1150
AR Path="/5EF831DD/5F470352" Ref="D22"  Part="1" 
AR Path="/5F5538A6/5F470352" Ref="D?"  Part="1" 
F 0 "D22" V 8081 1032 39  0000 R CNN
F 1 "IN-S126AT5UW" V 8006 1032 39  0000 R CNN
F 2 "LED_SMD:LED_1206_3216Metric_Castellated" H 8050 1150 50  0001 C CNN
F 3 "http://inolux-corp.com/datasheet/SMDLED/Mono%20Color%20Top%20View/IN-S126AT%20Series_V1.0.pdf" H 8050 1150 50  0001 C CNN
	1    8050 1150
	0    -1   -1   0   
$EndComp
$Comp
L Device:LED D23
U 1 1 5F47FB42
P 8800 1150
AR Path="/5EF831DD/5F47FB42" Ref="D23"  Part="1" 
AR Path="/5F5538A6/5F47FB42" Ref="D?"  Part="1" 
F 0 "D23" V 8831 1032 39  0000 R CNN
F 1 "IN-S126AT5UW" V 8756 1032 39  0000 R CNN
F 2 "LED_SMD:LED_1206_3216Metric_Castellated" H 8800 1150 50  0001 C CNN
F 3 "http://inolux-corp.com/datasheet/SMDLED/Mono%20Color%20Top%20View/IN-S126AT%20Series_V1.0.pdf" H 8800 1150 50  0001 C CNN
	1    8800 1150
	0    -1   -1   0   
$EndComp
$Comp
L Device:LED D24
U 1 1 5F47FB48
P 9550 1150
AR Path="/5EF831DD/5F47FB48" Ref="D24"  Part="1" 
AR Path="/5F5538A6/5F47FB48" Ref="D?"  Part="1" 
F 0 "D24" V 9581 1032 39  0000 R CNN
F 1 "IN-S126AT5UW" V 9506 1032 39  0000 R CNN
F 2 "LED_SMD:LED_1206_3216Metric_Castellated" H 9550 1150 50  0001 C CNN
F 3 "http://inolux-corp.com/datasheet/SMDLED/Mono%20Color%20Top%20View/IN-S126AT%20Series_V1.0.pdf" H 9550 1150 50  0001 C CNN
	1    9550 1150
	0    -1   -1   0   
$EndComp
$Comp
L Device:LED D25
U 1 1 5F47FB4E
P 10300 1150
AR Path="/5EF831DD/5F47FB4E" Ref="D25"  Part="1" 
AR Path="/5F5538A6/5F47FB4E" Ref="D?"  Part="1" 
F 0 "D25" V 10331 1032 39  0000 R CNN
F 1 "IN-S126AT5UW" V 10256 1032 39  0000 R CNN
F 2 "LED_SMD:LED_1206_3216Metric_Castellated" H 10300 1150 50  0001 C CNN
F 3 "http://inolux-corp.com/datasheet/SMDLED/Mono%20Color%20Top%20View/IN-S126AT%20Series_V1.0.pdf" H 10300 1150 50  0001 C CNN
	1    10300 1150
	0    -1   -1   0   
$EndComp
Wire Wire Line
	2050 1400 4300 1400
Wire Wire Line
	4300 1400 4300 1300
Connection ~ 2050 1400
Wire Wire Line
	4300 1400 6550 1400
Wire Wire Line
	6550 1400 6550 1300
Connection ~ 4300 1400
Wire Wire Line
	6550 1400 8800 1400
Wire Wire Line
	8800 1400 8800 1300
Connection ~ 6550 1400
Wire Wire Line
	2800 1550 5050 1550
Wire Wire Line
	5050 1550 5050 1300
Wire Wire Line
	5050 1550 7300 1550
Wire Wire Line
	7300 1550 7300 1300
Connection ~ 5050 1550
Wire Wire Line
	7300 1550 9550 1550
Wire Wire Line
	9550 1550 9550 1300
Connection ~ 7300 1550
Wire Wire Line
	3550 1700 5800 1700
Wire Wire Line
	5800 1700 5800 1300
Wire Wire Line
	5800 1700 8050 1700
Wire Wire Line
	8050 1700 8050 1300
Connection ~ 5800 1700
Wire Wire Line
	8050 1700 10300 1700
Wire Wire Line
	10300 1700 10300 1300
Connection ~ 8050 1700
Wire Wire Line
	5050 2000 5050 2100
Wire Wire Line
	8050 2000 8050 2100
Wire Wire Line
	2050 1400 2050 1800
Wire Wire Line
	2050 2000 2050 2100
$Comp
L Device:R_Small R28
U 1 1 5F4677A1
P 2050 1900
AR Path="/5EF831DD/5F4677A1" Ref="R28"  Part="1" 
AR Path="/5F5538A6/5F4677A1" Ref="R?"  Part="1" 
F 0 "R28" H 2109 1946 39  0000 L CNN
F 1 "22-1/4W" H 2109 1855 39  0000 L CNN
F 2 "Resistor_SMD:R_1206_3216Metric" H 2050 1900 50  0001 C CNN
F 3 "~" H 2050 1900 50  0001 C CNN
F 4 "KTR18EZPJ220 " H 2050 1900 50  0001 C CNN "Mfr"
	1    2050 1900
	1    0    0    -1  
$EndComp
Wire Wire Line
	8050 1700 8050 1800
Wire Wire Line
	5050 1550 5050 1800
$Comp
L power:+5V #PWR?
U 1 1 5F4D6597
P 2050 1000
AR Path="/5F10B8E7/5F4D6597" Ref="#PWR?"  Part="1" 
AR Path="/5EF831DD/5F4D6597" Ref="#PWR054"  Part="1" 
AR Path="/5F5538A6/5F4D6597" Ref="#PWR?"  Part="1" 
F 0 "#PWR054" H 2050 850 50  0001 C CNN
F 1 "+5V" H 2050 1173 39  0000 C CNN
F 2 "" H 2050 1000 50  0001 C CNN
F 3 "" H 2050 1000 50  0001 C CNN
	1    2050 1000
	1    0    0    -1  
$EndComp
$Comp
L power:+5V #PWR?
U 1 1 5F4D6EEB
P 2800 1000
AR Path="/5F10B8E7/5F4D6EEB" Ref="#PWR?"  Part="1" 
AR Path="/5EF831DD/5F4D6EEB" Ref="#PWR057"  Part="1" 
AR Path="/5F5538A6/5F4D6EEB" Ref="#PWR?"  Part="1" 
F 0 "#PWR057" H 2800 850 50  0001 C CNN
F 1 "+5V" H 2800 1173 39  0000 C CNN
F 2 "" H 2800 1000 50  0001 C CNN
F 3 "" H 2800 1000 50  0001 C CNN
	1    2800 1000
	1    0    0    -1  
$EndComp
$Comp
L power:+5V #PWR?
U 1 1 5F4D718C
P 3550 1000
AR Path="/5F10B8E7/5F4D718C" Ref="#PWR?"  Part="1" 
AR Path="/5EF831DD/5F4D718C" Ref="#PWR058"  Part="1" 
AR Path="/5F5538A6/5F4D718C" Ref="#PWR?"  Part="1" 
F 0 "#PWR058" H 3550 850 50  0001 C CNN
F 1 "+5V" H 3550 1173 39  0000 C CNN
F 2 "" H 3550 1000 50  0001 C CNN
F 3 "" H 3550 1000 50  0001 C CNN
	1    3550 1000
	1    0    0    -1  
$EndComp
$Comp
L power:+5V #PWR?
U 1 1 5F4D75B5
P 4300 1000
AR Path="/5F10B8E7/5F4D75B5" Ref="#PWR?"  Part="1" 
AR Path="/5EF831DD/5F4D75B5" Ref="#PWR063"  Part="1" 
AR Path="/5F5538A6/5F4D75B5" Ref="#PWR?"  Part="1" 
F 0 "#PWR063" H 4300 850 50  0001 C CNN
F 1 "+5V" H 4300 1173 39  0000 C CNN
F 2 "" H 4300 1000 50  0001 C CNN
F 3 "" H 4300 1000 50  0001 C CNN
	1    4300 1000
	1    0    0    -1  
$EndComp
$Comp
L power:+5V #PWR?
U 1 1 5F4D7BBB
P 5050 1000
AR Path="/5F10B8E7/5F4D7BBB" Ref="#PWR?"  Part="1" 
AR Path="/5EF831DD/5F4D7BBB" Ref="#PWR066"  Part="1" 
AR Path="/5F5538A6/5F4D7BBB" Ref="#PWR?"  Part="1" 
F 0 "#PWR066" H 5050 850 50  0001 C CNN
F 1 "+5V" H 5050 1173 39  0000 C CNN
F 2 "" H 5050 1000 50  0001 C CNN
F 3 "" H 5050 1000 50  0001 C CNN
	1    5050 1000
	1    0    0    -1  
$EndComp
$Comp
L power:+5V #PWR?
U 1 1 5F4D7F06
P 5800 1000
AR Path="/5F10B8E7/5F4D7F06" Ref="#PWR?"  Part="1" 
AR Path="/5EF831DD/5F4D7F06" Ref="#PWR068"  Part="1" 
AR Path="/5F5538A6/5F4D7F06" Ref="#PWR?"  Part="1" 
F 0 "#PWR068" H 5800 850 50  0001 C CNN
F 1 "+5V" H 5800 1173 39  0000 C CNN
F 2 "" H 5800 1000 50  0001 C CNN
F 3 "" H 5800 1000 50  0001 C CNN
	1    5800 1000
	1    0    0    -1  
$EndComp
$Comp
L power:+5V #PWR?
U 1 1 5F4D8214
P 6550 1000
AR Path="/5F10B8E7/5F4D8214" Ref="#PWR?"  Part="1" 
AR Path="/5EF831DD/5F4D8214" Ref="#PWR069"  Part="1" 
AR Path="/5F5538A6/5F4D8214" Ref="#PWR?"  Part="1" 
F 0 "#PWR069" H 6550 850 50  0001 C CNN
F 1 "+5V" H 6550 1173 39  0000 C CNN
F 2 "" H 6550 1000 50  0001 C CNN
F 3 "" H 6550 1000 50  0001 C CNN
	1    6550 1000
	1    0    0    -1  
$EndComp
$Comp
L power:+5V #PWR?
U 1 1 5F4D8622
P 7300 1000
AR Path="/5F10B8E7/5F4D8622" Ref="#PWR?"  Part="1" 
AR Path="/5EF831DD/5F4D8622" Ref="#PWR070"  Part="1" 
AR Path="/5F5538A6/5F4D8622" Ref="#PWR?"  Part="1" 
F 0 "#PWR070" H 7300 850 50  0001 C CNN
F 1 "+5V" H 7300 1173 39  0000 C CNN
F 2 "" H 7300 1000 50  0001 C CNN
F 3 "" H 7300 1000 50  0001 C CNN
	1    7300 1000
	1    0    0    -1  
$EndComp
$Comp
L power:+5V #PWR?
U 1 1 5F4D946A
P 8050 1000
AR Path="/5F10B8E7/5F4D946A" Ref="#PWR?"  Part="1" 
AR Path="/5EF831DD/5F4D946A" Ref="#PWR072"  Part="1" 
AR Path="/5F5538A6/5F4D946A" Ref="#PWR?"  Part="1" 
F 0 "#PWR072" H 8050 850 50  0001 C CNN
F 1 "+5V" H 8050 1173 39  0000 C CNN
F 2 "" H 8050 1000 50  0001 C CNN
F 3 "" H 8050 1000 50  0001 C CNN
	1    8050 1000
	1    0    0    -1  
$EndComp
$Comp
L power:+5V #PWR?
U 1 1 5F4D97A8
P 8800 1000
AR Path="/5F10B8E7/5F4D97A8" Ref="#PWR?"  Part="1" 
AR Path="/5EF831DD/5F4D97A8" Ref="#PWR074"  Part="1" 
AR Path="/5F5538A6/5F4D97A8" Ref="#PWR?"  Part="1" 
F 0 "#PWR074" H 8800 850 50  0001 C CNN
F 1 "+5V" H 8800 1173 39  0000 C CNN
F 2 "" H 8800 1000 50  0001 C CNN
F 3 "" H 8800 1000 50  0001 C CNN
	1    8800 1000
	1    0    0    -1  
$EndComp
$Comp
L power:+5V #PWR?
U 1 1 5F4D9B99
P 9550 1000
AR Path="/5F10B8E7/5F4D9B99" Ref="#PWR?"  Part="1" 
AR Path="/5EF831DD/5F4D9B99" Ref="#PWR075"  Part="1" 
AR Path="/5F5538A6/5F4D9B99" Ref="#PWR?"  Part="1" 
F 0 "#PWR075" H 9550 850 50  0001 C CNN
F 1 "+5V" H 9550 1173 39  0000 C CNN
F 2 "" H 9550 1000 50  0001 C CNN
F 3 "" H 9550 1000 50  0001 C CNN
	1    9550 1000
	1    0    0    -1  
$EndComp
$Comp
L power:+5V #PWR?
U 1 1 5F4D9EC8
P 10300 1000
AR Path="/5F10B8E7/5F4D9EC8" Ref="#PWR?"  Part="1" 
AR Path="/5EF831DD/5F4D9EC8" Ref="#PWR076"  Part="1" 
AR Path="/5F5538A6/5F4D9EC8" Ref="#PWR?"  Part="1" 
F 0 "#PWR076" H 10300 850 50  0001 C CNN
F 1 "+5V" H 10300 1173 39  0000 C CNN
F 2 "" H 10300 1000 50  0001 C CNN
F 3 "" H 10300 1000 50  0001 C CNN
	1    10300 1000
	1    0    0    -1  
$EndComp
Text HLabel 1550 2300 0    39   Input ~ 0
LED1
Text HLabel 4550 2300 0    39   Input ~ 0
LED2
Text HLabel 7550 2300 0    39   Input ~ 0
LED3
$Comp
L Device:R_Small R34
U 1 1 5F4E7D14
P 5050 1900
AR Path="/5EF831DD/5F4E7D14" Ref="R34"  Part="1" 
AR Path="/5F5538A6/5F4E7D14" Ref="R?"  Part="1" 
F 0 "R34" H 5109 1946 39  0000 L CNN
F 1 "22-1/4W" H 5109 1855 39  0000 L CNN
F 2 "Resistor_SMD:R_1206_3216Metric" H 5050 1900 50  0001 C CNN
F 3 "~" H 5050 1900 50  0001 C CNN
F 4 "KTR18EZPJ220 " H 5050 1900 50  0001 C CNN "Mfr"
	1    5050 1900
	1    0    0    -1  
$EndComp
$Comp
L Device:R_Small R36
U 1 1 5F4E821F
P 8050 1900
AR Path="/5EF831DD/5F4E821F" Ref="R36"  Part="1" 
AR Path="/5F5538A6/5F4E821F" Ref="R?"  Part="1" 
F 0 "R36" H 8109 1946 39  0000 L CNN
F 1 "22-1/4W" H 8109 1855 39  0000 L CNN
F 2 "Resistor_SMD:R_1206_3216Metric" H 8050 1900 50  0001 C CNN
F 3 "~" H 8050 1900 50  0001 C CNN
F 4 "KTR18EZPJ220 " H 8050 1900 50  0001 C CNN "Mfr"
	1    8050 1900
	1    0    0    -1  
$EndComp
$EndSCHEMATC
