(module PogoConn_Standard (layer F.Cu) (tedit 5F61DC15)
  (descr "Standard Pogo Pin Connector MillMax 0908-9-15-20-75-14-11-0")
  (fp_text reference REF** (at 0 1.9) (layer F.SilkS)
    (effects (font (size 1 1) (thickness 0.15)))
  )
  (fp_text value PogoConn (at 0 -0.5) (layer F.Fab)
    (effects (font (size 1 1) (thickness 0.15)))
  )
  (fp_line (start 25 -12.5) (end 83 -12.5) (layer Dwgs.User) (width 0.12))
  (fp_line (start 25 12.5) (end 83 12.5) (layer Dwgs.User) (width 0.12))
  (fp_line (start 23 -10.5) (end 23 10.5) (layer Dwgs.User) (width 0.12))
  (fp_circle (center -6.893654 1.215537) (end -5.334808 0.315537) (layer Dwgs.User) (width 0.05))
  (fp_circle (center -4.499513 5.362311) (end -2.940667 4.462311) (layer Dwgs.User) (width 0.05))
  (fp_circle (center -2.394141 -6.577848) (end -0.835295 -7.477848) (layer Dwgs.User) (width 0.05))
  (fp_circle (center 2.394141 -6.577848) (end 3.952987 -7.477848) (layer Dwgs.User) (width 0.05))
  (fp_circle (center 4.499513 5.362311) (end 6.058359 4.462311) (layer Dwgs.User) (width 0.05))
  (fp_circle (center 6.893654 1.215537) (end 8.4525 0.315537) (layer Dwgs.User) (width 0.05))
  (fp_circle (center -3.897113 -2.25) (end -2.338268 -3.15) (layer Dwgs.User) (width 0.05))
  (fp_circle (center 0.000001 4.499999) (end 1.558846 3.599999) (layer Dwgs.User) (width 0.05))
  (fp_circle (center 3.897114 -2.25) (end 5.45596 -3.15) (layer Dwgs.User) (width 0.05))
  (fp_circle (center 0 0) (end 1.558846 -0.9) (layer Dwgs.User) (width 0.05))
  (fp_circle (center -11.59111 3.105829) (end -9.852443 2.639954) (layer Dwgs.User) (width 0.05))
  (fp_circle (center -8.485282 8.485281) (end -6.746615 8.019407) (layer Dwgs.User) (width 0.05))
  (fp_circle (center -3.105829 11.59111) (end -1.367162 11.125236) (layer Dwgs.User) (width 0.05))
  (fp_circle (center 3.105829 11.59111) (end 4.844495 11.125236) (layer Dwgs.User) (width 0.05))
  (fp_circle (center 8.485281 8.485282) (end 10.223948 8.019407) (layer Dwgs.User) (width 0.05))
  (fp_circle (center 11.59111 3.105829) (end 13.329777 2.639954) (layer Dwgs.User) (width 0.05))
  (fp_circle (center 11.59111 -3.105829) (end 13.329776 -3.571703) (layer Dwgs.User) (width 0.05))
  (fp_circle (center 8.485282 -8.485281) (end 10.223948 -8.951156) (layer Dwgs.User) (width 0.05))
  (fp_circle (center 3.105829 -11.59111) (end 4.844495 -12.056984) (layer Dwgs.User) (width 0.05))
  (fp_circle (center -3.105829 -11.59111) (end -1.367162 -12.056984) (layer Dwgs.User) (width 0.05))
  (fp_circle (center -8.485281 -8.485282) (end -6.746615 -8.951156) (layer Dwgs.User) (width 0.05))
  (fp_circle (center -11.59111 -3.105829) (end -9.852444 -3.571703) (layer Dwgs.User) (width 0.05))
  (fp_arc (start -2.598076 -1.499999) (end 13.250447 -7.650147) (angle 102.5) (layer B.SilkS) (width 0.12))
  (fp_arc (start 2.598076 -1.499999) (end -0.000001 15.300298) (angle 102.5) (layer B.SilkS) (width 0.12))
  (fp_arc (start 0 3) (end -13.250446 -7.650149) (angle 102.5) (layer B.SilkS) (width 0.12))
  (fp_arc (start 25 -10.5) (end 25 -12.5) (angle -90) (layer Dwgs.User) (width 0.12))
  (fp_arc (start 25 10.5) (end 23 10.5) (angle -90) (layer Dwgs.User) (width 0.12))
  (fp_line (start 23.325318 -15.400635) (end 52.325318 -65.630109) (layer Dwgs.User) (width 0.12))
  (fp_line (start 2.406733 -25.168584) (end 20.593267 -14.668584) (layer Dwgs.User) (width 0.12))
  (fp_line (start 1.674682 -27.900635) (end 30.674682 -78.130109) (layer Dwgs.User) (width 0.12))
  (fp_arc (start 3.406733 -26.900635) (end 1.674682 -27.900635) (angle -90) (layer Dwgs.User) (width 0.12))
  (fp_arc (start 21.593267 -16.400635) (end 20.593267 -14.668584) (angle -90) (layer Dwgs.User) (width 0.12))
  (fp_line (start -20.593267 -14.668584) (end -2.406733 -25.168584) (layer Dwgs.User) (width 0.12))
  (fp_line (start -23.325318 -15.400635) (end -52.325318 -65.630108) (layer Dwgs.User) (width 0.12))
  (fp_arc (start -21.593267 -16.400635) (end -23.325318 -15.400635) (angle -90) (layer Dwgs.User) (width 0.12))
  (fp_arc (start -3.406733 -26.900635) (end -2.406733 -25.168584) (angle -90) (layer Dwgs.User) (width 0.12))
  (fp_line (start -1.674682 -27.900635) (end -30.674683 -78.130109) (layer Dwgs.User) (width 0.12))
  (fp_line (start -25 12.5) (end -83 12.500001) (layer Dwgs.User) (width 0.12))
  (fp_arc (start -25 10.5) (end -25 12.5) (angle -90) (layer Dwgs.User) (width 0.12))
  (fp_line (start -25 -12.5) (end -83.000001 -12.5) (layer Dwgs.User) (width 0.12))
  (fp_line (start -23 10.5) (end -23 -10.5) (layer Dwgs.User) (width 0.12))
  (fp_arc (start -25 -10.5) (end -23 -10.5) (angle -90) (layer Dwgs.User) (width 0.12))
  (fp_arc (start -3.406733 26.900635) (end -1.674682 27.900635) (angle -90) (layer Dwgs.User) (width 0.12))
  (fp_line (start -1.674682 27.900635) (end -30.674682 78.130109) (layer Dwgs.User) (width 0.12))
  (fp_line (start -2.406733 25.168584) (end -20.593267 14.668584) (layer Dwgs.User) (width 0.12))
  (fp_arc (start -21.593267 16.400635) (end -20.593267 14.668584) (angle -90) (layer Dwgs.User) (width 0.12))
  (fp_line (start -23.325318 15.400635) (end -52.325318 65.630109) (layer Dwgs.User) (width 0.12))
  (fp_line (start 1.674682 27.900635) (end 30.674683 78.130109) (layer Dwgs.User) (width 0.12))
  (fp_arc (start 21.593267 16.400635) (end 23.325318 15.400635) (angle -90) (layer Dwgs.User) (width 0.12))
  (fp_line (start 20.593267 14.668584) (end 2.406733 25.168584) (layer Dwgs.User) (width 0.12))
  (fp_line (start 23.325318 15.400635) (end 52.325318 65.630108) (layer Dwgs.User) (width 0.12))
  (fp_arc (start 3.406733 26.900635) (end 2.406733 25.168584) (angle -90) (layer Dwgs.User) (width 0.12))
  (pad 7 thru_hole circle (at 0 0) (size 1.83 1.83) (drill 0.55) (layers *.Cu *.Mask))
  (pad 8 thru_hole circle (at 3.89711 -2.25) (size 1.83 1.83) (drill 0.55) (layers *.Cu *.Mask))
  (pad 8 thru_hole circle (at -3.89711 -2.25) (size 1.83 1.83) (drill 0.55) (layers *.Cu *.Mask))
  (pad 8 thru_hole circle (at 0 4.5) (size 1.83 1.83) (drill 0.55) (layers *.Cu *.Mask))
  (pad 9 thru_hole circle (at 2.39414 -6.57785) (size 1.83 1.83) (drill 0.55) (layers *.Cu *.Mask))
  (pad 9 thru_hole circle (at -6.89365 1.21554) (size 1.83 1.83) (drill 0.55) (layers *.Cu *.Mask))
  (pad 9 thru_hole circle (at 4.49951 5.36231) (size 1.83 1.83) (drill 0.55) (layers *.Cu *.Mask))
  (pad 10 thru_hole circle (at -2.39414 -6.57785) (size 1.83 1.83) (drill 0.55) (layers *.Cu *.Mask))
  (pad 10 thru_hole circle (at -4.49951 5.36231) (size 1.83 1.83) (drill 0.55) (layers *.Cu *.Mask))
  (pad 10 thru_hole circle (at 6.89365 1.21554) (size 1.83 1.83) (drill 0.55) (layers *.Cu *.Mask))
  (model ${KIPRJMOD}/../../libs/3D/mill-max-0908-9-15-20-75-14-11-0.stp
    (at (xyz 0 0 0))
    (scale (xyz 1 1 1))
    (rotate (xyz 0 -90 0))
  )
  (model ${KIPRJMOD}/../../libs/3D/mill-max-0908-9-15-20-75-14-11-0.stp
    (offset (xyz 3.89711 2.25 0))
    (scale (xyz 1 1 1))
    (rotate (xyz 0 -90 0))
  )
  (model ${KIPRJMOD}/../../libs/3D/mill-max-0908-9-15-20-75-14-11-0.stp
    (offset (xyz -3.89711 2.25 0))
    (scale (xyz 1 1 1))
    (rotate (xyz 0 -90 0))
  )
  (model ${KIPRJMOD}/../../libs/3D/mill-max-0908-9-15-20-75-14-11-0.stp
    (offset (xyz -0 -4.5 0))
    (scale (xyz 1 1 1))
    (rotate (xyz 0 -90 0))
  )
  (model ${KIPRJMOD}/../../libs/3D/mill-max-0908-9-15-20-75-14-11-0.stp
    (offset (xyz 2.39414 6.57785 0))
    (scale (xyz 1 1 1))
    (rotate (xyz 0 -90 0))
  )
  (model ${KIPRJMOD}/../../libs/3D/mill-max-0908-9-15-20-75-14-11-0.stp
    (offset (xyz -6.89365 -1.21554 0))
    (scale (xyz 1 1 1))
    (rotate (xyz 0 -90 0))
  )
  (model ${KIPRJMOD}/../../libs/3D/mill-max-0908-9-15-20-75-14-11-0.stp
    (offset (xyz 4.49951 -5.36231 0))
    (scale (xyz 1 1 1))
    (rotate (xyz 0 -90 0))
  )
  (model ${KIPRJMOD}/../../libs/3D/mill-max-0908-9-15-20-75-14-11-0.stp
    (offset (xyz -2.39414 6.57785 0))
    (scale (xyz 1 1 1))
    (rotate (xyz 0 -90 0))
  )
  (model ${KIPRJMOD}/../../libs/3D/mill-max-0908-9-15-20-75-14-11-0.stp
    (offset (xyz -4.49951 -5.36231 0))
    (scale (xyz 1 1 1))
    (rotate (xyz 0 -90 0))
  )
  (model ${KIPRJMOD}/../../libs/3D/mill-max-0908-9-15-20-75-14-11-0.stp
    (offset (xyz 6.89365 -1.21554 0))
    (scale (xyz 1 1 1))
    (rotate (xyz 0 -90 0))
  )
)
