EESchema Schematic File Version 4
EELAYER 30 0
EELAYER END
$Descr A4 11693 8268
encoding utf-8
Sheet 3 16
Title "BUS"
Date "2020-04-11"
Rev "1.2"
Comp "Institute for Automation of Complex Power Systems - E.ON ERC - RWTH Aachen University"
Comment1 "Designer: C. Guarnieri Calò Carducci"
Comment2 ""
Comment3 ""
Comment4 ""
$EndDescr
Text HLabel 4850 3650 0    50   Input ~ 0
PWM
$Comp
L power:GND #PWR027
U 1 1 5E8B5EC5
P 5350 4000
AR Path="/5EA18958/5E8B5EC5" Ref="#PWR027"  Part="1" 
AR Path="/5EAA23CE/5E8B5EC5" Ref="#PWR043"  Part="1" 
AR Path="/5EA82760/5E8B5EC5" Ref="#PWR035"  Part="1" 
AR Path="/5EAAB2C7/5E8B5EC5" Ref="#PWR051"  Part="1" 
AR Path="/5EAB4190/5E8B5EC5" Ref="#PWR059"  Part="1" 
AR Path="/5EABD095/5E8B5EC5" Ref="#PWR067"  Part="1" 
AR Path="/5EAC5FAE/5E8B5EC5" Ref="#PWR075"  Part="1" 
AR Path="/5EB6BDDE/5E8B5EC5" Ref="#PWR0111"  Part="1" 
AR Path="/5EB6BDE1/5E8B5EC5" Ref="#PWR0119"  Part="1" 
AR Path="/5EB6BDE4/5E8B5EC5" Ref="#PWR0127"  Part="1" 
AR Path="/5EB6BDE7/5E8B5EC5" Ref="#PWR0135"  Part="1" 
AR Path="/5EB6BDEA/5E8B5EC5" Ref="#PWR0143"  Part="1" 
AR Path="/5EB6BDED/5E8B5EC5" Ref="#PWR0151"  Part="1" 
AR Path="/5EB6BDF0/5E8B5EC5" Ref="#PWR0159"  Part="1" 
F 0 "#PWR035" H 5350 3750 50  0001 C CNN
F 1 "GND" H 5355 3827 50  0000 C CNN
F 2 "" H 5350 4000 50  0001 C CNN
F 3 "" H 5350 4000 50  0001 C CNN
	1    5350 4000
	1    0    0    -1  
$EndComp
Wire Wire Line
	5350 3400 5350 3450
Wire Wire Line
	7150 3400 7150 3450
$Comp
L power:+5V #PWR026
U 1 1 5E9DC038
P 5350 2750
AR Path="/5EA18958/5E9DC038" Ref="#PWR026"  Part="1" 
AR Path="/5EAA23CE/5E9DC038" Ref="#PWR042"  Part="1" 
AR Path="/5EA82760/5E9DC038" Ref="#PWR034"  Part="1" 
AR Path="/5EAAB2C7/5E9DC038" Ref="#PWR050"  Part="1" 
AR Path="/5EAB4190/5E9DC038" Ref="#PWR058"  Part="1" 
AR Path="/5EABD095/5E9DC038" Ref="#PWR066"  Part="1" 
AR Path="/5EAC5FAE/5E9DC038" Ref="#PWR074"  Part="1" 
AR Path="/5EB6BDDE/5E9DC038" Ref="#PWR0110"  Part="1" 
AR Path="/5EB6BDE1/5E9DC038" Ref="#PWR0118"  Part="1" 
AR Path="/5EB6BDE4/5E9DC038" Ref="#PWR0126"  Part="1" 
AR Path="/5EB6BDE7/5E9DC038" Ref="#PWR0134"  Part="1" 
AR Path="/5EB6BDEA/5E9DC038" Ref="#PWR0142"  Part="1" 
AR Path="/5EB6BDED/5E9DC038" Ref="#PWR0150"  Part="1" 
AR Path="/5EB6BDF0/5E9DC038" Ref="#PWR0158"  Part="1" 
F 0 "#PWR034" H 5350 2600 50  0001 C CNN
F 1 "+5V" H 5365 2923 50  0000 C CNN
F 2 "" H 5350 2750 50  0001 C CNN
F 3 "" H 5350 2750 50  0001 C CNN
	1    5350 2750
	1    0    0    -1  
$EndComp
$Comp
L power:+5V #PWR030
U 1 1 5E9DC1D1
P 7150 2750
AR Path="/5EA18958/5E9DC1D1" Ref="#PWR030"  Part="1" 
AR Path="/5EAA23CE/5E9DC1D1" Ref="#PWR046"  Part="1" 
AR Path="/5EA82760/5E9DC1D1" Ref="#PWR038"  Part="1" 
AR Path="/5EAAB2C7/5E9DC1D1" Ref="#PWR054"  Part="1" 
AR Path="/5EAB4190/5E9DC1D1" Ref="#PWR062"  Part="1" 
AR Path="/5EABD095/5E9DC1D1" Ref="#PWR070"  Part="1" 
AR Path="/5EAC5FAE/5E9DC1D1" Ref="#PWR078"  Part="1" 
AR Path="/5EB6BDDE/5E9DC1D1" Ref="#PWR0114"  Part="1" 
AR Path="/5EB6BDE1/5E9DC1D1" Ref="#PWR0122"  Part="1" 
AR Path="/5EB6BDE4/5E9DC1D1" Ref="#PWR0130"  Part="1" 
AR Path="/5EB6BDE7/5E9DC1D1" Ref="#PWR0138"  Part="1" 
AR Path="/5EB6BDEA/5E9DC1D1" Ref="#PWR0146"  Part="1" 
AR Path="/5EB6BDED/5E9DC1D1" Ref="#PWR0154"  Part="1" 
AR Path="/5EB6BDF0/5E9DC1D1" Ref="#PWR0162"  Part="1" 
F 0 "#PWR038" H 7150 2600 50  0001 C CNN
F 1 "+5V" H 7165 2923 50  0000 C CNN
F 2 "" H 7150 2750 50  0001 C CNN
F 3 "" H 7150 2750 50  0001 C CNN
	1    7150 2750
	-1   0    0    -1  
$EndComp
Wire Wire Line
	5350 3150 5350 3200
Wire Wire Line
	7150 3150 7150 3200
$Comp
L Device:LED_Small D1
U 1 1 5E8B9130
P 5350 3300
AR Path="/5EA18958/5E8B9130" Ref="D1"  Part="1" 
AR Path="/5EAA23CE/5E8B9130" Ref="D5"  Part="1" 
AR Path="/5EA82760/5E8B9130" Ref="D3"  Part="1" 
AR Path="/5EAAB2C7/5E8B9130" Ref="D7"  Part="1" 
AR Path="/5EAB4190/5E8B9130" Ref="D9"  Part="1" 
AR Path="/5EABD095/5E8B9130" Ref="D11"  Part="1" 
AR Path="/5EAC5FAE/5E8B9130" Ref="D13"  Part="1" 
AR Path="/5EB6BDDE/5E8B9130" Ref="D15"  Part="1" 
AR Path="/5EB6BDE1/5E8B9130" Ref="D17"  Part="1" 
AR Path="/5EB6BDE4/5E8B9130" Ref="D19"  Part="1" 
AR Path="/5EB6BDE7/5E8B9130" Ref="D21"  Part="1" 
AR Path="/5EB6BDEA/5E8B9130" Ref="D23"  Part="1" 
AR Path="/5EB6BDED/5E8B9130" Ref="D25"  Part="1" 
AR Path="/5EB6BDF0/5E8B9130" Ref="D27"  Part="1" 
F 0 "D3" V 5400 3400 50  0000 L CNN
F 1 "IN-S124ARUW" V 5300 3400 50  0000 L CNN
F 2 "LEGOS:LED_1204_3212Metric_ReverseMount_Hole1.8x2.4mm" V 5350 3300 50  0001 C CNN
F 3 "http://inolux-corp.com/datasheet/SMDLED/Mono%20Color%20Reverse%20Mount/IN-S124AR%20Series_V1.0.pdf" V 5350 3300 50  0001 C CNN
	1    5350 3300
	0    1    -1   0   
$EndComp
Text Notes 7050 3450 2    39   ~ 0
20 mA max current
$Comp
L Device:C_Small C?
U 1 1 5EBE9084
P 4950 3050
AR Path="/5EBE9084" Ref="C?"  Part="1" 
AR Path="/5EA18958/5EBE9084" Ref="C6"  Part="1" 
AR Path="/5EA82760/5EBE9084" Ref="C8"  Part="1" 
AR Path="/5EAA23CE/5EBE9084" Ref="C10"  Part="1" 
AR Path="/5EAAB2C7/5EBE9084" Ref="C12"  Part="1" 
AR Path="/5EAB4190/5EBE9084" Ref="C14"  Part="1" 
AR Path="/5EABD095/5EBE9084" Ref="C16"  Part="1" 
AR Path="/5EAC5FAE/5EBE9084" Ref="C18"  Part="1" 
AR Path="/5EB6BDDE/5EBE9084" Ref="C25"  Part="1" 
AR Path="/5EB6BDE1/5EBE9084" Ref="C27"  Part="1" 
AR Path="/5EB6BDE4/5EBE9084" Ref="C29"  Part="1" 
AR Path="/5EB6BDE7/5EBE9084" Ref="C31"  Part="1" 
AR Path="/5EB6BDEA/5EBE9084" Ref="C33"  Part="1" 
AR Path="/5EB6BDED/5EBE9084" Ref="C35"  Part="1" 
AR Path="/5EB6BDF0/5EBE9084" Ref="C37"  Part="1" 
F 0 "C8" H 4900 3000 50  0000 R CNN
F 1 "1u" H 4900 3100 50  0000 R CNN
F 2 "Capacitor_SMD:C_0402_1005Metric" H 4950 3050 50  0001 C CNN
F 3 "~" H 4950 3050 50  0001 C CNN
	1    4950 3050
	1    0    0    1   
$EndComp
Wire Wire Line
	5350 2850 4950 2850
$Comp
L power:GND #PWR024
U 1 1 5EBE9213
P 4950 3150
AR Path="/5EA18958/5EBE9213" Ref="#PWR024"  Part="1" 
AR Path="/5EAA23CE/5EBE9213" Ref="#PWR040"  Part="1" 
AR Path="/5EA82760/5EBE9213" Ref="#PWR032"  Part="1" 
AR Path="/5EAAB2C7/5EBE9213" Ref="#PWR048"  Part="1" 
AR Path="/5EAB4190/5EBE9213" Ref="#PWR056"  Part="1" 
AR Path="/5EABD095/5EBE9213" Ref="#PWR064"  Part="1" 
AR Path="/5EAC5FAE/5EBE9213" Ref="#PWR072"  Part="1" 
AR Path="/5EB6BDDE/5EBE9213" Ref="#PWR0108"  Part="1" 
AR Path="/5EB6BDE1/5EBE9213" Ref="#PWR0116"  Part="1" 
AR Path="/5EB6BDE4/5EBE9213" Ref="#PWR0124"  Part="1" 
AR Path="/5EB6BDE7/5EBE9213" Ref="#PWR0132"  Part="1" 
AR Path="/5EB6BDEA/5EBE9213" Ref="#PWR0140"  Part="1" 
AR Path="/5EB6BDED/5EBE9213" Ref="#PWR0148"  Part="1" 
AR Path="/5EB6BDF0/5EBE9213" Ref="#PWR0156"  Part="1" 
F 0 "#PWR032" H 4950 2900 50  0001 C CNN
F 1 "GND" H 4955 2977 50  0000 C CNN
F 2 "" H 4950 3150 50  0001 C CNN
F 3 "" H 4950 3150 50  0001 C CNN
	1    4950 3150
	1    0    0    -1  
$EndComp
$Comp
L Device:C_Small C?
U 1 1 5EBEA0F9
P 6750 3050
AR Path="/5EBEA0F9" Ref="C?"  Part="1" 
AR Path="/5EA18958/5EBEA0F9" Ref="C7"  Part="1" 
AR Path="/5EA82760/5EBEA0F9" Ref="C9"  Part="1" 
AR Path="/5EAA23CE/5EBEA0F9" Ref="C11"  Part="1" 
AR Path="/5EAAB2C7/5EBEA0F9" Ref="C13"  Part="1" 
AR Path="/5EAB4190/5EBEA0F9" Ref="C15"  Part="1" 
AR Path="/5EABD095/5EBEA0F9" Ref="C17"  Part="1" 
AR Path="/5EAC5FAE/5EBEA0F9" Ref="C19"  Part="1" 
AR Path="/5EB6BDDE/5EBEA0F9" Ref="C26"  Part="1" 
AR Path="/5EB6BDE1/5EBEA0F9" Ref="C28"  Part="1" 
AR Path="/5EB6BDE4/5EBEA0F9" Ref="C30"  Part="1" 
AR Path="/5EB6BDE7/5EBEA0F9" Ref="C32"  Part="1" 
AR Path="/5EB6BDEA/5EBEA0F9" Ref="C34"  Part="1" 
AR Path="/5EB6BDED/5EBEA0F9" Ref="C36"  Part="1" 
AR Path="/5EB6BDF0/5EBEA0F9" Ref="C38"  Part="1" 
F 0 "C9" H 6700 3000 50  0000 R CNN
F 1 "1u" H 6700 3100 50  0000 R CNN
F 2 "Capacitor_SMD:C_0402_1005Metric" H 6750 3050 50  0001 C CNN
F 3 "~" H 6750 3050 50  0001 C CNN
	1    6750 3050
	1    0    0    1   
$EndComp
Wire Wire Line
	7150 2850 6750 2850
$Comp
L power:GND #PWR028
U 1 1 5EBEA100
P 6750 3150
AR Path="/5EA18958/5EBEA100" Ref="#PWR028"  Part="1" 
AR Path="/5EAA23CE/5EBEA100" Ref="#PWR044"  Part="1" 
AR Path="/5EA82760/5EBEA100" Ref="#PWR036"  Part="1" 
AR Path="/5EAAB2C7/5EBEA100" Ref="#PWR052"  Part="1" 
AR Path="/5EAB4190/5EBEA100" Ref="#PWR060"  Part="1" 
AR Path="/5EABD095/5EBEA100" Ref="#PWR068"  Part="1" 
AR Path="/5EAC5FAE/5EBEA100" Ref="#PWR076"  Part="1" 
AR Path="/5EB6BDDE/5EBEA100" Ref="#PWR0112"  Part="1" 
AR Path="/5EB6BDE1/5EBEA100" Ref="#PWR0120"  Part="1" 
AR Path="/5EB6BDE4/5EBEA100" Ref="#PWR0128"  Part="1" 
AR Path="/5EB6BDE7/5EBEA100" Ref="#PWR0136"  Part="1" 
AR Path="/5EB6BDEA/5EBEA100" Ref="#PWR0144"  Part="1" 
AR Path="/5EB6BDED/5EBEA100" Ref="#PWR0152"  Part="1" 
AR Path="/5EB6BDF0/5EBEA100" Ref="#PWR0160"  Part="1" 
F 0 "#PWR036" H 6750 2900 50  0001 C CNN
F 1 "GND" H 6755 2977 50  0000 C CNN
F 2 "" H 6750 3150 50  0001 C CNN
F 3 "" H 6750 3150 50  0001 C CNN
	1    6750 3150
	1    0    0    -1  
$EndComp
Wire Wire Line
	5350 2750 5350 2850
Connection ~ 5350 2850
Wire Wire Line
	5350 2850 5350 2950
Wire Wire Line
	7150 2750 7150 2850
Connection ~ 7150 2850
Wire Wire Line
	7150 2850 7150 2950
Wire Wire Line
	4950 2850 4950 2950
Wire Wire Line
	6750 2850 6750 2950
$Comp
L Device:Q_NMOS_GSD Q1
U 1 1 5EB6B95E
P 5250 3650
AR Path="/5EA18958/5EB6B95E" Ref="Q1"  Part="1" 
AR Path="/5EA82760/5EB6B95E" Ref="Q3"  Part="1" 
AR Path="/5EAA23CE/5EB6B95E" Ref="Q5"  Part="1" 
AR Path="/5EAAB2C7/5EB6B95E" Ref="Q7"  Part="1" 
AR Path="/5EAB4190/5EB6B95E" Ref="Q9"  Part="1" 
AR Path="/5EABD095/5EB6B95E" Ref="Q11"  Part="1" 
AR Path="/5EAC5FAE/5EB6B95E" Ref="Q13"  Part="1" 
AR Path="/5EB6BDDE/5EB6B95E" Ref="Q15"  Part="1" 
AR Path="/5EB6BDE1/5EB6B95E" Ref="Q17"  Part="1" 
AR Path="/5EB6BDE4/5EB6B95E" Ref="Q19"  Part="1" 
AR Path="/5EB6BDE7/5EB6B95E" Ref="Q21"  Part="1" 
AR Path="/5EB6BDEA/5EB6B95E" Ref="Q23"  Part="1" 
AR Path="/5EB6BDED/5EB6B95E" Ref="Q25"  Part="1" 
AR Path="/5EB6BDF0/5EB6B95E" Ref="Q27"  Part="1" 
F 0 "Q3" H 5455 3696 50  0000 L CNN
F 1 "2N7002WT1G" H 5455 3605 50  0000 L CNN
F 2 "Package_TO_SOT_SMD:SOT-323_SC-70" H 5450 3750 50  0001 C CNN
F 3 "https://www.mouser.de/datasheet/2/308/2N7002W_D-1710338.pdf" H 5250 3650 50  0001 C CNN
	1    5250 3650
	1    0    0    -1  
$EndComp
$Comp
L Device:R_Small R?
U 1 1 5EB6C97E
P 4950 3850
AR Path="/5EB6C97E" Ref="R?"  Part="1" 
AR Path="/5EA18958/5EB6C97E" Ref="R4"  Part="1" 
AR Path="/5EA547FD/5EB6C97E" Ref="R?"  Part="1" 
AR Path="/5EA82760/5EB6C97E" Ref="R8"  Part="1" 
AR Path="/5EAA23CE/5EB6C97E" Ref="R12"  Part="1" 
AR Path="/5EAAB2C7/5EB6C97E" Ref="R16"  Part="1" 
AR Path="/5EAB4190/5EB6C97E" Ref="R20"  Part="1" 
AR Path="/5EABD095/5EB6C97E" Ref="R24"  Part="1" 
AR Path="/5EAC5FAE/5EB6C97E" Ref="R28"  Part="1" 
AR Path="/5EAE10ED/5EB6C97E" Ref="R?"  Part="1" 
AR Path="/5EAEB561/5EB6C97E" Ref="R?"  Part="1" 
AR Path="/5EAEB564/5EB6C97E" Ref="R?"  Part="1" 
AR Path="/5EAEB567/5EB6C97E" Ref="R?"  Part="1" 
AR Path="/5EAEB56A/5EB6C97E" Ref="R?"  Part="1" 
AR Path="/5EAEB56D/5EB6C97E" Ref="R?"  Part="1" 
AR Path="/5EAEB570/5EB6C97E" Ref="R?"  Part="1" 
AR Path="/5EAEB573/5EB6C97E" Ref="R?"  Part="1" 
AR Path="/5EAEB576/5EB6C97E" Ref="R?"  Part="1" 
AR Path="/5EB6BDDE/5EB6C97E" Ref="R36"  Part="1" 
AR Path="/5EB6BDE1/5EB6C97E" Ref="R40"  Part="1" 
AR Path="/5EB6BDE4/5EB6C97E" Ref="R44"  Part="1" 
AR Path="/5EB6BDE7/5EB6C97E" Ref="R48"  Part="1" 
AR Path="/5EB6BDEA/5EB6C97E" Ref="R52"  Part="1" 
AR Path="/5EB6BDED/5EB6C97E" Ref="R56"  Part="1" 
AR Path="/5EB6BDF0/5EB6C97E" Ref="R60"  Part="1" 
F 0 "R8" H 5009 3896 50  0000 L CNN
F 1 "4.7k" H 5009 3805 50  0000 L CNN
F 2 "Resistor_SMD:R_0402_1005Metric" H 4950 3850 50  0001 C CNN
F 3 "~" H 4950 3850 50  0001 C CNN
	1    4950 3850
	-1   0    0    -1  
$EndComp
Wire Wire Line
	5350 3850 5350 4000
$Comp
L power:GND #PWR025
U 1 1 5EB6D31F
P 4950 4000
AR Path="/5EA18958/5EB6D31F" Ref="#PWR025"  Part="1" 
AR Path="/5EAA23CE/5EB6D31F" Ref="#PWR041"  Part="1" 
AR Path="/5EA82760/5EB6D31F" Ref="#PWR033"  Part="1" 
AR Path="/5EAAB2C7/5EB6D31F" Ref="#PWR049"  Part="1" 
AR Path="/5EAB4190/5EB6D31F" Ref="#PWR057"  Part="1" 
AR Path="/5EABD095/5EB6D31F" Ref="#PWR065"  Part="1" 
AR Path="/5EAC5FAE/5EB6D31F" Ref="#PWR073"  Part="1" 
AR Path="/5EB6BDDE/5EB6D31F" Ref="#PWR0109"  Part="1" 
AR Path="/5EB6BDE1/5EB6D31F" Ref="#PWR0117"  Part="1" 
AR Path="/5EB6BDE4/5EB6D31F" Ref="#PWR0125"  Part="1" 
AR Path="/5EB6BDE7/5EB6D31F" Ref="#PWR0133"  Part="1" 
AR Path="/5EB6BDEA/5EB6D31F" Ref="#PWR0141"  Part="1" 
AR Path="/5EB6BDED/5EB6D31F" Ref="#PWR0149"  Part="1" 
AR Path="/5EB6BDF0/5EB6D31F" Ref="#PWR0157"  Part="1" 
F 0 "#PWR033" H 4950 3750 50  0001 C CNN
F 1 "GND" H 4955 3827 50  0000 C CNN
F 2 "" H 4950 4000 50  0001 C CNN
F 3 "" H 4950 4000 50  0001 C CNN
	1    4950 4000
	1    0    0    -1  
$EndComp
Wire Wire Line
	4950 3950 4950 4000
Wire Wire Line
	5050 3650 4950 3650
Wire Wire Line
	4950 3650 4950 3750
Wire Wire Line
	4950 3650 4850 3650
Connection ~ 4950 3650
Text HLabel 6650 3650 0    50   Input ~ 0
PWM
$Comp
L power:GND #PWR031
U 1 1 5EB72949
P 7150 4000
AR Path="/5EA18958/5EB72949" Ref="#PWR031"  Part="1" 
AR Path="/5EAA23CE/5EB72949" Ref="#PWR047"  Part="1" 
AR Path="/5EA82760/5EB72949" Ref="#PWR039"  Part="1" 
AR Path="/5EAAB2C7/5EB72949" Ref="#PWR055"  Part="1" 
AR Path="/5EAB4190/5EB72949" Ref="#PWR063"  Part="1" 
AR Path="/5EABD095/5EB72949" Ref="#PWR071"  Part="1" 
AR Path="/5EAC5FAE/5EB72949" Ref="#PWR079"  Part="1" 
AR Path="/5EB6BDDE/5EB72949" Ref="#PWR0115"  Part="1" 
AR Path="/5EB6BDE1/5EB72949" Ref="#PWR0123"  Part="1" 
AR Path="/5EB6BDE4/5EB72949" Ref="#PWR0131"  Part="1" 
AR Path="/5EB6BDE7/5EB72949" Ref="#PWR0139"  Part="1" 
AR Path="/5EB6BDEA/5EB72949" Ref="#PWR0147"  Part="1" 
AR Path="/5EB6BDED/5EB72949" Ref="#PWR0155"  Part="1" 
AR Path="/5EB6BDF0/5EB72949" Ref="#PWR0163"  Part="1" 
F 0 "#PWR039" H 7150 3750 50  0001 C CNN
F 1 "GND" H 7155 3827 50  0000 C CNN
F 2 "" H 7150 4000 50  0001 C CNN
F 3 "" H 7150 4000 50  0001 C CNN
	1    7150 4000
	1    0    0    -1  
$EndComp
$Comp
L Device:R_Small R?
U 1 1 5EB72956
P 6750 3850
AR Path="/5EB72956" Ref="R?"  Part="1" 
AR Path="/5EA18958/5EB72956" Ref="R6"  Part="1" 
AR Path="/5EA547FD/5EB72956" Ref="R?"  Part="1" 
AR Path="/5EA82760/5EB72956" Ref="R10"  Part="1" 
AR Path="/5EAA23CE/5EB72956" Ref="R14"  Part="1" 
AR Path="/5EAAB2C7/5EB72956" Ref="R18"  Part="1" 
AR Path="/5EAB4190/5EB72956" Ref="R22"  Part="1" 
AR Path="/5EABD095/5EB72956" Ref="R26"  Part="1" 
AR Path="/5EAC5FAE/5EB72956" Ref="R30"  Part="1" 
AR Path="/5EAE10ED/5EB72956" Ref="R?"  Part="1" 
AR Path="/5EAEB561/5EB72956" Ref="R?"  Part="1" 
AR Path="/5EAEB564/5EB72956" Ref="R?"  Part="1" 
AR Path="/5EAEB567/5EB72956" Ref="R?"  Part="1" 
AR Path="/5EAEB56A/5EB72956" Ref="R?"  Part="1" 
AR Path="/5EAEB56D/5EB72956" Ref="R?"  Part="1" 
AR Path="/5EAEB570/5EB72956" Ref="R?"  Part="1" 
AR Path="/5EAEB573/5EB72956" Ref="R?"  Part="1" 
AR Path="/5EAEB576/5EB72956" Ref="R?"  Part="1" 
AR Path="/5EB6BDDE/5EB72956" Ref="R38"  Part="1" 
AR Path="/5EB6BDE1/5EB72956" Ref="R42"  Part="1" 
AR Path="/5EB6BDE4/5EB72956" Ref="R46"  Part="1" 
AR Path="/5EB6BDE7/5EB72956" Ref="R50"  Part="1" 
AR Path="/5EB6BDEA/5EB72956" Ref="R54"  Part="1" 
AR Path="/5EB6BDED/5EB72956" Ref="R58"  Part="1" 
AR Path="/5EB6BDF0/5EB72956" Ref="R62"  Part="1" 
F 0 "R10" H 6809 3896 50  0000 L CNN
F 1 "4.7k" H 6809 3805 50  0000 L CNN
F 2 "Resistor_SMD:R_0402_1005Metric" H 6750 3850 50  0001 C CNN
F 3 "~" H 6750 3850 50  0001 C CNN
	1    6750 3850
	-1   0    0    -1  
$EndComp
Wire Wire Line
	7150 3850 7150 4000
$Comp
L power:GND #PWR029
U 1 1 5EB7295D
P 6750 4000
AR Path="/5EA18958/5EB7295D" Ref="#PWR029"  Part="1" 
AR Path="/5EAA23CE/5EB7295D" Ref="#PWR045"  Part="1" 
AR Path="/5EA82760/5EB7295D" Ref="#PWR037"  Part="1" 
AR Path="/5EAAB2C7/5EB7295D" Ref="#PWR053"  Part="1" 
AR Path="/5EAB4190/5EB7295D" Ref="#PWR061"  Part="1" 
AR Path="/5EABD095/5EB7295D" Ref="#PWR069"  Part="1" 
AR Path="/5EAC5FAE/5EB7295D" Ref="#PWR077"  Part="1" 
AR Path="/5EB6BDDE/5EB7295D" Ref="#PWR0113"  Part="1" 
AR Path="/5EB6BDE1/5EB7295D" Ref="#PWR0121"  Part="1" 
AR Path="/5EB6BDE4/5EB7295D" Ref="#PWR0129"  Part="1" 
AR Path="/5EB6BDE7/5EB7295D" Ref="#PWR0137"  Part="1" 
AR Path="/5EB6BDEA/5EB7295D" Ref="#PWR0145"  Part="1" 
AR Path="/5EB6BDED/5EB7295D" Ref="#PWR0153"  Part="1" 
AR Path="/5EB6BDF0/5EB7295D" Ref="#PWR0161"  Part="1" 
F 0 "#PWR037" H 6750 3750 50  0001 C CNN
F 1 "GND" H 6755 3827 50  0000 C CNN
F 2 "" H 6750 4000 50  0001 C CNN
F 3 "" H 6750 4000 50  0001 C CNN
	1    6750 4000
	1    0    0    -1  
$EndComp
Wire Wire Line
	6750 3950 6750 4000
Wire Wire Line
	6850 3650 6750 3650
Wire Wire Line
	6750 3650 6750 3750
Wire Wire Line
	6750 3650 6650 3650
Connection ~ 6750 3650
$Comp
L Device:Q_NMOS_GSD Q2
U 1 1 5EB72D09
P 7050 3650
AR Path="/5EA18958/5EB72D09" Ref="Q2"  Part="1" 
AR Path="/5EA82760/5EB72D09" Ref="Q4"  Part="1" 
AR Path="/5EAA23CE/5EB72D09" Ref="Q6"  Part="1" 
AR Path="/5EAAB2C7/5EB72D09" Ref="Q8"  Part="1" 
AR Path="/5EAB4190/5EB72D09" Ref="Q10"  Part="1" 
AR Path="/5EABD095/5EB72D09" Ref="Q12"  Part="1" 
AR Path="/5EAC5FAE/5EB72D09" Ref="Q14"  Part="1" 
AR Path="/5EB6BDDE/5EB72D09" Ref="Q16"  Part="1" 
AR Path="/5EB6BDE1/5EB72D09" Ref="Q18"  Part="1" 
AR Path="/5EB6BDE4/5EB72D09" Ref="Q20"  Part="1" 
AR Path="/5EB6BDE7/5EB72D09" Ref="Q22"  Part="1" 
AR Path="/5EB6BDEA/5EB72D09" Ref="Q24"  Part="1" 
AR Path="/5EB6BDED/5EB72D09" Ref="Q26"  Part="1" 
AR Path="/5EB6BDF0/5EB72D09" Ref="Q28"  Part="1" 
F 0 "Q4" H 7255 3696 50  0000 L CNN
F 1 "2N7002WT1G" H 7255 3605 50  0000 L CNN
F 2 "Package_TO_SOT_SMD:SOT-323_SC-70" H 7250 3750 50  0001 C CNN
F 3 "https://www.mouser.de/datasheet/2/308/2N7002W_D-1710338.pdf" H 7050 3650 50  0001 C CNN
	1    7050 3650
	1    0    0    -1  
$EndComp
$Comp
L Device:LED_Small D2
U 1 1 5E8B65DD
P 7150 3300
AR Path="/5EA18958/5E8B65DD" Ref="D2"  Part="1" 
AR Path="/5EAA23CE/5E8B65DD" Ref="D6"  Part="1" 
AR Path="/5EA82760/5E8B65DD" Ref="D4"  Part="1" 
AR Path="/5EAAB2C7/5E8B65DD" Ref="D8"  Part="1" 
AR Path="/5EAB4190/5E8B65DD" Ref="D10"  Part="1" 
AR Path="/5EABD095/5E8B65DD" Ref="D12"  Part="1" 
AR Path="/5EAC5FAE/5E8B65DD" Ref="D14"  Part="1" 
AR Path="/5EB6BDDE/5E8B65DD" Ref="D16"  Part="1" 
AR Path="/5EB6BDE1/5E8B65DD" Ref="D18"  Part="1" 
AR Path="/5EB6BDE4/5E8B65DD" Ref="D20"  Part="1" 
AR Path="/5EB6BDE7/5E8B65DD" Ref="D22"  Part="1" 
AR Path="/5EB6BDEA/5E8B65DD" Ref="D24"  Part="1" 
AR Path="/5EB6BDED/5E8B65DD" Ref="D26"  Part="1" 
AR Path="/5EB6BDF0/5E8B65DD" Ref="D28"  Part="1" 
F 0 "D4" V 7196 3398 50  0000 L CNN
F 1 "IN-S124ARUW" V 7105 3398 50  0000 L CNN
F 2 "LEGOS:LED_1204_3212Metric_ReverseMount_Hole1.8x2.4mm" V 7150 3300 50  0001 C CNN
F 3 "http://inolux-corp.com/datasheet/SMDLED/Mono%20Color%20Reverse%20Mount/IN-S124AR%20Series_V1.0.pdf" V 7150 3300 50  0001 C CNN
	1    7150 3300
	0    1    -1   0   
$EndComp
$Comp
L Device:R_Small R?
U 1 1 5E876508
P 7150 3050
AR Path="/5E876508" Ref="R?"  Part="1" 
AR Path="/5EA18958/5E876508" Ref="R7"  Part="1" 
AR Path="/5EA547FD/5E876508" Ref="R?"  Part="1" 
AR Path="/5EA82760/5E876508" Ref="R11"  Part="1" 
AR Path="/5EAA23CE/5E876508" Ref="R15"  Part="1" 
AR Path="/5EAAB2C7/5E876508" Ref="R19"  Part="1" 
AR Path="/5EAB4190/5E876508" Ref="R23"  Part="1" 
AR Path="/5EABD095/5E876508" Ref="R27"  Part="1" 
AR Path="/5EAC5FAE/5E876508" Ref="R31"  Part="1" 
AR Path="/5EAE10ED/5E876508" Ref="R?"  Part="1" 
AR Path="/5EAEB561/5E876508" Ref="R?"  Part="1" 
AR Path="/5EAEB564/5E876508" Ref="R?"  Part="1" 
AR Path="/5EAEB567/5E876508" Ref="R?"  Part="1" 
AR Path="/5EAEB56A/5E876508" Ref="R?"  Part="1" 
AR Path="/5EAEB56D/5E876508" Ref="R?"  Part="1" 
AR Path="/5EAEB570/5E876508" Ref="R?"  Part="1" 
AR Path="/5EAEB573/5E876508" Ref="R?"  Part="1" 
AR Path="/5EAEB576/5E876508" Ref="R?"  Part="1" 
AR Path="/5EB6BDDE/5E876508" Ref="R39"  Part="1" 
AR Path="/5EB6BDE1/5E876508" Ref="R43"  Part="1" 
AR Path="/5EB6BDE4/5E876508" Ref="R47"  Part="1" 
AR Path="/5EB6BDE7/5E876508" Ref="R51"  Part="1" 
AR Path="/5EB6BDEA/5E876508" Ref="R55"  Part="1" 
AR Path="/5EB6BDED/5E876508" Ref="R59"  Part="1" 
AR Path="/5EB6BDF0/5E876508" Ref="R63"  Part="1" 
F 0 "R11" H 7209 3096 50  0000 L CNN
F 1 "80R" H 7209 3005 50  0000 L CNN
F 2 "Resistor_SMD:R_0402_1005Metric" H 7150 3050 50  0001 C CNN
F 3 "~" H 7150 3050 50  0001 C CNN
	1    7150 3050
	-1   0    0    -1  
$EndComp
$Comp
L Device:R_Small R?
U 1 1 5E880C5A
P 5350 3050
AR Path="/5E880C5A" Ref="R?"  Part="1" 
AR Path="/5EA18958/5E880C5A" Ref="R5"  Part="1" 
AR Path="/5EA547FD/5E880C5A" Ref="R?"  Part="1" 
AR Path="/5EA82760/5E880C5A" Ref="R9"  Part="1" 
AR Path="/5EAA23CE/5E880C5A" Ref="R13"  Part="1" 
AR Path="/5EAAB2C7/5E880C5A" Ref="R17"  Part="1" 
AR Path="/5EAB4190/5E880C5A" Ref="R21"  Part="1" 
AR Path="/5EABD095/5E880C5A" Ref="R25"  Part="1" 
AR Path="/5EAC5FAE/5E880C5A" Ref="R29"  Part="1" 
AR Path="/5EAE10ED/5E880C5A" Ref="R?"  Part="1" 
AR Path="/5EAEB561/5E880C5A" Ref="R?"  Part="1" 
AR Path="/5EAEB564/5E880C5A" Ref="R?"  Part="1" 
AR Path="/5EAEB567/5E880C5A" Ref="R?"  Part="1" 
AR Path="/5EAEB56A/5E880C5A" Ref="R?"  Part="1" 
AR Path="/5EAEB56D/5E880C5A" Ref="R?"  Part="1" 
AR Path="/5EAEB570/5E880C5A" Ref="R?"  Part="1" 
AR Path="/5EAEB573/5E880C5A" Ref="R?"  Part="1" 
AR Path="/5EAEB576/5E880C5A" Ref="R?"  Part="1" 
AR Path="/5EB6BDDE/5E880C5A" Ref="R37"  Part="1" 
AR Path="/5EB6BDE1/5E880C5A" Ref="R41"  Part="1" 
AR Path="/5EB6BDE4/5E880C5A" Ref="R45"  Part="1" 
AR Path="/5EB6BDE7/5E880C5A" Ref="R49"  Part="1" 
AR Path="/5EB6BDEA/5E880C5A" Ref="R53"  Part="1" 
AR Path="/5EB6BDED/5E880C5A" Ref="R57"  Part="1" 
AR Path="/5EB6BDF0/5E880C5A" Ref="R61"  Part="1" 
F 0 "R9" H 5409 3096 50  0000 L CNN
F 1 "80R" H 5409 3005 50  0000 L CNN
F 2 "Resistor_SMD:R_0402_1005Metric" H 5350 3050 50  0001 C CNN
F 3 "~" H 5350 3050 50  0001 C CNN
	1    5350 3050
	-1   0    0    -1  
$EndComp
$EndSCHEMATC
