EESchema Schematic File Version 4
EELAYER 30 0
EELAYER END
$Descr A4 11693 8268
encoding utf-8
Sheet 1 2
Title "Power Regulation - Master"
Date "2020-08-20"
Rev "1.0"
Comp "Institute for Automation of Complex Power Systems - E.ON ERC - RWTH Aachen University"
Comment1 "Designer: D.Wienands, S.Melcher, L.Jeske, D.Moll"
Comment2 "Supervisor: C. Guarnieri Calò Carducci"
Comment3 ""
Comment4 ""
$EndDescr
Wire Wire Line
	5250 5350 5200 5350
Wire Wire Line
	5200 5150 5550 5150
$Comp
L power:GND #PWR?
U 1 1 5F577414
P 5550 5750
F 0 "#PWR?" H 5550 5500 50  0001 C CNN
F 1 "GND" H 5555 5577 50  0000 C CNN
F 2 "" H 5550 5750 50  0001 C CNN
F 3 "" H 5550 5750 50  0001 C CNN
	1    5550 5750
	-1   0    0    -1  
$EndComp
Wire Wire Line
	5550 5650 5550 5750
$Comp
L Device:C_Small C?
U 1 1 5F5748B8
P 5550 5550
F 0 "C?" H 5450 5525 39  0000 R CNN
F 1 "100p" H 5450 5600 39  0000 R CNN
F 2 "Capacitor_SMD:C_0603_1608Metric" H 5550 5550 50  0001 C CNN
F 3 "~" H 5550 5550 50  0001 C CNN
	1    5550 5550
	-1   0    0    1   
$EndComp
$Comp
L power:GND #PWR?
U 1 1 5F56E42D
P 5250 5750
F 0 "#PWR?" H 5250 5500 50  0001 C CNN
F 1 "GND" H 5255 5577 50  0000 C CNN
F 2 "" H 5250 5750 50  0001 C CNN
F 3 "" H 5250 5750 50  0001 C CNN
	1    5250 5750
	-1   0    0    -1  
$EndComp
Wire Wire Line
	5250 5650 5250 5750
Wire Wire Line
	5250 5350 5250 5450
$Comp
L Device:R_Small R?
U 1 1 5F5634DF
P 5250 5550
AR Path="/5F011FA8/5F128218/5F5634DF" Ref="R?"  Part="1" 
AR Path="/5F46DFE3/5F5634DF" Ref="R?"  Part="1" 
AR Path="/5F011FA8/5F4BF641/5F5634DF" Ref="R?"  Part="1" 
AR Path="/5ECB7EC7/5F4BF641/5F5634DF" Ref="R?"  Part="1" 
AR Path="/5ECB7EC7/5F5634DF" Ref="R?"  Part="1" 
AR Path="/5F5634DF" Ref="R?"  Part="1" 
F 0 "R?" H 5309 5588 39  0000 L CNN
F 1 "30k" H 5309 5513 39  0000 L CNN
F 2 "Resistor_SMD:R_0603_1608Metric" H 5250 5550 50  0001 C CNN
F 3 "~" H 5250 5550 50  0001 C CNN
	1    5250 5550
	1    0    0    -1  
$EndComp
$Comp
L LEGOS:LT3081R U?
U 1 1 5F5454B0
P 5650 3700
F 0 "U?" H 5650 4190 50  0000 C CNN
F 1 "LT3081R" H 5650 4099 50  0000 C CNN
F 2 "Package_TO_SOT_SMD:TO-263-7_TabPin4" H 5650 3700 50  0001 C CNN
F 3 "https://www.analog.com/media/en/technical-documentation/data-sheets/3081fc.pdf" H 5650 3700 50  0001 C CNN
	1    5650 3700
	1    0    0    -1  
$EndComp
Wire Wire Line
	5050 4200 5050 4100
Wire Wire Line
	5300 4200 5300 4100
Text Label 5050 4200 0    39   ~ 0
MON
Text Label 5300 4200 0    39   ~ 0
TEMP
Text Label 5550 4200 0    39   ~ 0
SET
Text Label 6100 4200 0    39   ~ 0
LIM
Connection ~ 4850 2300
Wire Wire Line
	4850 2300 4850 3450
Text Label 6100 3050 0    39   ~ 0
LIM
Text Label 5550 3050 0    39   ~ 0
SET
Text Label 5300 3050 0    39   ~ 0
TEMP
Text Label 5050 3050 0    39   ~ 0
MON
Wire Wire Line
	6100 2950 6100 3050
Wire Wire Line
	5550 3050 5550 2950
Wire Wire Line
	5300 3050 5300 2950
Wire Wire Line
	5050 3050 5050 2950
Connection ~ 4700 4750
$Comp
L LEGOS:AD8400ARZ1 U?
U 1 1 5ECF02F9
P 4700 5150
F 0 "U?" H 4350 4700 50  0000 C CNN
F 1 "AD8400ARZ10" H 4350 4600 50  0000 C CNN
F 2 "Package_SO:SOIC-8_3.9x4.9mm_P1.27mm" H 4700 4550 50  0001 C CNN
F 3 "https://www.analog.com/media/en/technical-documentation/data-sheets/AD8400_8402_8403.pdf" H 4250 5550 50  0001 C CNN
	1    4700 5150
	1    0    0    -1  
$EndComp
$Comp
L power:GND #PWR?
U 1 1 5ECF02FF
P 4700 5750
F 0 "#PWR?" H 4700 5500 50  0001 C CNN
F 1 "GND" H 4705 5577 50  0000 C CNN
F 2 "" H 4700 5750 50  0001 C CNN
F 3 "" H 4700 5750 50  0001 C CNN
	1    4700 5750
	-1   0    0    -1  
$EndComp
Wire Wire Line
	4700 5650 4700 5750
NoConn ~ 5200 4950
Wire Wire Line
	3800 5250 3800 5350
$Comp
L power:GND #PWR?
U 1 1 5ECFCB30
P 3800 5350
F 0 "#PWR?" H 3800 5100 50  0001 C CNN
F 1 "GND" H 3805 5177 50  0000 C CNN
F 2 "" H 3800 5350 50  0001 C CNN
F 3 "" H 3800 5350 50  0001 C CNN
	1    3800 5350
	1    0    0    -1  
$EndComp
$Comp
L Device:C_Small C?
U 1 1 5ECFCB29
P 3800 5150
F 0 "C?" H 3750 5100 39  0000 R CNN
F 1 "100n" H 3800 5200 39  0000 R CNN
F 2 "Capacitor_SMD:C_0603_1608Metric" H 3800 5150 50  0001 C CNN
F 3 "~" H 3800 5150 50  0001 C CNN
	1    3800 5150
	-1   0    0    1   
$EndComp
$Comp
L power:+5V #PWR?
U 1 1 5F0D91D6
P 4700 4750
F 0 "#PWR?" H 4700 4600 50  0001 C CNN
F 1 "+5V" H 4715 4923 50  0000 C CNN
F 2 "" H 4700 4750 50  0001 C CNN
F 3 "" H 4700 4750 50  0001 C CNN
	1    4700 4750
	1    0    0    -1  
$EndComp
Wire Wire Line
	4700 4750 3800 4750
Wire Wire Line
	3800 4750 3800 5050
Text GLabel 4200 4950 0    39   Input ~ 0
MOSI
Text GLabel 4200 5150 0    39   Input ~ 0
CLK
Text HLabel 3450 2000 0    50   Input ~ 0
~IRQ
Wire Wire Line
	6900 2000 6900 2750
Wire Wire Line
	4100 2000 6900 2000
Wire Wire Line
	4100 2300 4700 2300
Connection ~ 7250 2750
Wire Wire Line
	7550 2750 7250 2750
Wire Wire Line
	3450 2000 3550 2000
Wire Wire Line
	3450 2300 3550 2300
Wire Wire Line
	3450 2150 3550 2150
$Comp
L power:+3.3V #PWR?
U 1 1 5F4D12AF
P 3450 2300
AR Path="/5F011FA8/5F128218/5F4D12AF" Ref="#PWR?"  Part="1" 
AR Path="/5F46DFE3/5F4D12AF" Ref="#PWR?"  Part="1" 
AR Path="/5F011FA8/5F4BF641/5F4D12AF" Ref="#PWR?"  Part="1" 
AR Path="/5F011FA8/5F4D12AF" Ref="#PWR?"  Part="1" 
AR Path="/5F4D12AF" Ref="#PWR?"  Part="1" 
AR Path="/5ECB7EC7/5F4D12AF" Ref="#PWR?"  Part="1" 
F 0 "#PWR?" H 3450 2150 50  0001 C CNN
F 1 "+3.3V" V 3450 2550 50  0000 C CNN
F 2 "" H 3450 2300 50  0001 C CNN
F 3 "" H 3450 2300 50  0001 C CNN
	1    3450 2300
	0    -1   -1   0   
$EndComp
$Comp
L power:GND #PWR?
U 1 1 5F4CE682
P 3450 2150
F 0 "#PWR?" H 3450 1900 50  0001 C CNN
F 1 "GND" V 3450 1950 50  0000 C CNN
F 2 "" H 3450 2150 50  0001 C CNN
F 3 "" H 3450 2150 50  0001 C CNN
	1    3450 2150
	0    1    -1   0   
$EndComp
Connection ~ 6900 2750
Wire Wire Line
	7250 2750 6900 2750
Wire Wire Line
	4100 2150 4200 2150
$Sheet
S 3550 1900 550  500 
U 5F4BF641
F0 "TelemetryExt" 39
F1 "sub_telemetry.sch" 39
F2 "VCOM" I R 4100 2000 39 
F3 "V+" I R 4100 2150 39 
F4 "V-" I R 4100 2300 39 
F5 "~IRQ" O L 3550 2000 39 
F6 "A1" I L 3550 2150 39 
F7 "A0" I L 3550 2300 39 
$EndSheet
Text HLabel 4200 2150 2    50   Input ~ 0
VIN
Text HLabel 7550 2750 2    50   Output ~ 0
VOUT
$Comp
L Device:CP_Small C?
U 1 1 5F434D08
P 7250 3150
F 0 "C?" H 7100 3200 39  0000 L CNN
F 1 "100u" H 7025 3125 39  0000 L CNN
F 2 "Capacitor_Tantalum_SMD:CP_EIA-3528-21_Kemet-B" H 7250 3150 50  0001 C CNN
F 3 "https://eu.mouser.com/datasheet/2/212/1/KEM_T2050_T491_AUTO-1093567.pdf" H 7250 3150 50  0001 C CNN
F 4 "T491B107M006ATAUTO" H 7250 3150 50  0001 C CNN "Mfr"
	1    7250 3150
	1    0    0    -1  
$EndComp
Wire Wire Line
	4700 2300 4850 2300
Connection ~ 4700 2300
$Comp
L Device:CP_Small C?
U 1 1 5F425B4E
P 4700 2500
F 0 "C?" H 4550 2550 39  0000 L CNN
F 1 "100u" H 4475 2475 39  0000 L CNN
F 2 "Capacitor_Tantalum_SMD:CP_EIA-3528-21_Kemet-B" H 4700 2500 50  0001 C CNN
F 3 "https://eu.mouser.com/datasheet/2/212/1/KEM_T2050_T491_AUTO-1093567.pdf" H 4700 2500 50  0001 C CNN
F 4 "T491B107M006ATAUTO" H 4700 2500 50  0001 C CNN "Mfr"
	1    4700 2500
	1    0    0    -1  
$EndComp
Wire Wire Line
	4700 2300 4700 2400
$Comp
L power:GND #PWR?
U 1 1 5F41E135
P 4700 2700
F 0 "#PWR?" H 4700 2450 50  0001 C CNN
F 1 "GND" H 4705 2527 50  0000 C CNN
F 2 "" H 4700 2700 50  0001 C CNN
F 3 "" H 4700 2700 50  0001 C CNN
	1    4700 2700
	1    0    0    -1  
$EndComp
Wire Wire Line
	4700 2600 4700 2700
$Comp
L LEGOS:LT3081R U?
U 1 1 5F3F89C6
P 5650 2550
F 0 "U?" H 5650 3040 50  0000 C CNN
F 1 "LT3081R" H 5650 2949 50  0000 C CNN
F 2 "Package_TO_SOT_SMD:TO-263-7_TabPin4" H 5650 2550 50  0001 C CNN
F 3 "https://www.analog.com/media/en/technical-documentation/data-sheets/3081fc.pdf" H 5650 2550 50  0001 C CNN
	1    5650 2550
	1    0    0    -1  
$EndComp
Wire Wire Line
	7250 3050 7250 2750
$Comp
L power:GND #PWR?
U 1 1 5ED52544
P 7250 3400
F 0 "#PWR?" H 7250 3150 50  0001 C CNN
F 1 "GND" H 7255 3227 50  0000 C CNN
F 2 "" H 7250 3400 50  0001 C CNN
F 3 "" H 7250 3400 50  0001 C CNN
	1    7250 3400
	1    0    0    -1  
$EndComp
Wire Wire Line
	7250 3250 7250 3400
Text HLabel 4200 5350 0    50   Input ~ 0
~CS_V
Wire Wire Line
	5550 4100 5550 5150
$Comp
L Device:R_Small R?
U 1 1 5F597171
P 6100 4650
AR Path="/5F011FA8/5F128218/5F597171" Ref="R?"  Part="1" 
AR Path="/5F46DFE3/5F597171" Ref="R?"  Part="1" 
AR Path="/5F011FA8/5F4BF641/5F597171" Ref="R?"  Part="1" 
AR Path="/5ECB7EC7/5F4BF641/5F597171" Ref="R?"  Part="1" 
AR Path="/5ECB7EC7/5F597171" Ref="R?"  Part="1" 
AR Path="/5F597171" Ref="R?"  Part="1" 
F 0 "R?" H 6159 4688 39  0000 L CNN
F 1 "1.3k" H 6159 4613 39  0000 L CNN
F 2 "Resistor_SMD:R_0603_1608Metric" H 6100 4650 50  0001 C CNN
F 3 "~" H 6100 4650 50  0001 C CNN
	1    6100 4650
	-1   0    0    -1  
$EndComp
Connection ~ 6850 4750
$Comp
L LEGOS:AD8400ARZ1 U?
U 1 1 5F597178
P 6850 5150
F 0 "U?" H 6500 4700 50  0000 C CNN
F 1 "AD8400ARZ1" H 6500 4600 50  0000 C CNN
F 2 "Package_SO:SOIC-8_3.9x4.9mm_P1.27mm" H 6850 4550 50  0001 C CNN
F 3 "https://www.analog.com/media/en/technical-documentation/data-sheets/AD8400_8402_8403.pdf" H 6400 5550 50  0001 C CNN
	1    6850 5150
	-1   0    0    -1  
$EndComp
$Comp
L power:GND #PWR?
U 1 1 5F59717E
P 6850 5750
F 0 "#PWR?" H 6850 5500 50  0001 C CNN
F 1 "GND" H 6855 5577 50  0000 C CNN
F 2 "" H 6850 5750 50  0001 C CNN
F 3 "" H 6850 5750 50  0001 C CNN
	1    6850 5750
	1    0    0    -1  
$EndComp
Wire Wire Line
	6850 5650 6850 5750
NoConn ~ 6350 4950
Wire Wire Line
	7750 5250 7750 5350
$Comp
L power:GND #PWR?
U 1 1 5F597187
P 7750 5350
F 0 "#PWR?" H 7750 5100 50  0001 C CNN
F 1 "GND" H 7755 5177 50  0000 C CNN
F 2 "" H 7750 5350 50  0001 C CNN
F 3 "" H 7750 5350 50  0001 C CNN
	1    7750 5350
	-1   0    0    -1  
$EndComp
$Comp
L Device:C_Small C?
U 1 1 5F59718D
P 7750 5150
F 0 "C?" H 7700 5100 39  0000 R CNN
F 1 "100n" H 7750 5200 39  0000 R CNN
F 2 "Capacitor_SMD:C_0603_1608Metric" H 7750 5150 50  0001 C CNN
F 3 "~" H 7750 5150 50  0001 C CNN
	1    7750 5150
	1    0    0    1   
$EndComp
$Comp
L power:+5V #PWR?
U 1 1 5F597193
P 6850 4750
F 0 "#PWR?" H 6850 4600 50  0001 C CNN
F 1 "+5V" H 6865 4923 50  0000 C CNN
F 2 "" H 6850 4750 50  0001 C CNN
F 3 "" H 6850 4750 50  0001 C CNN
	1    6850 4750
	-1   0    0    -1  
$EndComp
Wire Wire Line
	6850 4750 7750 4750
Wire Wire Line
	7750 4750 7750 5050
Text GLabel 7350 4950 2    39   Input ~ 0
MOSI
Text GLabel 7350 5150 2    39   Input ~ 0
CLK
Text HLabel 7350 5350 2    50   Input ~ 0
~CS_I
Wire Wire Line
	6100 4100 6100 4550
Wire Wire Line
	6100 5350 6350 5350
Wire Wire Line
	6350 5150 6250 5150
Wire Wire Line
	6900 2750 6900 3900
Wire Wire Line
	6450 3900 6900 3900
Wire Wire Line
	6450 2750 6900 2750
Text Label 7250 2750 2    39   ~ 0
OUT
Text Label 6250 5150 0    39   ~ 0
OUT
$Comp
L Device:R_Small R?
U 1 1 5F5AD52E
P 5300 4300
AR Path="/5F011FA8/5F128218/5F5AD52E" Ref="R?"  Part="1" 
AR Path="/5F46DFE3/5F5AD52E" Ref="R?"  Part="1" 
AR Path="/5F011FA8/5F4BF641/5F5AD52E" Ref="R?"  Part="1" 
AR Path="/5ECB7EC7/5F4BF641/5F5AD52E" Ref="R?"  Part="1" 
AR Path="/5ECB7EC7/5F5AD52E" Ref="R?"  Part="1" 
AR Path="/5F5AD52E" Ref="R?"  Part="1" 
F 0 "R?" H 5359 4338 39  0000 L CNN
F 1 "5k" H 5359 4263 39  0000 L CNN
F 2 "Resistor_SMD:R_0603_1608Metric" H 5300 4300 50  0001 C CNN
F 3 "~" H 5300 4300 50  0001 C CNN
	1    5300 4300
	-1   0    0    -1  
$EndComp
$Comp
L power:GND #PWR?
U 1 1 5F5AEF72
P 5300 4500
F 0 "#PWR?" H 5300 4250 50  0001 C CNN
F 1 "GND" H 5305 4327 50  0000 C CNN
F 2 "" H 5300 4500 50  0001 C CNN
F 3 "" H 5300 4500 50  0001 C CNN
	1    5300 4500
	-1   0    0    -1  
$EndComp
Wire Wire Line
	5300 4400 5300 4500
$Comp
L Device:R_Small R?
U 1 1 5F5B16BE
P 5050 4300
AR Path="/5F011FA8/5F128218/5F5B16BE" Ref="R?"  Part="1" 
AR Path="/5F46DFE3/5F5B16BE" Ref="R?"  Part="1" 
AR Path="/5F011FA8/5F4BF641/5F5B16BE" Ref="R?"  Part="1" 
AR Path="/5ECB7EC7/5F4BF641/5F5B16BE" Ref="R?"  Part="1" 
AR Path="/5ECB7EC7/5F5B16BE" Ref="R?"  Part="1" 
AR Path="/5F5B16BE" Ref="R?"  Part="1" 
F 0 "R?" H 5109 4338 39  0000 L CNN
F 1 "1.25k" H 5109 4263 39  0000 L CNN
F 2 "Resistor_SMD:R_0603_1608Metric" H 5050 4300 50  0001 C CNN
F 3 "~" H 5050 4300 50  0001 C CNN
	1    5050 4300
	-1   0    0    -1  
$EndComp
$Comp
L power:GND #PWR?
U 1 1 5F5B16C4
P 5050 4500
F 0 "#PWR?" H 5050 4250 50  0001 C CNN
F 1 "GND" H 5055 4327 50  0000 C CNN
F 2 "" H 5050 4500 50  0001 C CNN
F 3 "" H 5050 4500 50  0001 C CNN
	1    5050 4500
	-1   0    0    -1  
$EndComp
Wire Wire Line
	5050 4400 5050 4500
Text HLabel 5300 3050 3    39   Output ~ 0
TEMP
Text HLabel 5050 3050 3    39   Output ~ 0
MON
Wire Wire Line
	6100 4750 6100 5350
Connection ~ 5550 5150
Wire Wire Line
	5550 5150 5550 5450
$EndSCHEMATC
