(module TLW-106-06-G-D (layer F.Cu) (tedit 5F900552)
  (descr "Through hole straight spin strip, 2x06, 2.54mm pitch, double cols")
  (tags "Through hole pin strip THT 2x06 2.54mm double row")
  (fp_text reference REF** (at 0 -9.12) (layer F.SilkS)
    (effects (font (size 1 1) (thickness 0.15)))
  )
  (fp_text value TLW-106-06-G-D (at 4 -1.27 90) (layer F.Fab)
    (effects (font (size 1 1) (thickness 0.15)))
  )
  (fp_line (start -3.07 8.09) (end -3.07 -8.15) (layer F.CrtYd) (width 0.05))
  (fp_line (start 3.03 8.09) (end -3.07 8.09) (layer F.CrtYd) (width 0.05))
  (fp_line (start 3.03 -8.15) (end 3.03 8.09) (layer F.CrtYd) (width 0.05))
  (fp_line (start -3.07 -8.15) (end 3.03 -8.15) (layer F.CrtYd) (width 0.05))
  (fp_line (start 1.27 -7.68) (end 2.6 -7.68) (layer F.SilkS) (width 0.12))
  (fp_line (start 2.6 -7.68) (end 2.6 -6.35) (layer F.SilkS) (width 0.12))
  (fp_line (start 0 -7.68) (end 0 -5.08) (layer F.SilkS) (width 0.12))
  (fp_line (start 0 -5.08) (end 2.6 -5.08) (layer F.SilkS) (width 0.12))
  (fp_line (start 2.6 -5.08) (end 2.6 7.68) (layer F.SilkS) (width 0.12))
  (fp_line (start -2.6 7.68) (end 2.6 7.68) (layer F.SilkS) (width 0.12))
  (fp_line (start -2.6 -7.68) (end -2.6 7.68) (layer F.SilkS) (width 0.12))
  (fp_line (start -2.6 -7.68) (end 0 -7.68) (layer F.SilkS) (width 0.12))
  (fp_line (start -2.54 7.62) (end -2.54 -7.62) (layer F.Fab) (width 0.1))
  (fp_line (start 2.54 7.62) (end -2.54 7.62) (layer F.Fab) (width 0.1))
  (fp_line (start 2.54 -6.62) (end 2.54 7.62) (layer F.Fab) (width 0.1))
  (fp_line (start 1.54 -7.62) (end 2.54 -6.62) (layer F.Fab) (width 0.1))
  (fp_line (start -2.54 -7.62) (end 1.54 -7.62) (layer F.Fab) (width 0.1))
  (fp_line (start -3.01 -10.5) (end -3.01 10.5) (layer Dwgs.User) (width 0.12))
  (fp_line (start -1 -12.5) (end 4.3 -12.5) (layer Dwgs.User) (width 0.12))
  (fp_line (start -1 12.5) (end 4.3 12.5) (layer Dwgs.User) (width 0.12))
  (fp_text user %R (at 0 -1.27 90) (layer F.Fab)
    (effects (font (size 1 1) (thickness 0.15)))
  )
  (fp_arc (start -1.01 -10.5) (end -1.01 -12.5) (angle -90) (layer Dwgs.User) (width 0.12))
  (fp_arc (start -1.01 10.5) (end -3.01 10.5) (angle -90) (layer Dwgs.User) (width 0.12))
  (pad 9 thru_hole oval (at 1.27 3.81) (size 1.7 1.7) (drill 0.71) (layers *.Cu *.Mask))
  (pad 10 thru_hole oval (at -1.27 3.81) (size 1.7 1.7) (drill 0.71) (layers *.Cu *.Mask))
  (pad 12 thru_hole oval (at -1.27 6.35) (size 1.7 1.7) (drill 0.71) (layers *.Cu *.Mask))
  (pad 11 thru_hole oval (at 1.27 6.35) (size 1.7 1.7) (drill 0.71) (layers *.Cu *.Mask))
  (pad 8 thru_hole oval (at -1.27 1.27) (size 1.7 1.7) (drill 0.71) (layers *.Cu *.Mask))
  (pad 7 thru_hole oval (at 1.27 1.27) (size 1.7 1.7) (drill 0.71) (layers *.Cu *.Mask))
  (pad 6 thru_hole oval (at -1.27 -1.27) (size 1.7 1.7) (drill 0.71) (layers *.Cu *.Mask))
  (pad 5 thru_hole oval (at 1.27 -1.27) (size 1.7 1.7) (drill 0.71) (layers *.Cu *.Mask))
  (pad 4 thru_hole oval (at -1.27 -3.81) (size 1.7 1.7) (drill 0.71) (layers *.Cu *.Mask))
  (pad 3 thru_hole oval (at 1.27 -3.81) (size 1.7 1.7) (drill 0.71) (layers *.Cu *.Mask))
  (pad 2 thru_hole oval (at -1.27 -6.35) (size 1.7 1.7) (drill 0.71) (layers *.Cu *.Mask))
  (pad 1 thru_hole rect (at 1.27 -6.35) (size 1.7 1.7) (drill 0.71) (layers *.Cu *.Mask))
  (model ${KIPRJMOD}/../../libs/3D/TLW-106-06-G-D.stp
    (offset (xyz 0 0 -1.6))
    (scale (xyz 1 1 1))
    (rotate (xyz 90 0 90))
  )
)
