(module WP-SMBU_Wuerth_7466105 (layer F.Cu) (tedit 5F81BEB1)
  (descr "REDCUBE SMD with internal blind-hole thread with Pin WP-SMBU")
  (tags "wire-to-board, board-to-board, terminal")
  (fp_text reference J** (at 0.04064 -5.89788) (layer F.SilkS)
    (effects (font (size 1.27 1.27) (thickness 0.254)))
  )
  (fp_text value WP-SMBU (at -0.04064 6.2484) (layer F.SilkS) hide
    (effects (font (size 1.27 1.27) (thickness 0.254)))
  )
  (fp_text user %R (at 0.05334 -0.0635) (layer F.Fab)
    (effects (font (size 1.27 1.27) (thickness 0.254)))
  )
  (pad 1 thru_hole circle (at 0 0) (size 2.4 2.4) (drill 1.2) (layers *.Cu F.Mask))
  (pad 1 smd circle (at 0 0) (size 12 12) (layers F.Cu F.Mask))
  (model ${KIPRJMOD}/../../libs/3D/WP_SMBU_Wuerth_7466105.stp
    (offset (xyz 0 0 -0.8))
    (scale (xyz 1 1 1))
    (rotate (xyz 0 90 0))
  )
)
