EESchema Schematic File Version 4
EELAYER 30 0
EELAYER END
$Descr A4 11693 8268
encoding utf-8
Sheet 7 7
Title "Emergency"
Date "2020-09-11"
Rev "1.1"
Comp "Institute for Automation of Complex Power Systems - E.ON ERC - RWTH Aachen University"
Comment1 "Designer: D. Wienands, S. Melcher, L. Jeske, D. Moll"
Comment2 "Supervisor: C. Guarnieri Calò Carducci"
Comment3 ""
Comment4 ""
$EndDescr
$Comp
L LEGOS:AH1912_W U5
U 1 1 5F3AA85C
P 3950 4000
AR Path="/5F3B4B8B/5F3AA85C" Ref="U5"  Part="1" 
AR Path="/5F3CD302/5F3AA85C" Ref="U6"  Part="1" 
F 0 "U5" H 3950 4467 39  0000 C CNN
F 1 "AH1912_W" H 3950 4376 39  0000 C CNN
F 2 "Package_TO_SOT_SMD:SC-59" H 3925 4000 50  0001 C CNN
F 3 "https://www.diodes.com/assets/Datasheets/AH1912.pdf" H 3925 4000 50  0001 C CNN
	1    3950 4000
	1    0    0    -1  
$EndComp
$Comp
L Device:Q_PMOS_GSD Q11
U 1 1 5F3BFF56
P 5050 4000
AR Path="/5F3B4B8B/5F3BFF56" Ref="Q11"  Part="1" 
AR Path="/5F3CD302/5F3BFF56" Ref="Q12"  Part="1" 
F 0 "Q11" H 5255 3962 39  0000 L CNN
F 1 "Si2301BDS" H 5255 4037 39  0000 L CNN
F 2 "Package_TO_SOT_SMD:SOT-23" H 5250 4100 50  0001 C CNN
F 3 "https://eu.mouser.com/datasheet/2/427/si2301bds-1765637.pdf" H 5050 4000 50  0001 C CNN
	1    5050 4000
	1    0    0    1   
$EndComp
Wire Wire Line
	5150 5000 5150 5100
Wire Wire Line
	6950 5000 6950 5100
Wire Wire Line
	5150 4200 5150 4300
Wire Wire Line
	5750 5000 5750 5100
Wire Wire Line
	6350 5000 6350 5100
$Comp
L Device:R_Small R?
U 1 1 5F1F3EC3
P 5150 4400
AR Path="/5EF664BB/5F1F3EC3" Ref="R?"  Part="1" 
AR Path="/5F1EAFA9/5F1F3EC3" Ref="R?"  Part="1" 
AR Path="/5F1F3EC3" Ref="R?"  Part="1" 
AR Path="/5F3B4B8B/5F1F3EC3" Ref="R22"  Part="1" 
AR Path="/5F3CD302/5F1F3EC3" Ref="R24"  Part="1" 
F 0 "R22" H 5209 4446 39  0000 L CNN
F 1 "31.6" H 5209 4355 39  0000 L CNN
F 2 "Resistor_SMD:R_0603_1608Metric" H 5150 4400 50  0001 C CNN
F 3 "~" H 5150 4400 50  0001 C CNN
	1    5150 4400
	1    0    0    -1  
$EndComp
Wire Wire Line
	5750 4600 5750 4700
$Comp
L power:+3.3V #PWR070
U 1 1 5F3D1275
P 5150 3600
AR Path="/5F3B4B8B/5F3D1275" Ref="#PWR070"  Part="1" 
AR Path="/5F3CD302/5F3D1275" Ref="#PWR078"  Part="1" 
F 0 "#PWR070" H 5150 3450 50  0001 C CNN
F 1 "+3.3V" H 5165 3765 39  0000 C CNN
F 2 "" H 5150 3600 50  0001 C CNN
F 3 "" H 5150 3600 50  0001 C CNN
	1    5150 3600
	1    0    0    -1  
$EndComp
Wire Wire Line
	5150 3600 5150 3800
Wire Wire Line
	6350 4600 6350 4700
Wire Wire Line
	6950 4600 6950 4700
$Comp
L Device:R_Small R?
U 1 1 5F3B5FD2
P 4550 3800
AR Path="/5EF664BB/5F3B5FD2" Ref="R?"  Part="1" 
AR Path="/5F1EAFA9/5F3B5FD2" Ref="R?"  Part="1" 
AR Path="/5F3B5FD2" Ref="R?"  Part="1" 
AR Path="/5F3B4B8B/5F3B5FD2" Ref="R21"  Part="1" 
AR Path="/5F3CD302/5F3B5FD2" Ref="R23"  Part="1" 
F 0 "R21" H 4609 3846 39  0000 L CNN
F 1 "10k" H 4609 3755 39  0000 L CNN
F 2 "Resistor_SMD:R_0603_1608Metric" H 4550 3800 50  0001 C CNN
F 3 "~" H 4550 3800 50  0001 C CNN
	1    4550 3800
	1    0    0    -1  
$EndComp
Wire Wire Line
	4550 3900 4550 4000
$Comp
L power:+3.3V #PWR069
U 1 1 5F3B6FB9
P 4550 3600
AR Path="/5F3B4B8B/5F3B6FB9" Ref="#PWR069"  Part="1" 
AR Path="/5F3CD302/5F3B6FB9" Ref="#PWR077"  Part="1" 
F 0 "#PWR069" H 4550 3450 50  0001 C CNN
F 1 "+3.3V" H 4565 3765 39  0000 C CNN
F 2 "" H 4550 3600 50  0001 C CNN
F 3 "" H 4550 3600 50  0001 C CNN
	1    4550 3600
	1    0    0    -1  
$EndComp
Wire Wire Line
	4550 3600 4550 3700
Connection ~ 4550 4000
Wire Wire Line
	4550 4000 4250 4000
Wire Wire Line
	4550 4000 4850 4000
$Comp
L power:+3.3V #PWR067
U 1 1 5F3BCC17
P 3550 3800
AR Path="/5F3B4B8B/5F3BCC17" Ref="#PWR067"  Part="1" 
AR Path="/5F3CD302/5F3BCC17" Ref="#PWR075"  Part="1" 
F 0 "#PWR067" H 3550 3650 50  0001 C CNN
F 1 "+3.3V" H 3565 3965 39  0000 C CNN
F 2 "" H 3550 3800 50  0001 C CNN
F 3 "" H 3550 3800 50  0001 C CNN
	1    3550 3800
	1    0    0    -1  
$EndComp
Wire Wire Line
	3650 3800 3550 3800
$Comp
L power:GND #PWR068
U 1 1 5F3BD609
P 3550 4200
AR Path="/5F3B4B8B/5F3BD609" Ref="#PWR068"  Part="1" 
AR Path="/5F3CD302/5F3BD609" Ref="#PWR076"  Part="1" 
F 0 "#PWR068" H 3550 3950 50  0001 C CNN
F 1 "GND" H 3555 4027 39  0000 C CNN
F 2 "" H 3550 4200 50  0001 C CNN
F 3 "" H 3550 4200 50  0001 C CNN
	1    3550 4200
	1    0    0    -1  
$EndComp
Wire Wire Line
	3650 4200 3550 4200
Wire Wire Line
	4550 4000 4550 4550
Wire Wire Line
	4550 4550 4450 4550
Text HLabel 4450 4550 0    39   Input ~ 0
~EMRGY
Text Notes 5750 4450 0    39   ~ 0
IN-S126ATR (Red)\nVf = 2.05 @ If = 10 mA
$Comp
L Device:C_Small C?
U 1 1 5F619439
P 3550 4000
AR Path="/5F619439" Ref="C?"  Part="1" 
AR Path="/5F3CD302/5F619439" Ref="C6"  Part="1" 
AR Path="/5F3B4B8B/5F619439" Ref="C7"  Part="1" 
F 0 "C7" H 3500 3950 39  0000 R CNN
F 1 "100n" H 3550 4050 39  0000 R CNN
F 2 "Capacitor_SMD:C_0603_1608Metric" H 3550 4000 50  0001 C CNN
F 3 "~" H 3550 4000 50  0001 C CNN
	1    3550 4000
	1    0    0    1   
$EndComp
Wire Wire Line
	3550 3800 3550 3900
Connection ~ 3550 3800
Wire Wire Line
	3550 4100 3550 4200
Connection ~ 3550 4200
Wire Wire Line
	6950 4600 6350 4600
Wire Wire Line
	5750 4600 5150 4600
Wire Wire Line
	6350 4600 5750 4600
$Comp
L power:GND #PWR0112
U 1 1 5F63684D
P 5150 5100
AR Path="/5F3B4B8B/5F63684D" Ref="#PWR0112"  Part="1" 
AR Path="/5F3CD302/5F63684D" Ref="#PWR0108"  Part="1" 
F 0 "#PWR0112" H 5150 4850 50  0001 C CNN
F 1 "GND" H 5155 4927 39  0000 C CNN
F 2 "" H 5150 5100 50  0001 C CNN
F 3 "" H 5150 5100 50  0001 C CNN
	1    5150 5100
	1    0    0    -1  
$EndComp
$Comp
L power:GND #PWR0113
U 1 1 5F636CA7
P 5750 5100
AR Path="/5F3B4B8B/5F636CA7" Ref="#PWR0113"  Part="1" 
AR Path="/5F3CD302/5F636CA7" Ref="#PWR0109"  Part="1" 
F 0 "#PWR0113" H 5750 4850 50  0001 C CNN
F 1 "GND" H 5755 4927 39  0000 C CNN
F 2 "" H 5750 5100 50  0001 C CNN
F 3 "" H 5750 5100 50  0001 C CNN
	1    5750 5100
	1    0    0    -1  
$EndComp
$Comp
L power:GND #PWR0114
U 1 1 5F636F84
P 6350 5100
AR Path="/5F3B4B8B/5F636F84" Ref="#PWR0114"  Part="1" 
AR Path="/5F3CD302/5F636F84" Ref="#PWR0110"  Part="1" 
F 0 "#PWR0114" H 6350 4850 50  0001 C CNN
F 1 "GND" H 6355 4927 39  0000 C CNN
F 2 "" H 6350 5100 50  0001 C CNN
F 3 "" H 6350 5100 50  0001 C CNN
	1    6350 5100
	1    0    0    -1  
$EndComp
$Comp
L power:GND #PWR0115
U 1 1 5F637294
P 6950 5100
AR Path="/5F3B4B8B/5F637294" Ref="#PWR0115"  Part="1" 
AR Path="/5F3CD302/5F637294" Ref="#PWR0111"  Part="1" 
F 0 "#PWR0115" H 6950 4850 50  0001 C CNN
F 1 "GND" H 6955 4927 39  0000 C CNN
F 2 "" H 6950 5100 50  0001 C CNN
F 3 "" H 6950 5100 50  0001 C CNN
	1    6950 5100
	1    0    0    -1  
$EndComp
$Comp
L Device:LED D?
U 1 1 5F3BCBEF
P 6950 4850
AR Path="/5EF664BB/5F3BCBEF" Ref="D?"  Part="1" 
AR Path="/5F1EAFA9/5F3BCBEF" Ref="D?"  Part="1" 
AR Path="/5F3BCBEF" Ref="D?"  Part="1" 
AR Path="/5F3B4B8B/5F3BCBEF" Ref="D24"  Part="1" 
AR Path="/5F3CD302/5F3BCBEF" Ref="D28"  Part="1" 
F 0 "D24" V 6897 4928 39  0000 L CNN
F 1 "IN-S124ARUR" V 6988 4928 39  0000 L CNN
F 2 "LEGOS:LED_1204_3212Metric_ReverseMount_Hole1.8x2.4mm" H 6950 4850 50  0001 C CNN
F 3 "http://inolux-corp.com/datasheet/SMDLED/Mono%20Color%20Reverse%20Mount/IN-S124AR%20Series_V1.0.pdf" H 6950 4850 50  0001 C CNN
	1    6950 4850
	0    -1   -1   0   
$EndComp
$Comp
L Device:LED D?
U 1 1 5F3BB9AA
P 6350 4850
AR Path="/5EF664BB/5F3BB9AA" Ref="D?"  Part="1" 
AR Path="/5F1EAFA9/5F3BB9AA" Ref="D?"  Part="1" 
AR Path="/5F3BB9AA" Ref="D?"  Part="1" 
AR Path="/5F3B4B8B/5F3BB9AA" Ref="D23"  Part="1" 
AR Path="/5F3CD302/5F3BB9AA" Ref="D27"  Part="1" 
F 0 "D23" V 6297 4928 39  0000 L CNN
F 1 "IN-S124ARUR" V 6388 4928 39  0000 L CNN
F 2 "LEGOS:LED_1204_3212Metric_ReverseMount_Hole1.8x2.4mm" H 6350 4850 50  0001 C CNN
F 3 "http://inolux-corp.com/datasheet/SMDLED/Mono%20Color%20Reverse%20Mount/IN-S124AR%20Series_V1.0.pdf" H 6350 4850 50  0001 C CNN
	1    6350 4850
	0    -1   -1   0   
$EndComp
$Comp
L Device:LED D?
U 1 1 5F3BB521
P 5750 4850
AR Path="/5EF664BB/5F3BB521" Ref="D?"  Part="1" 
AR Path="/5F1EAFA9/5F3BB521" Ref="D?"  Part="1" 
AR Path="/5F3BB521" Ref="D?"  Part="1" 
AR Path="/5F3B4B8B/5F3BB521" Ref="D22"  Part="1" 
AR Path="/5F3CD302/5F3BB521" Ref="D26"  Part="1" 
F 0 "D22" V 5697 4928 39  0000 L CNN
F 1 "IN-S124ARUR" V 5788 4928 39  0000 L CNN
F 2 "LEGOS:LED_1204_3212Metric_ReverseMount_Hole1.8x2.4mm" H 5750 4850 50  0001 C CNN
F 3 "http://inolux-corp.com/datasheet/SMDLED/Mono%20Color%20Reverse%20Mount/IN-S124AR%20Series_V1.0.pdf" H 5750 4850 50  0001 C CNN
	1    5750 4850
	0    -1   -1   0   
$EndComp
$Comp
L Device:LED D?
U 1 1 5F1F3EBD
P 5150 4850
AR Path="/5EF664BB/5F1F3EBD" Ref="D?"  Part="1" 
AR Path="/5F1EAFA9/5F1F3EBD" Ref="D?"  Part="1" 
AR Path="/5F1F3EBD" Ref="D?"  Part="1" 
AR Path="/5F3B4B8B/5F1F3EBD" Ref="D21"  Part="1" 
AR Path="/5F3CD302/5F1F3EBD" Ref="D25"  Part="1" 
F 0 "D21" V 5097 4928 39  0000 L CNN
F 1 "IN-S124ARUR" V 5188 4928 39  0000 L CNN
F 2 "LEGOS:LED_1204_3212Metric_ReverseMount_Hole1.8x2.4mm" H 5150 4850 50  0001 C CNN
F 3 "http://inolux-corp.com/datasheet/SMDLED/Mono%20Color%20Reverse%20Mount/IN-S124AR%20Series_V1.0.pdf" H 5150 4850 50  0001 C CNN
	1    5150 4850
	0    -1   -1   0   
$EndComp
Wire Wire Line
	5150 4500 5150 4600
Connection ~ 6350 4600
Connection ~ 5750 4600
Connection ~ 5150 4600
Wire Wire Line
	5150 4600 5150 4700
$EndSCHEMATC
