(module EnergySource (layer F.Cu) (tedit 5F7B5437)
  (fp_text reference Ref** (at 0 0) (layer F.SilkS) hide
    (effects (font (size 1.27 1.27) (thickness 0.15)))
  )
  (fp_text value Val** (at 0 0) (layer F.SilkS) hide
    (effects (font (size 1.27 1.27) (thickness 0.15)))
  )
  (fp_poly (pts (xy 2.254048 -3.063752) (xy 2.422236 -3.04806) (xy 2.528146 -3.028541) (xy 2.66955 -2.986721)
    (xy 2.826503 -2.92711) (xy 2.983518 -2.856505) (xy 3.125113 -2.781706) (xy 3.206413 -2.730732)
    (xy 3.423351 -2.55603) (xy 3.612718 -2.350263) (xy 3.772714 -2.11595) (xy 3.901542 -1.855609)
    (xy 3.972823 -1.657257) (xy 3.993622 -1.586954) (xy 4.008696 -1.525582) (xy 4.01896 -1.464115)
    (xy 4.025326 -1.393527) (xy 4.028706 -1.304791) (xy 4.030015 -1.188881) (xy 4.030187 -1.090083)
    (xy 4.029765 -0.950575) (xy 4.027891 -0.844371) (xy 4.023652 -0.762444) (xy 4.016135 -0.695766)
    (xy 4.004427 -0.635312) (xy 3.987614 -0.572056) (xy 3.972817 -0.522889) (xy 3.913884 -0.351287)
    (xy 3.846873 -0.199081) (xy 3.765469 -0.055185) (xy 3.663359 0.091489) (xy 3.534225 0.252027)
    (xy 3.525601 0.2622) (xy 3.452541 0.350625) (xy 3.394489 0.429208) (xy 3.349384 0.504737)
    (xy 3.31516 0.583999) (xy 3.289754 0.673781) (xy 3.271104 0.780872) (xy 3.257144 0.912059)
    (xy 3.245813 1.07413) (xy 3.238496 1.206586) (xy 3.230716 1.336246) (xy 3.2217 1.454845)
    (xy 3.212197 1.55449) (xy 3.202955 1.627287) (xy 3.195043 1.66454) (xy 3.163802 1.717548)
    (xy 3.115601 1.772332) (xy 3.104887 1.781993) (xy 3.037417 1.83978) (xy 2.081275 1.84064)
    (xy 1.125132 1.8415) (xy 1.049713 1.753389) (xy 1.02041 1.717965) (xy 0.997925 1.684839)
    (xy 0.981162 1.647807) (xy 0.96903 1.600667) (xy 0.960433 1.537215) (xy 0.95428 1.451247)
    (xy 0.949476 1.336561) (xy 0.944928 1.186954) (xy 0.943989 1.153584) (xy 0.936998 0.972709)
    (xy 0.925174 0.825338) (xy 0.905376 0.702674) (xy 0.874462 0.595919) (xy 0.829291 0.496277)
    (xy 0.766721 0.394952) (xy 0.683613 0.283148) (xy 0.593514 0.172145) (xy 0.426919 -0.058634)
    (xy 0.297917 -0.30548) (xy 0.219128 -0.519628) (xy 0.19801 -0.590918) (xy 0.1827 -0.65274)
    (xy 0.17227 -0.714156) (xy 0.165795 -0.784229) (xy 0.162347 -0.872022) (xy 0.161001 -0.986595)
    (xy 0.160818 -1.087764) (xy 0.23627 -1.087764) (xy 0.238919 -0.996403) (xy 0.263049 -0.762473)
    (xy 0.311841 -0.547086) (xy 0.388554 -0.342163) (xy 0.496443 -0.139621) (xy 0.638766 0.06862)
    (xy 0.700136 0.147892) (xy 0.790021 0.262222) (xy 0.860979 0.358575) (xy 0.915458 0.444441)
    (xy 0.955905 0.527315) (xy 0.984768 0.614688) (xy 1.004496 0.714053) (xy 1.017536 0.832901)
    (xy 1.026335 0.978726) (xy 1.033342 1.15902) (xy 1.03368 1.168819) (xy 1.048789 1.607387)
    (xy 1.121213 1.68211) (xy 1.193638 1.756834) (xy 2.997747 1.756834) (xy 3.05632 1.695697)
    (xy 3.0904 1.65346) (xy 3.115691 1.603466) (xy 3.133415 1.539033) (xy 3.144792 1.453482)
    (xy 3.151044 1.340131) (xy 3.153392 1.192302) (xy 3.153488 1.164167) (xy 3.157019 0.96937)
    (xy 3.167227 0.810331) (xy 3.184932 0.680883) (xy 3.210952 0.574858) (xy 3.242585 0.493456)
    (xy 3.272584 0.441298) (xy 3.323062 0.365836) (xy 3.387495 0.276366) (xy 3.459354 0.182184)
    (xy 3.475015 0.16238) (xy 3.645021 -0.071838) (xy 3.77747 -0.29975) (xy 3.87105 -0.518994)
    (xy 3.894446 -0.593485) (xy 3.92534 -0.737906) (xy 3.94576 -0.907372) (xy 3.954828 -1.085696)
    (xy 3.951666 -1.25669) (xy 3.937717 -1.39044) (xy 3.873536 -1.65898) (xy 3.771695 -1.912167)
    (xy 3.635079 -2.146806) (xy 3.466578 -2.359703) (xy 3.269079 -2.547664) (xy 3.04547 -2.707495)
    (xy 2.798639 -2.836001) (xy 2.550584 -2.924656) (xy 2.469941 -2.945428) (xy 2.393127 -2.959329)
    (xy 2.308266 -2.967564) (xy 2.203487 -2.971338) (xy 2.084917 -2.971926) (xy 1.958141 -2.970592)
    (xy 1.861572 -2.966497) (xy 1.783101 -2.958178) (xy 1.710622 -2.944171) (xy 1.632026 -2.923009)
    (xy 1.599388 -2.913201) (xy 1.427303 -2.851404) (xy 1.255302 -2.773039) (xy 1.096161 -2.684718)
    (xy 0.962655 -2.593051) (xy 0.931334 -2.567451) (xy 0.722644 -2.362805) (xy 0.549497 -2.13775)
    (xy 0.413089 -1.895002) (xy 0.314617 -1.637277) (xy 0.255278 -1.367293) (xy 0.23627 -1.087764)
    (xy 0.160818 -1.087764) (xy 0.160813 -1.090083) (xy 0.161236 -1.229602) (xy 0.163111 -1.335815)
    (xy 0.167352 -1.417748) (xy 0.174869 -1.484425) (xy 0.186577 -1.54487) (xy 0.203387 -1.608109)
    (xy 0.218133 -1.657103) (xy 0.324977 -1.937169) (xy 0.464115 -2.191143) (xy 0.633906 -2.417386)
    (xy 0.832711 -2.614258) (xy 1.058887 -2.780121) (xy 1.310795 -2.913335) (xy 1.570009 -3.007447)
    (xy 1.714703 -3.038767) (xy 1.886277 -3.058797) (xy 2.070726 -3.067227) (xy 2.254048 -3.063752)) (layer F.SilkS) (width 0.01))
  (fp_poly (pts (xy -1.143769 -3.055451) (xy -1.146442 -3.012548) (xy -1.147684 -3.003558) (xy -1.158376 -2.950947)
    (xy -1.178359 -2.87181) (xy -1.204058 -2.779949) (xy -1.215639 -2.741083) (xy -1.238189 -2.662829)
    (xy -1.254209 -2.593639) (xy -1.264909 -2.523071) (xy -1.271498 -2.440683) (xy -1.275186 -2.336031)
    (xy -1.277059 -2.210866) (xy -1.280583 -1.87115) (xy -1.202443 -1.71345) (xy -1.15669 -1.632512)
    (xy -1.092116 -1.533114) (xy -1.017787 -1.428642) (xy -0.952275 -1.344083) (xy -0.820089 -1.179475)
    (xy -0.712497 -1.040272) (xy -0.625738 -0.920446) (xy -0.55605 -0.813967) (xy -0.499673 -0.714809)
    (xy -0.452844 -0.616942) (xy -0.411802 -0.514338) (xy -0.382821 -0.431446) (xy -0.311943 -0.15343)
    (xy -0.281051 0.131605) (xy -0.289502 0.418795) (xy -0.336653 0.703271) (xy -0.42186 0.980167)
    (xy -0.544478 1.244616) (xy -0.621524 1.373607) (xy -0.692388 1.473409) (xy -0.777232 1.577543)
    (xy -0.870402 1.680586) (xy -0.966246 1.777117) (xy -1.059112 1.861713) (xy -1.143348 1.928951)
    (xy -1.2133 1.973409) (xy -1.263317 1.989665) (xy -1.26371 1.989667) (xy -1.297027 1.976402)
    (xy -1.297976 1.9374) (xy -1.266855 1.87385) (xy -1.216935 1.803378) (xy -1.110314 1.632555)
    (xy -1.036913 1.440598) (xy -0.99949 1.235771) (xy -0.995116 1.139092) (xy -1.013018 0.885647)
    (xy -1.066631 0.647058) (xy -1.154623 0.428066) (xy -1.233312 0.292914) (xy -1.30131 0.200994)
    (xy -1.386214 0.101361) (xy -1.482382 -0.000846) (xy -1.58417 -0.100491) (xy -1.685935 -0.192434)
    (xy -1.782034 -0.271539) (xy -1.866824 -0.332667) (xy -1.934662 -0.37068) (xy -1.973509 -0.381)
    (xy -1.991424 -0.379919) (xy -2.002829 -0.37232) (xy -2.007821 -0.35167) (xy -2.006499 -0.311434)
    (xy -1.998962 -0.245078) (xy -1.985308 -0.146068) (xy -1.977839 -0.093643) (xy -1.958134 0.07373)
    (xy -1.953829 0.212032) (xy -1.968023 0.329966) (xy -2.003816 0.436234) (xy -2.064308 0.539542)
    (xy -2.1526 0.648591) (xy -2.271791 0.772085) (xy -2.29392 0.79375) (xy -2.397389 0.896817)
    (xy -2.47302 0.979568) (xy -2.525036 1.049331) (xy -2.557662 1.113432) (xy -2.575121 1.179197)
    (xy -2.58164 1.253954) (xy -2.582126 1.293623) (xy -2.565796 1.397804) (xy -2.52241 1.509062)
    (xy -2.45974 1.610408) (xy -2.413787 1.661584) (xy -2.358275 1.721136) (xy -2.318566 1.778644)
    (xy -2.299686 1.825167) (xy -2.306659 1.851769) (xy -2.306807 1.851861) (xy -2.344294 1.85195)
    (xy -2.395787 1.821605) (xy -2.455041 1.767566) (xy -2.515813 1.696574) (xy -2.571857 1.61537)
    (xy -2.616929 1.530695) (xy -2.627253 1.505947) (xy -2.662217 1.380133) (xy -2.675503 1.247907)
    (xy -2.667027 1.122803) (xy -2.636708 1.018355) (xy -2.630329 1.005417) (xy -2.585229 0.939202)
    (xy -2.513824 0.856838) (xy -2.424318 0.766697) (xy -2.324917 0.677151) (xy -2.245915 0.613195)
    (xy -2.171618 0.545734) (xy -2.11963 0.470217) (xy -2.086818 0.378172) (xy -2.070048 0.261128)
    (xy -2.066083 0.127) (xy -2.070532 -0.013018) (xy -2.084888 -0.135084) (xy -2.112313 -0.263039)
    (xy -2.123514 -0.30596) (xy -2.147409 -0.39865) (xy -2.166324 -0.479283) (xy -2.177823 -0.53705)
    (xy -2.180166 -0.557314) (xy -2.1656 -0.587045) (xy -2.124419 -0.589733) (xy -2.060406 -0.567802)
    (xy -1.97734 -0.523677) (xy -1.879002 -0.459782) (xy -1.769174 -0.378542) (xy -1.651634 -0.282381)
    (xy -1.530165 -0.173722) (xy -1.42875 -0.075462) (xy -1.301938 0.056118) (xy -1.202616 0.169909)
    (xy -1.124989 0.274281) (xy -1.063261 0.377603) (xy -1.011634 0.488241) (xy -0.978231 0.575001)
    (xy -0.958523 0.632488) (xy -0.943831 0.685281) (xy -0.933249 0.741376) (xy -0.92587 0.80877)
    (xy -0.920787 0.895458) (xy -0.917092 1.009438) (xy -0.914265 1.138817) (xy -0.91048 1.291009)
    (xy -0.905747 1.404028) (xy -0.899811 1.481029) (xy -0.892413 1.525169) (xy -0.8833 1.5396)
    (xy -0.881743 1.53939) (xy -0.841476 1.509845) (xy -0.789923 1.44757) (xy -0.730818 1.359414)
    (xy -0.667893 1.252228) (xy -0.604881 1.13286) (xy -0.545515 1.008161) (xy -0.493526 0.884981)
    (xy -0.452648 0.770168) (xy -0.440829 0.73025) (xy -0.415466 0.603863) (xy -0.398914 0.448545)
    (xy -0.391191 0.276642) (xy -0.39231 0.100498) (xy -0.402289 -0.06754) (xy -0.421143 -0.215126)
    (xy -0.439505 -0.299204) (xy -0.502023 -0.484544) (xy -0.588626 -0.668234) (xy -0.702794 -0.856164)
    (xy -0.848003 -1.054225) (xy -0.977847 -1.211194) (xy -1.100365 -1.35905) (xy -1.19448 -1.488729)
    (xy -1.263973 -1.609553) (xy -1.312629 -1.730841) (xy -1.344228 -1.861916) (xy -1.362555 -2.012098)
    (xy -1.371095 -2.180166) (xy -1.373911 -2.313358) (xy -1.372879 -2.41632) (xy -1.367129 -2.501051)
    (xy -1.355795 -2.579548) (xy -1.338008 -2.663811) (xy -1.335259 -2.675463) (xy -1.316773 -2.75937)
    (xy -1.304679 -2.82678) (xy -1.300608 -2.867871) (xy -1.302074 -2.875463) (xy -1.334103 -2.879626)
    (xy -1.397658 -2.864257) (xy -1.487947 -2.831573) (xy -1.600175 -2.783789) (xy -1.729549 -2.723121)
    (xy -1.871276 -2.651785) (xy -2.020561 -2.571997) (xy -2.172613 -2.485973) (xy -2.271192 -2.427441)
    (xy -2.461746 -2.305865) (xy -2.638146 -2.179295) (xy -2.810087 -2.039927) (xy -2.987269 -1.879957)
    (xy -3.154641 -1.716531) (xy -3.306631 -1.559639) (xy -3.430743 -1.421234) (xy -3.532631 -1.29396)
    (xy -3.617948 -1.170463) (xy -3.692346 -1.043387) (xy -3.733742 -0.963083) (xy -3.787903 -0.850715)
    (xy -3.82933 -0.755296) (xy -3.859715 -0.668158) (xy -3.880749 -0.580633) (xy -3.894126 -0.484052)
    (xy -3.901538 -0.369747) (xy -3.904677 -0.22905) (xy -3.90525 -0.084666) (xy -3.904815 0.067109)
    (xy -3.903085 0.184485) (xy -3.899425 0.275387) (xy -3.893198 0.347744) (xy -3.88377 0.409483)
    (xy -3.870504 0.468531) (xy -3.856865 0.518584) (xy -3.792173 0.703933) (xy -3.699284 0.910219)
    (xy -3.582002 1.130669) (xy -3.444132 1.358506) (xy -3.289481 1.586958) (xy -3.15677 1.764921)
    (xy -3.101844 1.83706) (xy -3.058409 1.89718) (xy -3.032093 1.937313) (xy -3.026833 1.94888)
    (xy -3.039734 1.975364) (xy -3.075369 1.970512) (xy -3.129138 1.935314) (xy -3.142461 1.92402)
    (xy -3.20069 1.864682) (xy -3.274611 1.776993) (xy -3.358251 1.66897) (xy -3.445635 1.548631)
    (xy -3.530791 1.423995) (xy -3.607746 1.303078) (xy -3.619258 1.284012) (xy -3.708318 1.119893)
    (xy -3.796211 0.930316) (xy -3.875999 0.731762) (xy -3.940748 0.540713) (xy -3.959228 0.47625)
    (xy -3.985352 0.348852) (xy -4.00458 0.193083) (xy -4.0163 0.022438) (xy -4.019898 -0.149588)
    (xy -4.014761 -0.309502) (xy -4.000867 -0.440195) (xy -3.934845 -0.717805) (xy -3.827538 -0.990769)
    (xy -3.679824 -1.258194) (xy -3.492586 -1.519187) (xy -3.266703 -1.772858) (xy -3.003055 -2.018312)
    (xy -2.702524 -2.254659) (xy -2.36599 -2.481005) (xy -1.994333 -2.696459) (xy -1.588433 -2.900128)
    (xy -1.560851 -2.912954) (xy -1.452897 -2.961856) (xy -1.353769 -3.004813) (xy -1.271947 -3.038291)
    (xy -1.215912 -3.058759) (xy -1.200975 -3.062863) (xy -1.158765 -3.068681) (xy -1.143769 -3.055451)) (layer F.SilkS) (width 0.01))
  (fp_poly (pts (xy 1.766246 2.37332) (xy 1.91233 2.374607) (xy 2.068668 2.376741) (xy 2.228851 2.37961)
    (xy 2.386466 2.3831) (xy 2.535104 2.387101) (xy 2.668353 2.391498) (xy 2.779801 2.396179)
    (xy 2.863039 2.401031) (xy 2.906311 2.405136) (xy 2.964421 2.415988) (xy 3.000197 2.428231)
    (xy 3.005667 2.433938) (xy 2.986245 2.442767) (xy 2.93479 2.452467) (xy 2.861515 2.461215)
    (xy 2.843723 2.462811) (xy 2.783325 2.46615) (xy 2.691799 2.46893) (xy 2.575196 2.471152)
    (xy 2.439571 2.472817) (xy 2.290975 2.473926) (xy 2.13546 2.474482) (xy 1.979081 2.474485)
    (xy 1.827889 2.473937) (xy 1.687936 2.472839) (xy 1.565277 2.471192) (xy 1.465962 2.468998)
    (xy 1.396046 2.466257) (xy 1.36158 2.462973) (xy 1.359959 2.462482) (xy 1.333097 2.439057)
    (xy 1.341839 2.411412) (xy 1.38122 2.387417) (xy 1.412681 2.378897) (xy 1.453635 2.375669)
    (xy 1.530488 2.373738) (xy 1.636829 2.372993) (xy 1.766246 2.37332)) (layer F.SilkS) (width 0.01))
  (fp_poly (pts (xy 2.360227 3.017777) (xy 2.51156 3.019856) (xy 2.626592 3.02355) (xy 2.708332 3.029131)
    (xy 2.75979 3.036874) (xy 2.783975 3.04705) (xy 2.783897 3.059933) (xy 2.769802 3.071489)
    (xy 2.741099 3.076511) (xy 2.67671 3.080626) (xy 2.583272 3.08384) (xy 2.467421 3.086161)
    (xy 2.335795 3.087596) (xy 2.19503 3.088152) (xy 2.051764 3.087837) (xy 1.912633 3.086658)
    (xy 1.784274 3.084622) (xy 1.673325 3.081737) (xy 1.586422 3.07801) (xy 1.530203 3.073448)
    (xy 1.513417 3.070104) (xy 1.491159 3.055593) (xy 1.502786 3.043575) (xy 1.549648 3.033939)
    (xy 1.633093 3.026578) (xy 1.75447 3.021382) (xy 1.915128 3.018243) (xy 2.116416 3.01705)
    (xy 2.169584 3.017041) (xy 2.360227 3.017777)) (layer F.SilkS) (width 0.01))
  (fp_poly (pts (xy -2.587261 2.54606) (xy -2.572477 2.599179) (xy -2.559847 2.694361) (xy -2.555379 2.748228)
    (xy -2.547944 2.831337) (xy -2.539006 2.901052) (xy -2.53034 2.94386) (xy -2.529271 2.946883)
    (xy -2.508826 2.971918) (xy -2.467323 2.989387) (xy -2.399803 2.999977) (xy -2.301309 3.004373)
    (xy -2.16688 3.003262) (xy -2.128958 3.002259) (xy -2.013101 2.997406) (xy -1.93404 2.990249)
    (xy -1.886265 2.980021) (xy -1.864266 2.965953) (xy -1.86384 2.965294) (xy -1.853958 2.931635)
    (xy -1.843341 2.86734) (xy -1.833765 2.784032) (xy -1.830641 2.748188) (xy -1.819351 2.639618)
    (xy -1.805745 2.572258) (xy -1.789468 2.545029) (xy -1.770163 2.556852) (xy -1.768283 2.559764)
    (xy -1.760842 2.588814) (xy -1.751576 2.649332) (xy -1.74202 2.730584) (xy -1.737902 2.772473)
    (xy -1.728499 2.85893) (xy -1.718232 2.928858) (xy -1.708746 2.971884) (xy -1.704983 2.979905)
    (xy -1.678647 2.985902) (xy -1.619531 2.990353) (xy -1.537164 2.993263) (xy -1.44107 2.994639)
    (xy -1.340776 2.994487) (xy -1.245809 2.992812) (xy -1.165695 2.98962) (xy -1.10996 2.984917)
    (xy -1.088634 2.979523) (xy -1.080113 2.952748) (xy -1.070378 2.894139) (xy -1.061007 2.814106)
    (xy -1.057143 2.771643) (xy -1.048693 2.685362) (xy -1.039444 2.615831) (xy -1.030879 2.573333)
    (xy -1.027455 2.565567) (xy -1.006323 2.562396) (xy -0.990816 2.59914) (xy -0.981295 2.673711)
    (xy -0.978122 2.784021) (xy -0.978909 2.846917) (xy -0.98425 3.07975) (xy -2.116666 3.083797)
    (xy -2.362106 3.084294) (xy -2.585509 3.083988) (xy -2.783956 3.082917) (xy -2.954527 3.081121)
    (xy -3.0943 3.07864) (xy -3.200354 3.075514) (xy -3.26977 3.071782) (xy -3.299101 3.067718)
    (xy -3.32134 3.056988) (xy -3.335398 3.040864) (xy -3.342704 3.011097) (xy -3.344686 2.959437)
    (xy -3.342772 2.877633) (xy -3.34092 2.826091) (xy -3.333381 2.707766) (xy -3.321157 2.623397)
    (xy -3.304896 2.57527) (xy -3.285247 2.565673) (xy -3.271321 2.5806) (xy -3.262844 2.610666)
    (xy -3.251893 2.672272) (xy -3.24022 2.754838) (xy -3.234202 2.804695) (xy -3.211372 3.005667)
    (xy -2.974982 3.005667) (xy -2.853932 3.004668) (xy -2.768497 2.998252) (xy -2.711956 2.981294)
    (xy -2.677592 2.948666) (xy -2.658686 2.895242) (xy -2.64852 2.815896) (xy -2.643764 2.75293)
    (xy -2.632449 2.638439) (xy -2.618455 2.565754) (xy -2.602989 2.53494) (xy -2.587261 2.54606)) (layer F.SilkS) (width 0.01))
)
