EESchema Schematic File Version 4
EELAYER 30 0
EELAYER END
$Descr A4 11693 8268
encoding utf-8
Sheet 1 1
Title "Load Regulation"
Date "2020-05-31"
Rev "1.0"
Comp "Institute for Automation of Complex Power Systems - E.ON ERC - RWTH Aachen University"
Comment1 "Designer: D. Wienands, S. Melcher, L. Jeske, D. Moll"
Comment2 "Supervisor: C. Guarnieri Calò Carducci"
Comment3 ""
Comment4 ""
$EndDescr
$Comp
L Device:Q_NMOS_GSD Q?
U 1 1 5ED4311C
P 6800 3750
F 0 "Q?" H 7004 3796 39  0000 L CNN
F 1 "2N7002NXA" H 7004 3705 39  0000 L CNN
F 2 "Package_TO_SOT_SMD:SOT-23" H 7000 3850 50  0001 C CNN
F 3 "https://eu.mouser.com/datasheet/2/916/2N7002NXAK-1651343.pdf" H 6800 3750 50  0001 C CNN
	1    6800 3750
	1    0    0    -1  
$EndComp
$Comp
L power:+5V #PWR?
U 1 1 5ED43128
P 6000 3200
F 0 "#PWR?" H 6000 3050 50  0001 C CNN
F 1 "+5V" H 6015 3373 39  0000 C CNN
F 2 "" H 6000 3200 50  0001 C CNN
F 3 "" H 6000 3200 50  0001 C CNN
	1    6000 3200
	1    0    0    -1  
$EndComp
$Comp
L Device:R_Small R?
U 1 1 5ED43134
P 6900 4500
F 0 "R?" H 6959 4546 39  0000 L CNN
F 1 "30 - 1/2W" H 6959 4455 39  0000 L CNN
F 2 "Resistor_SMD:R_0805_2012Metric" H 6900 4500 50  0001 C CNN
F 3 "~" H 6900 4500 50  0001 C CNN
F 4 "ERJ-P06F30R0V" H 6900 4500 50  0001 C CNN "Mfr"
	1    6900 4500
	1    0    0    -1  
$EndComp
Wire Wire Line
	5800 3850 5700 3850
Wire Wire Line
	5700 3850 5700 4300
$Comp
L power:GND #PWR?
U 1 1 5ED43154
P 5350 3950
F 0 "#PWR?" H 5350 3700 50  0001 C CNN
F 1 "GND" H 5355 3777 39  0000 C CNN
F 2 "" H 5350 3950 50  0001 C CNN
F 3 "" H 5350 3950 50  0001 C CNN
	1    5350 3950
	1    0    0    -1  
$EndComp
Wire Wire Line
	5350 3650 5800 3650
Text Notes 6950 4300 0    39   ~ 8
MAX Current: 100mA
Text Notes 5450 3600 0    39   ~ 8
0-3.3 V
Text HLabel 4650 3650 0    39   Input ~ 0
IN
Wire Wire Line
	5700 4300 6900 4300
Wire Wire Line
	6600 3750 6500 3750
$Comp
L Device:R_Small R?
U 1 1 5ED66060
P 6500 3950
F 0 "R?" H 6559 3996 39  0000 L CNN
F 1 "10k" H 6559 3905 39  0000 L CNN
F 2 "Resistor_SMD:R_0603_1608Metric" H 6500 3950 39  0001 C CNN
F 3 "~" H 6500 3950 39  0001 C CNN
	1    6500 3950
	1    0    0    -1  
$EndComp
$Comp
L power:GND #PWR?
U 1 1 5ED66CAF
P 6500 4050
F 0 "#PWR?" H 6500 3800 39  0001 C CNN
F 1 "GND" H 6505 3877 39  0000 C CNN
F 2 "" H 6500 4050 39  0001 C CNN
F 3 "" H 6500 4050 39  0001 C CNN
	1    6500 4050
	1    0    0    -1  
$EndComp
Wire Wire Line
	6500 3850 6500 3750
Connection ~ 6500 3750
Wire Wire Line
	6500 3750 6400 3750
$Comp
L Device:R_Small R?
U 1 1 5ED8EE68
P 5100 3650
F 0 "R?" V 5300 3600 39  0000 L CNN
F 1 "4.7k" V 5200 3600 39  0000 L CNN
F 2 "Resistor_SMD:R_0603_1608Metric" H 5100 3650 39  0001 C CNN
F 3 "~" H 5100 3650 39  0001 C CNN
	1    5100 3650
	0    -1   -1   0   
$EndComp
Wire Wire Line
	5200 3650 5350 3650
Connection ~ 5350 3650
Wire Wire Line
	4650 3650 4850 3650
$Comp
L Device:C_Small C?
U 1 1 5ED904F3
P 5350 3850
F 0 "C?" H 5300 3800 39  0000 R CNN
F 1 "100n" H 5350 3900 39  0000 R CNN
F 2 "Capacitor_SMD:C_0603_1608Metric" H 5350 3850 39  0001 C CNN
F 3 "~" H 5350 3850 39  0001 C CNN
	1    5350 3850
	1    0    0    1   
$EndComp
Wire Wire Line
	5350 3750 5350 3650
Connection ~ 6900 4300
Wire Wire Line
	6900 3950 6900 4300
Wire Wire Line
	6900 4300 6900 4400
$Comp
L power:GND #PWR?
U 1 1 5EF4BC50
P 6200 3200
F 0 "#PWR?" H 6200 2950 39  0001 C CNN
F 1 "GND" H 6205 3027 39  0000 C CNN
F 2 "" H 6200 3200 39  0001 C CNN
F 3 "" H 6200 3200 39  0001 C CNN
	1    6200 3200
	-1   0    0    1   
$EndComp
$Comp
L Device:C_Small C?
U 1 1 5EF4A737
P 6200 3300
F 0 "C?" H 6150 3250 39  0000 R CNN
F 1 "100n" H 6200 3350 39  0000 R CNN
F 2 "Capacitor_SMD:C_0603_1608Metric" H 6200 3300 39  0001 C CNN
F 3 "~" H 6200 3300 39  0001 C CNN
	1    6200 3300
	-1   0    0    -1  
$EndComp
Wire Wire Line
	6000 3450 6000 3400
Wire Wire Line
	6000 3400 6200 3400
Connection ~ 6000 3400
Wire Wire Line
	6000 3400 6000 3200
Wire Wire Line
	6900 3200 6900 3550
$Comp
L Device:R_Small R?
U 1 1 5F06630D
P 4850 3850
F 0 "R?" H 4909 3896 39  0000 L CNN
F 1 "100k" H 4909 3805 39  0000 L CNN
F 2 "Resistor_SMD:R_0603_1608Metric" H 4850 3850 39  0001 C CNN
F 3 "~" H 4850 3850 39  0001 C CNN
	1    4850 3850
	1    0    0    -1  
$EndComp
$Comp
L power:GND #PWR?
U 1 1 5F066313
P 4850 3950
F 0 "#PWR?" H 4850 3700 39  0001 C CNN
F 1 "GND" H 4855 3777 39  0000 C CNN
F 2 "" H 4850 3950 39  0001 C CNN
F 3 "" H 4850 3950 39  0001 C CNN
	1    4850 3950
	1    0    0    -1  
$EndComp
Wire Wire Line
	4850 3750 4850 3650
Connection ~ 4850 3650
Wire Wire Line
	4850 3650 5000 3650
$Comp
L power:GND #PWR?
U 1 1 5F06152D
P 6000 4050
F 0 "#PWR?" H 6000 3800 50  0001 C CNN
F 1 "GND" H 6005 3877 39  0000 C CNN
F 2 "" H 6000 4050 50  0001 C CNN
F 3 "" H 6000 4050 50  0001 C CNN
	1    6000 4050
	1    0    0    -1  
$EndComp
$Comp
L power:GND #PWR?
U 1 1 5F062118
P 6900 4600
F 0 "#PWR?" H 6900 4350 39  0001 C CNN
F 1 "GND" H 6905 4427 39  0000 C CNN
F 2 "" H 6900 4600 39  0001 C CNN
F 3 "" H 6900 4600 39  0001 C CNN
	1    6900 4600
	1    0    0    -1  
$EndComp
$Comp
L Amplifier_Operational:AD8603 U?
U 1 1 5F309BDD
P 6100 3750
F 0 "U?" H 6100 4000 39  0000 L CNN
F 1 "TLV333IDBV" H 6100 3900 39  0000 L CNN
F 2 "Package_TO_SOT_SMD:TSOT-23-5" H 6100 3750 50  0001 C CNN
F 3 "http://www.ti.com/lit/ds/symlink/tlv333.pdf" H 6100 3950 50  0001 C CNN
	1    6100 3750
	1    0    0    -1  
$EndComp
$Comp
L power:+3.3V #PWR?
U 1 1 5F3565D2
P 6900 3200
F 0 "#PWR?" H 6900 3050 50  0001 C CNN
F 1 "+3.3V" H 6915 3365 39  0000 C CNN
F 2 "" H 6900 3200 50  0001 C CNN
F 3 "" H 6900 3200 50  0001 C CNN
	1    6900 3200
	1    0    0    -1  
$EndComp
$EndSCHEMATC
