(module PogoConn_Target (layer F.Cu) (tedit 5F61DD44)
  (descr "Target Pogo Pin Connector Harwin s70-332002045")
  (fp_text reference REF** (at 0 1.9) (layer F.SilkS)
    (effects (font (size 1 1) (thickness 0.15)))
  )
  (fp_text value PogoTarget (at 0 -0.5) (layer F.Fab)
    (effects (font (size 1 1) (thickness 0.15)))
  )
  (fp_circle (center -11.59111 -3.105829) (end -9.852444 -3.571703) (layer Dwgs.User) (width 0.05))
  (fp_circle (center -8.485281 -8.485282) (end -6.746615 -8.951156) (layer Dwgs.User) (width 0.05))
  (fp_circle (center -3.105829 -11.59111) (end -1.367162 -12.056984) (layer Dwgs.User) (width 0.05))
  (fp_circle (center 3.105829 -11.59111) (end 4.844495 -12.056984) (layer Dwgs.User) (width 0.05))
  (fp_circle (center 8.485282 -8.485281) (end 10.223948 -8.951156) (layer Dwgs.User) (width 0.05))
  (fp_circle (center 11.59111 -3.105829) (end 13.329776 -3.571703) (layer Dwgs.User) (width 0.05))
  (fp_circle (center 11.59111 3.105829) (end 13.329777 2.639954) (layer Dwgs.User) (width 0.05))
  (fp_circle (center 8.485281 8.485282) (end 10.223948 8.019407) (layer Dwgs.User) (width 0.05))
  (fp_circle (center 3.105829 11.59111) (end 4.844495 11.125236) (layer Dwgs.User) (width 0.05))
  (fp_circle (center -3.105829 11.59111) (end -1.367162 11.125236) (layer Dwgs.User) (width 0.05))
  (fp_circle (center -8.485282 8.485281) (end -6.746615 8.019407) (layer Dwgs.User) (width 0.05))
  (fp_circle (center -11.59111 3.105829) (end -9.852443 2.639954) (layer Dwgs.User) (width 0.05))
  (fp_circle (center 0 0) (end 1.558846 -0.9) (layer Dwgs.User) (width 0.05))
  (fp_circle (center 3.897114 -2.25) (end 5.45596 -3.15) (layer Dwgs.User) (width 0.05))
  (fp_circle (center 0.000001 4.499999) (end 1.558846 3.599999) (layer Dwgs.User) (width 0.05))
  (fp_circle (center -3.897113 -2.25) (end -2.338268 -3.15) (layer Dwgs.User) (width 0.05))
  (fp_circle (center 6.893654 1.215537) (end 8.4525 0.315537) (layer Dwgs.User) (width 0.05))
  (fp_circle (center 4.499513 5.362311) (end 6.058359 4.462311) (layer Dwgs.User) (width 0.05))
  (fp_circle (center 2.394141 -6.577848) (end 3.952987 -7.477848) (layer Dwgs.User) (width 0.05))
  (fp_circle (center -2.394141 -6.577848) (end -0.835295 -7.477848) (layer Dwgs.User) (width 0.05))
  (fp_circle (center -4.499513 5.362311) (end -2.940667 4.462311) (layer Dwgs.User) (width 0.05))
  (fp_circle (center -6.893654 1.215537) (end -5.334808 0.315537) (layer Dwgs.User) (width 0.05))
  (fp_arc (start -2.598076 -1.499999) (end 13.250447 -7.650147) (angle 102.5) (layer F.SilkS) (width 0.12))
  (fp_arc (start 2.598076 -1.499999) (end -0.000001 15.300298) (angle 102.5) (layer F.SilkS) (width 0.12))
  (fp_arc (start 0 3) (end -13.250446 -7.650149) (angle 102.5) (layer F.SilkS) (width 0.12))
  (fp_line (start 23 -10.5) (end 23 10.5) (layer Dwgs.User) (width 0.12))
  (fp_arc (start 25 10.5) (end 23 10.5) (angle -90) (layer Dwgs.User) (width 0.12))
  (fp_arc (start 25 -10.5) (end 25 -12.5) (angle -90) (layer Dwgs.User) (width 0.12))
  (fp_line (start 25 -12.5) (end 85 -12.5) (layer Dwgs.User) (width 0.12))
  (fp_line (start 25 12.5) (end 85 12.5) (layer Dwgs.User) (width 0.12))
  (fp_line (start 23.325318 -15.400635) (end 53.325318 -67.362159) (layer Dwgs.User) (width 0.12))
  (fp_line (start 2.406733 -25.168584) (end 20.593267 -14.668584) (layer Dwgs.User) (width 0.12))
  (fp_arc (start 21.593267 -16.400635) (end 20.593267 -14.668584) (angle -90) (layer Dwgs.User) (width 0.12))
  (fp_arc (start 3.406733 -26.900635) (end 1.674682 -27.900635) (angle -90) (layer Dwgs.User) (width 0.12))
  (fp_line (start 1.674682 -27.900635) (end 31.674682 -79.862159) (layer Dwgs.User) (width 0.12))
  (fp_line (start -20.593267 -14.668584) (end -2.406733 -25.168584) (layer Dwgs.User) (width 0.12))
  (fp_arc (start -3.406733 -26.900635) (end -2.406733 -25.168584) (angle -90) (layer Dwgs.User) (width 0.12))
  (fp_arc (start -21.593267 -16.400635) (end -23.325318 -15.400635) (angle -90) (layer Dwgs.User) (width 0.12))
  (fp_line (start -23.325318 -15.400635) (end -53.325317 -67.362159) (layer Dwgs.User) (width 0.12))
  (fp_line (start -1.674682 -27.900635) (end -31.674682 -79.86216) (layer Dwgs.User) (width 0.12))
  (fp_line (start -25 12.5) (end -84.999999 12.5) (layer Dwgs.User) (width 0.12))
  (fp_arc (start -25 -10.5) (end -23 -10.5) (angle -90) (layer Dwgs.User) (width 0.12))
  (fp_arc (start -25 10.5) (end -25 12.5) (angle -90) (layer Dwgs.User) (width 0.12))
  (fp_line (start -25 -12.5) (end -85 -12.500001) (layer Dwgs.User) (width 0.12))
  (fp_line (start -23 10.5) (end -23 -10.5) (layer Dwgs.User) (width 0.12))
  (fp_line (start -23.325318 15.400635) (end -53.325318 67.362159) (layer Dwgs.User) (width 0.12))
  (fp_line (start -1.674682 27.900635) (end -31.674682 79.862158) (layer Dwgs.User) (width 0.12))
  (fp_arc (start -3.406733 26.900635) (end -1.674682 27.900635) (angle -90) (layer Dwgs.User) (width 0.12))
  (fp_line (start -2.406733 25.168584) (end -20.593267 14.668584) (layer Dwgs.User) (width 0.12))
  (fp_arc (start -21.593267 16.400635) (end -20.593267 14.668584) (angle -90) (layer Dwgs.User) (width 0.12))
  (fp_line (start 23.325318 15.400635) (end 53.325317 67.362158) (layer Dwgs.User) (width 0.12))
  (fp_line (start 1.674682 27.900635) (end 31.674682 79.86216) (layer Dwgs.User) (width 0.12))
  (fp_arc (start 21.593267 16.400635) (end 23.325318 15.400635) (angle -90) (layer Dwgs.User) (width 0.12))
  (fp_line (start 20.593267 14.668584) (end 2.406733 25.168584) (layer Dwgs.User) (width 0.12))
  (fp_arc (start 3.406733 26.900635) (end 2.406733 25.168584) (angle -90) (layer Dwgs.User) (width 0.12))
  (pad 8 thru_hole circle (at 5.56854 -3.215) (size 0.6 0.6) (drill 0.25) (layers *.Cu))
  (pad 8 thru_hole circle (at -5.56854 -3.215) (size 0.6 0.6) (drill 0.25) (layers *.Cu))
  (pad 8 thru_hole circle (at 0 6.43) (size 0.6 0.6) (drill 0.25) (layers *.Cu))
  (pad 9 thru_hole circle (at 3.05424 -8.39146) (size 0.6 0.6) (drill 0.25) (layers *.Cu))
  (pad 9 thru_hole circle (at -8.79433 1.55068) (size 0.6 0.6) (drill 0.25) (layers *.Cu))
  (pad 9 thru_hole circle (at 5.74009 6.84078) (size 0.6 0.6) (drill 0.25) (layers *.Cu))
  (pad 10 thru_hole circle (at -3.05424 -8.39146) (size 0.6 0.6) (drill 0.25) (layers *.Cu))
  (pad 10 thru_hole circle (at -5.74009 6.84078) (size 0.6 0.6) (drill 0.25) (layers *.Cu))
  (pad 10 thru_hole circle (at 8.79433 1.55068) (size 0.6 0.6) (drill 0.25) (layers *.Cu))
  (pad 11 smd circle (at 3.10583 -11.59111) (size 3.6 3.6) (layers F.Cu F.Paste F.Mask))
  (pad 12 smd circle (at 11.59111 -3.10583) (size 3.6 3.6) (layers F.Cu F.Paste F.Mask))
  (pad 13 smd circle (at 8.48528 8.48528) (size 3.6 3.6) (layers F.Cu F.Paste F.Mask))
  (pad 14 smd circle (at -3.10583 11.59111) (size 3.6 3.6) (layers F.Cu F.Paste F.Mask))
  (pad 15 smd circle (at -11.59111 3.10583) (size 3.6 3.6) (layers F.Cu F.Paste F.Mask))
  (pad 16 smd circle (at -8.48528 -8.48528) (size 3.6 3.6) (layers F.Cu F.Paste F.Mask))
  (pad 6 smd circle (at -3.10583 -11.59111) (size 3.6 3.6) (layers F.Cu F.Paste F.Mask))
  (pad 1 smd circle (at 8.48528 -8.48528) (size 3.6 3.6) (layers F.Cu F.Paste F.Mask))
  (pad 2 smd circle (at 11.59111 3.10583) (size 3.6 3.6) (layers F.Cu F.Paste F.Mask))
  (pad 3 smd circle (at 3.10583 11.59111) (size 3.6 3.6) (layers F.Cu F.Paste F.Mask))
  (pad 4 smd circle (at -8.48528 8.48528) (size 3.6 3.6) (layers F.Cu F.Paste F.Mask))
  (pad 5 smd circle (at -11.59111 -3.10583) (size 3.6 3.6) (layers F.Cu F.Paste F.Mask))
  (pad 7 smd circle (at 0 0) (size 3.6 3.6) (layers F.Cu F.Paste F.Mask))
  (pad 8 smd circle (at 3.89711 -2.25) (size 3.6 3.6) (layers F.Cu F.Paste F.Mask))
  (pad 8 smd circle (at -3.89711 -2.25) (size 3.6 3.6) (layers F.Cu F.Paste F.Mask))
  (pad 8 smd circle (at 0 4.5) (size 3.6 3.6) (layers F.Cu F.Paste F.Mask))
  (pad 9 smd circle (at 2.39414 -6.57785) (size 3.6 3.6) (layers F.Cu F.Paste F.Mask))
  (pad 9 smd circle (at -6.89365 1.21554) (size 3.6 3.6) (layers F.Cu F.Paste F.Mask))
  (pad 9 smd circle (at 4.49951 5.36231) (size 3.6 3.6) (layers F.Cu F.Paste F.Mask))
  (pad 10 smd circle (at -2.39414 -6.57785) (size 3.6 3.6) (layers F.Cu F.Paste F.Mask))
  (pad 10 smd circle (at -4.49951 5.36231) (size 3.6 3.6) (layers F.Cu F.Paste F.Mask))
  (pad 10 smd circle (at 6.89365 1.21554) (size 3.6 3.6) (layers F.Cu F.Paste F.Mask))
  (model ${KIPRJMOD}/../../libs/3D/s70-332002045.stp
    (offset (xyz 3.10583 11.59111 0))
    (scale (xyz 1 1 1))
    (rotate (xyz -90 0 0))
  )
  (model ${KIPRJMOD}/../../libs/3D/s70-332002045.stp
    (offset (xyz 11.59111 3.10583 0))
    (scale (xyz 1 1 1))
    (rotate (xyz -90 0 0))
  )
  (model ${KIPRJMOD}/../../libs/3D/s70-332002045.stp
    (offset (xyz 8.485279999999999 -8.485279999999999 0))
    (scale (xyz 1 1 1))
    (rotate (xyz -90 0 0))
  )
  (model ${KIPRJMOD}/../../libs/3D/s70-332002045.stp
    (offset (xyz -3.10583 -11.59111 0))
    (scale (xyz 1 1 1))
    (rotate (xyz -90 0 0))
  )
  (model ${KIPRJMOD}/../../libs/3D/s70-332002045.stp
    (offset (xyz -11.59111 -3.10583 0))
    (scale (xyz 1 1 1))
    (rotate (xyz -90 0 0))
  )
  (model ${KIPRJMOD}/../../libs/3D/s70-332002045.stp
    (offset (xyz -8.485279999999999 8.485279999999999 0))
    (scale (xyz 1 1 1))
    (rotate (xyz -90 0 0))
  )
  (model ${KIPRJMOD}/../../libs/3D/s70-332002045.stp
    (offset (xyz -3.10583 11.59111 0))
    (scale (xyz 1 1 1))
    (rotate (xyz -90 0 0))
  )
  (model ${KIPRJMOD}/../../libs/3D/s70-332002045.stp
    (offset (xyz 8.485279999999999 8.485279999999999 0))
    (scale (xyz 1 1 1))
    (rotate (xyz -90 0 0))
  )
  (model ${KIPRJMOD}/../../libs/3D/s70-332002045.stp
    (offset (xyz 11.59111 -3.10583 0))
    (scale (xyz 1 1 1))
    (rotate (xyz -90 0 0))
  )
  (model ${KIPRJMOD}/../../libs/3D/s70-332002045.stp
    (offset (xyz 3.10583 -11.59111 0))
    (scale (xyz 1 1 1))
    (rotate (xyz -90 0 0))
  )
  (model ${KIPRJMOD}/../../libs/3D/s70-332002045.stp
    (offset (xyz -8.485279999999999 -8.485279999999999 0))
    (scale (xyz 1 1 1))
    (rotate (xyz -90 0 0))
  )
  (model ${KIPRJMOD}/../../libs/3D/s70-332002045.stp
    (offset (xyz -11.59111 3.10583 0))
    (scale (xyz 1 1 1))
    (rotate (xyz -90 0 0))
  )
  (model ${KIPRJMOD}/../../libs/3D/s70-332002045.stp
    (at (xyz 0 0 0))
    (scale (xyz 1 1 1))
    (rotate (xyz -90 0 0))
  )
  (model ${KIPRJMOD}/../../libs/3D/s70-332002045.stp
    (offset (xyz 3.89711 2.25 0))
    (scale (xyz 1 1 1))
    (rotate (xyz -90 0 0))
  )
  (model ${KIPRJMOD}/../../libs/3D/s70-332002045.stp
    (offset (xyz -3.89711 2.25 0))
    (scale (xyz 1 1 1))
    (rotate (xyz -90 0 0))
  )
  (model ${KIPRJMOD}/../../libs/3D/s70-332002045.stp
    (offset (xyz -0 -4.5 0))
    (scale (xyz 1 1 1))
    (rotate (xyz -90 0 0))
  )
  (model ${KIPRJMOD}/../../libs/3D/s70-332002045.stp
    (offset (xyz 2.39414 6.57785 0))
    (scale (xyz 1 1 1))
    (rotate (xyz -90 0 0))
  )
  (model ${KIPRJMOD}/../../libs/3D/s70-332002045.stp
    (offset (xyz -6.89365 -1.21554 0))
    (scale (xyz 1 1 1))
    (rotate (xyz -90 0 0))
  )
  (model ${KIPRJMOD}/../../libs/3D/s70-332002045.stp
    (offset (xyz 4.49951 -5.36231 0))
    (scale (xyz 1 1 1))
    (rotate (xyz -90 0 0))
  )
  (model ${KIPRJMOD}/../../libs/3D/s70-332002045.stp
    (offset (xyz -2.39414 6.57785 0))
    (scale (xyz 1 1 1))
    (rotate (xyz -90 0 0))
  )
  (model ${KIPRJMOD}/../../libs/3D/s70-332002045.stp
    (offset (xyz -4.49951 -5.36231 0))
    (scale (xyz 1 1 1))
    (rotate (xyz -90 0 0))
  )
  (model ${KIPRJMOD}/../../libs/3D/s70-332002045.stp
    (offset (xyz 6.89365 -1.21554 0))
    (scale (xyz 1 1 1))
    (rotate (xyz -90 0 0))
  )
)
