EESchema Schematic File Version 4
EELAYER 30 0
EELAYER END
$Descr A4 11693 8268
encoding utf-8
Sheet 2 6
Title "Substation"
Date "2020-07-31"
Rev "1.2"
Comp "Institute for Automation of Complex Power Systems - E.ON ERC - RWTH Aachen University"
Comment1 "Designer: D. Wienands, S. Melcher, L. Jeske, D. Moll"
Comment2 "Supervisor: C. Guarnieri Calò Carducci"
Comment3 ""
Comment4 ""
$EndDescr
$Comp
L Device:Q_NMOS_GSD Q?
U 1 1 5F1F8C48
P 2400 4200
AR Path="/5ED67AD9/5F1DE120/5F1F8C48" Ref="Q?"  Part="1" 
AR Path="/5ED6635F/5F1DE120/5F1F8C48" Ref="Q?"  Part="1" 
AR Path="/5ED65121/5F1DE120/5F1F8C48" Ref="Q?"  Part="1" 
AR Path="/5ED64706/5F1DE120/5F1F8C48" Ref="Q?"  Part="1" 
AR Path="/5ED66DA7/5F1DE120/5F1F8C48" Ref="Q?"  Part="1" 
AR Path="/5ED6832A/5F1DE120/5F1F8C48" Ref="Q?"  Part="1" 
AR Path="/5ED67AD9/5F1F8C48" Ref="Q?"  Part="1" 
AR Path="/5ED6635F/5F1F8C48" Ref="Q?"  Part="1" 
AR Path="/5ED65121/5F1F8C48" Ref="Q?"  Part="1" 
AR Path="/5ED64706/5F1F8C48" Ref="Q1"  Part="1" 
AR Path="/5ED66DA7/5F1F8C48" Ref="Q?"  Part="1" 
AR Path="/5ED6832A/5F1F8C48" Ref="Q?"  Part="1" 
F 0 "Q1" H 2604 4246 39  0000 L CNN
F 1 "Si2302CDS" H 2604 4155 39  0000 L CNN
F 2 "Package_TO_SOT_SMD:SOT-23" H 2600 4300 50  0001 C CNN
F 3 "https://eu.mouser.com/datasheet/2/427/si2302cds-1764899.pdf" H 2400 4200 50  0001 C CNN
	1    2400 4200
	1    0    0    -1  
$EndComp
Text HLabel 1900 4200 0    39   Input ~ 0
F1
Wire Wire Line
	2000 4300 2000 4200
$Comp
L power:GND #PWR?
U 1 1 5F1F8C6E
P 2000 4500
AR Path="/5ED67AD9/5F1DE120/5F1F8C6E" Ref="#PWR?"  Part="1" 
AR Path="/5ED6635F/5F1DE120/5F1F8C6E" Ref="#PWR?"  Part="1" 
AR Path="/5ED65121/5F1DE120/5F1F8C6E" Ref="#PWR?"  Part="1" 
AR Path="/5ED64706/5F1DE120/5F1F8C6E" Ref="#PWR?"  Part="1" 
AR Path="/5ED66DA7/5F1DE120/5F1F8C6E" Ref="#PWR?"  Part="1" 
AR Path="/5ED6832A/5F1DE120/5F1F8C6E" Ref="#PWR?"  Part="1" 
AR Path="/5ED67AD9/5F1F8C6E" Ref="#PWR?"  Part="1" 
AR Path="/5ED6635F/5F1F8C6E" Ref="#PWR?"  Part="1" 
AR Path="/5ED65121/5F1F8C6E" Ref="#PWR?"  Part="1" 
AR Path="/5ED64706/5F1F8C6E" Ref="#PWR013"  Part="1" 
AR Path="/5ED66DA7/5F1F8C6E" Ref="#PWR?"  Part="1" 
AR Path="/5ED6832A/5F1F8C6E" Ref="#PWR?"  Part="1" 
F 0 "#PWR013" H 2000 4250 39  0001 C CNN
F 1 "GND" H 2005 4327 39  0000 C CNN
F 2 "" H 2000 4500 39  0001 C CNN
F 3 "" H 2000 4500 39  0001 C CNN
	1    2000 4500
	1    0    0    -1  
$EndComp
$Comp
L Device:R_Small R?
U 1 1 5F1F8C68
P 2000 4400
AR Path="/5ED67AD9/5F1DE120/5F1F8C68" Ref="R?"  Part="1" 
AR Path="/5ED6635F/5F1DE120/5F1F8C68" Ref="R?"  Part="1" 
AR Path="/5ED65121/5F1DE120/5F1F8C68" Ref="R?"  Part="1" 
AR Path="/5ED64706/5F1DE120/5F1F8C68" Ref="R?"  Part="1" 
AR Path="/5ED66DA7/5F1DE120/5F1F8C68" Ref="R?"  Part="1" 
AR Path="/5ED6832A/5F1DE120/5F1F8C68" Ref="R?"  Part="1" 
AR Path="/5ED67AD9/5F1F8C68" Ref="R?"  Part="1" 
AR Path="/5ED6635F/5F1F8C68" Ref="R?"  Part="1" 
AR Path="/5ED65121/5F1F8C68" Ref="R?"  Part="1" 
AR Path="/5ED64706/5F1F8C68" Ref="R2"  Part="1" 
AR Path="/5ED66DA7/5F1F8C68" Ref="R?"  Part="1" 
AR Path="/5ED6832A/5F1F8C68" Ref="R?"  Part="1" 
F 0 "R2" H 2059 4446 39  0000 L CNN
F 1 "10k" H 2059 4355 39  0000 L CNN
F 2 "Resistor_SMD:R_0603_1608Metric" H 2000 4400 39  0001 C CNN
F 3 "~" H 2000 4400 39  0001 C CNN
	1    2000 4400
	1    0    0    -1  
$EndComp
Wire Wire Line
	2200 4200 2000 4200
$Comp
L power:GND #PWR?
U 1 1 5F24A8F7
P 2500 4500
AR Path="/5ED5ED9C/5F24A8F7" Ref="#PWR?"  Part="1" 
AR Path="/5ED70004/5F24A8F7" Ref="#PWR?"  Part="1" 
AR Path="/5ED71B98/5F24A8F7" Ref="#PWR?"  Part="1" 
AR Path="/5ED71E6C/5F24A8F7" Ref="#PWR?"  Part="1" 
AR Path="/5ED721CA/5F24A8F7" Ref="#PWR?"  Part="1" 
AR Path="/5ED73666/5F24A8F7" Ref="#PWR?"  Part="1" 
AR Path="/5ED7366A/5F24A8F7" Ref="#PWR?"  Part="1" 
AR Path="/5ED7C65E/5F24A8F7" Ref="#PWR?"  Part="1" 
AR Path="/5ED7C902/5F24A8F7" Ref="#PWR?"  Part="1" 
AR Path="/5ED7CB90/5F24A8F7" Ref="#PWR?"  Part="1" 
AR Path="/5ED7CDDE/5F24A8F7" Ref="#PWR?"  Part="1" 
AR Path="/5ED7D240/5F24A8F7" Ref="#PWR?"  Part="1" 
AR Path="/5EDB009B/5F24A8F7" Ref="#PWR?"  Part="1" 
AR Path="/5F24A8F7" Ref="#PWR?"  Part="1" 
AR Path="/5ED64706/5F24A8F7" Ref="#PWR015"  Part="1" 
AR Path="/5ED65121/5F24A8F7" Ref="#PWR?"  Part="1" 
AR Path="/5ED6635F/5F24A8F7" Ref="#PWR?"  Part="1" 
AR Path="/5ED66DA7/5F24A8F7" Ref="#PWR?"  Part="1" 
AR Path="/5ED67AD9/5F24A8F7" Ref="#PWR?"  Part="1" 
AR Path="/5ED6832A/5F24A8F7" Ref="#PWR?"  Part="1" 
F 0 "#PWR015" H 2500 4250 50  0001 C CNN
F 1 "GND" H 2505 4327 39  0000 C CNN
F 2 "" H 2500 4500 50  0001 C CNN
F 3 "" H 2500 4500 50  0001 C CNN
	1    2500 4500
	1    0    0    -1  
$EndComp
Wire Wire Line
	2500 4500 2500 4400
$Comp
L power:+5V #PWR?
U 1 1 5F28DEA9
P 2500 3150
AR Path="/5F28DEA9" Ref="#PWR?"  Part="1" 
AR Path="/5ED5ED9C/5F28DEA9" Ref="#PWR?"  Part="1" 
AR Path="/5ED73666/5F28DEA9" Ref="#PWR?"  Part="1" 
AR Path="/5ED721CA/5F28DEA9" Ref="#PWR?"  Part="1" 
AR Path="/5ED71E6C/5F28DEA9" Ref="#PWR?"  Part="1" 
AR Path="/5ED70004/5F28DEA9" Ref="#PWR?"  Part="1" 
AR Path="/5ED71B98/5F28DEA9" Ref="#PWR?"  Part="1" 
AR Path="/5EDB009B/5F28DEA9" Ref="#PWR?"  Part="1" 
AR Path="/5ED64706/5F28DEA9" Ref="#PWR014"  Part="1" 
AR Path="/5ED65121/5F28DEA9" Ref="#PWR?"  Part="1" 
AR Path="/5ED6635F/5F28DEA9" Ref="#PWR?"  Part="1" 
AR Path="/5ED66DA7/5F28DEA9" Ref="#PWR?"  Part="1" 
AR Path="/5ED67AD9/5F28DEA9" Ref="#PWR?"  Part="1" 
AR Path="/5ED6832A/5F28DEA9" Ref="#PWR?"  Part="1" 
F 0 "#PWR014" H 2500 3000 50  0001 C CNN
F 1 "+5V" H 2500 3300 39  0000 C CNN
F 2 "" H 2500 3150 50  0001 C CNN
F 3 "" H 2500 3150 50  0001 C CNN
	1    2500 3150
	1    0    0    -1  
$EndComp
Text Notes 2600 3600 0    50   ~ 0
316R\n1/20 W
Wire Notes Line
	2550 3500 2450 3500
Wire Notes Line
	2450 3500 2450 3650
Wire Notes Line
	2450 3650 2550 3650
Wire Notes Line
	2550 3650 2550 3500
Wire Notes Line
	2500 3500 2500 3350
Wire Notes Line
	2500 3650 2500 3800
Wire Wire Line
	2000 4200 1900 4200
Connection ~ 2000 4200
$Comp
L Device:Q_NMOS_GSD Q?
U 1 1 5F597E27
P 3900 4200
AR Path="/5ED67AD9/5F1DE120/5F597E27" Ref="Q?"  Part="1" 
AR Path="/5ED6635F/5F1DE120/5F597E27" Ref="Q?"  Part="1" 
AR Path="/5ED65121/5F1DE120/5F597E27" Ref="Q?"  Part="1" 
AR Path="/5ED64706/5F1DE120/5F597E27" Ref="Q?"  Part="1" 
AR Path="/5ED66DA7/5F1DE120/5F597E27" Ref="Q?"  Part="1" 
AR Path="/5ED6832A/5F1DE120/5F597E27" Ref="Q?"  Part="1" 
AR Path="/5ED67AD9/5F597E27" Ref="Q?"  Part="1" 
AR Path="/5ED6635F/5F597E27" Ref="Q?"  Part="1" 
AR Path="/5ED65121/5F597E27" Ref="Q?"  Part="1" 
AR Path="/5ED64706/5F597E27" Ref="Q2"  Part="1" 
AR Path="/5ED66DA7/5F597E27" Ref="Q?"  Part="1" 
AR Path="/5ED6832A/5F597E27" Ref="Q?"  Part="1" 
F 0 "Q2" H 4104 4246 39  0000 L CNN
F 1 "Si2302CDS" H 4104 4155 39  0000 L CNN
F 2 "Package_TO_SOT_SMD:SOT-23" H 4100 4300 50  0001 C CNN
F 3 "https://eu.mouser.com/datasheet/2/427/si2302cds-1764899.pdf" H 3900 4200 50  0001 C CNN
	1    3900 4200
	1    0    0    -1  
$EndComp
Text HLabel 3400 4200 0    39   Input ~ 0
F2
Wire Wire Line
	3500 4300 3500 4200
$Comp
L power:GND #PWR?
U 1 1 5F597E2F
P 3500 4500
AR Path="/5ED67AD9/5F1DE120/5F597E2F" Ref="#PWR?"  Part="1" 
AR Path="/5ED6635F/5F1DE120/5F597E2F" Ref="#PWR?"  Part="1" 
AR Path="/5ED65121/5F1DE120/5F597E2F" Ref="#PWR?"  Part="1" 
AR Path="/5ED64706/5F1DE120/5F597E2F" Ref="#PWR?"  Part="1" 
AR Path="/5ED66DA7/5F1DE120/5F597E2F" Ref="#PWR?"  Part="1" 
AR Path="/5ED6832A/5F1DE120/5F597E2F" Ref="#PWR?"  Part="1" 
AR Path="/5ED67AD9/5F597E2F" Ref="#PWR?"  Part="1" 
AR Path="/5ED6635F/5F597E2F" Ref="#PWR?"  Part="1" 
AR Path="/5ED65121/5F597E2F" Ref="#PWR?"  Part="1" 
AR Path="/5ED64706/5F597E2F" Ref="#PWR016"  Part="1" 
AR Path="/5ED66DA7/5F597E2F" Ref="#PWR?"  Part="1" 
AR Path="/5ED6832A/5F597E2F" Ref="#PWR?"  Part="1" 
F 0 "#PWR016" H 3500 4250 39  0001 C CNN
F 1 "GND" H 3505 4327 39  0000 C CNN
F 2 "" H 3500 4500 39  0001 C CNN
F 3 "" H 3500 4500 39  0001 C CNN
	1    3500 4500
	1    0    0    -1  
$EndComp
$Comp
L Device:R_Small R?
U 1 1 5F597E35
P 3500 4400
AR Path="/5ED67AD9/5F1DE120/5F597E35" Ref="R?"  Part="1" 
AR Path="/5ED6635F/5F1DE120/5F597E35" Ref="R?"  Part="1" 
AR Path="/5ED65121/5F1DE120/5F597E35" Ref="R?"  Part="1" 
AR Path="/5ED64706/5F1DE120/5F597E35" Ref="R?"  Part="1" 
AR Path="/5ED66DA7/5F1DE120/5F597E35" Ref="R?"  Part="1" 
AR Path="/5ED6832A/5F1DE120/5F597E35" Ref="R?"  Part="1" 
AR Path="/5ED67AD9/5F597E35" Ref="R?"  Part="1" 
AR Path="/5ED6635F/5F597E35" Ref="R?"  Part="1" 
AR Path="/5ED65121/5F597E35" Ref="R?"  Part="1" 
AR Path="/5ED64706/5F597E35" Ref="R3"  Part="1" 
AR Path="/5ED66DA7/5F597E35" Ref="R?"  Part="1" 
AR Path="/5ED6832A/5F597E35" Ref="R?"  Part="1" 
F 0 "R3" H 3559 4446 39  0000 L CNN
F 1 "10k" H 3559 4355 39  0000 L CNN
F 2 "Resistor_SMD:R_0603_1608Metric" H 3500 4400 39  0001 C CNN
F 3 "~" H 3500 4400 39  0001 C CNN
	1    3500 4400
	1    0    0    -1  
$EndComp
Wire Wire Line
	3700 4200 3500 4200
$Comp
L power:GND #PWR?
U 1 1 5F597E3C
P 4000 4500
AR Path="/5ED5ED9C/5F597E3C" Ref="#PWR?"  Part="1" 
AR Path="/5ED70004/5F597E3C" Ref="#PWR?"  Part="1" 
AR Path="/5ED71B98/5F597E3C" Ref="#PWR?"  Part="1" 
AR Path="/5ED71E6C/5F597E3C" Ref="#PWR?"  Part="1" 
AR Path="/5ED721CA/5F597E3C" Ref="#PWR?"  Part="1" 
AR Path="/5ED73666/5F597E3C" Ref="#PWR?"  Part="1" 
AR Path="/5ED7366A/5F597E3C" Ref="#PWR?"  Part="1" 
AR Path="/5ED7C65E/5F597E3C" Ref="#PWR?"  Part="1" 
AR Path="/5ED7C902/5F597E3C" Ref="#PWR?"  Part="1" 
AR Path="/5ED7CB90/5F597E3C" Ref="#PWR?"  Part="1" 
AR Path="/5ED7CDDE/5F597E3C" Ref="#PWR?"  Part="1" 
AR Path="/5ED7D240/5F597E3C" Ref="#PWR?"  Part="1" 
AR Path="/5EDB009B/5F597E3C" Ref="#PWR?"  Part="1" 
AR Path="/5F597E3C" Ref="#PWR?"  Part="1" 
AR Path="/5ED64706/5F597E3C" Ref="#PWR018"  Part="1" 
AR Path="/5ED65121/5F597E3C" Ref="#PWR?"  Part="1" 
AR Path="/5ED6635F/5F597E3C" Ref="#PWR?"  Part="1" 
AR Path="/5ED66DA7/5F597E3C" Ref="#PWR?"  Part="1" 
AR Path="/5ED67AD9/5F597E3C" Ref="#PWR?"  Part="1" 
AR Path="/5ED6832A/5F597E3C" Ref="#PWR?"  Part="1" 
F 0 "#PWR018" H 4000 4250 50  0001 C CNN
F 1 "GND" H 4005 4327 39  0000 C CNN
F 2 "" H 4000 4500 50  0001 C CNN
F 3 "" H 4000 4500 50  0001 C CNN
	1    4000 4500
	1    0    0    -1  
$EndComp
Wire Wire Line
	4000 4500 4000 4400
Wire Wire Line
	3500 4200 3400 4200
Connection ~ 3500 4200
$Comp
L Device:Q_NMOS_GSD Q?
U 1 1 5F59A009
P 5400 4200
AR Path="/5ED67AD9/5F1DE120/5F59A009" Ref="Q?"  Part="1" 
AR Path="/5ED6635F/5F1DE120/5F59A009" Ref="Q?"  Part="1" 
AR Path="/5ED65121/5F1DE120/5F59A009" Ref="Q?"  Part="1" 
AR Path="/5ED64706/5F1DE120/5F59A009" Ref="Q?"  Part="1" 
AR Path="/5ED66DA7/5F1DE120/5F59A009" Ref="Q?"  Part="1" 
AR Path="/5ED6832A/5F1DE120/5F59A009" Ref="Q?"  Part="1" 
AR Path="/5ED67AD9/5F59A009" Ref="Q?"  Part="1" 
AR Path="/5ED6635F/5F59A009" Ref="Q?"  Part="1" 
AR Path="/5ED65121/5F59A009" Ref="Q?"  Part="1" 
AR Path="/5ED64706/5F59A009" Ref="Q3"  Part="1" 
AR Path="/5ED66DA7/5F59A009" Ref="Q?"  Part="1" 
AR Path="/5ED6832A/5F59A009" Ref="Q?"  Part="1" 
F 0 "Q3" H 5604 4246 39  0000 L CNN
F 1 "Si2302CDS" H 5604 4155 39  0000 L CNN
F 2 "Package_TO_SOT_SMD:SOT-23" H 5600 4300 50  0001 C CNN
F 3 "https://eu.mouser.com/datasheet/2/427/si2302cds-1764899.pdf" H 5400 4200 50  0001 C CNN
	1    5400 4200
	1    0    0    -1  
$EndComp
Text HLabel 4900 4200 0    39   Input ~ 0
F3
Wire Wire Line
	5000 4300 5000 4200
$Comp
L power:GND #PWR?
U 1 1 5F59A011
P 5000 4500
AR Path="/5ED67AD9/5F1DE120/5F59A011" Ref="#PWR?"  Part="1" 
AR Path="/5ED6635F/5F1DE120/5F59A011" Ref="#PWR?"  Part="1" 
AR Path="/5ED65121/5F1DE120/5F59A011" Ref="#PWR?"  Part="1" 
AR Path="/5ED64706/5F1DE120/5F59A011" Ref="#PWR?"  Part="1" 
AR Path="/5ED66DA7/5F1DE120/5F59A011" Ref="#PWR?"  Part="1" 
AR Path="/5ED6832A/5F1DE120/5F59A011" Ref="#PWR?"  Part="1" 
AR Path="/5ED67AD9/5F59A011" Ref="#PWR?"  Part="1" 
AR Path="/5ED6635F/5F59A011" Ref="#PWR?"  Part="1" 
AR Path="/5ED65121/5F59A011" Ref="#PWR?"  Part="1" 
AR Path="/5ED64706/5F59A011" Ref="#PWR019"  Part="1" 
AR Path="/5ED66DA7/5F59A011" Ref="#PWR?"  Part="1" 
AR Path="/5ED6832A/5F59A011" Ref="#PWR?"  Part="1" 
F 0 "#PWR019" H 5000 4250 39  0001 C CNN
F 1 "GND" H 5005 4327 39  0000 C CNN
F 2 "" H 5000 4500 39  0001 C CNN
F 3 "" H 5000 4500 39  0001 C CNN
	1    5000 4500
	1    0    0    -1  
$EndComp
$Comp
L Device:R_Small R?
U 1 1 5F59A017
P 5000 4400
AR Path="/5ED67AD9/5F1DE120/5F59A017" Ref="R?"  Part="1" 
AR Path="/5ED6635F/5F1DE120/5F59A017" Ref="R?"  Part="1" 
AR Path="/5ED65121/5F1DE120/5F59A017" Ref="R?"  Part="1" 
AR Path="/5ED64706/5F1DE120/5F59A017" Ref="R?"  Part="1" 
AR Path="/5ED66DA7/5F1DE120/5F59A017" Ref="R?"  Part="1" 
AR Path="/5ED6832A/5F1DE120/5F59A017" Ref="R?"  Part="1" 
AR Path="/5ED67AD9/5F59A017" Ref="R?"  Part="1" 
AR Path="/5ED6635F/5F59A017" Ref="R?"  Part="1" 
AR Path="/5ED65121/5F59A017" Ref="R?"  Part="1" 
AR Path="/5ED64706/5F59A017" Ref="R4"  Part="1" 
AR Path="/5ED66DA7/5F59A017" Ref="R?"  Part="1" 
AR Path="/5ED6832A/5F59A017" Ref="R?"  Part="1" 
F 0 "R4" H 5059 4446 39  0000 L CNN
F 1 "10k" H 5059 4355 39  0000 L CNN
F 2 "Resistor_SMD:R_0603_1608Metric" H 5000 4400 39  0001 C CNN
F 3 "~" H 5000 4400 39  0001 C CNN
	1    5000 4400
	1    0    0    -1  
$EndComp
Wire Wire Line
	5200 4200 5000 4200
$Comp
L power:GND #PWR?
U 1 1 5F59A01E
P 5500 4500
AR Path="/5ED5ED9C/5F59A01E" Ref="#PWR?"  Part="1" 
AR Path="/5ED70004/5F59A01E" Ref="#PWR?"  Part="1" 
AR Path="/5ED71B98/5F59A01E" Ref="#PWR?"  Part="1" 
AR Path="/5ED71E6C/5F59A01E" Ref="#PWR?"  Part="1" 
AR Path="/5ED721CA/5F59A01E" Ref="#PWR?"  Part="1" 
AR Path="/5ED73666/5F59A01E" Ref="#PWR?"  Part="1" 
AR Path="/5ED7366A/5F59A01E" Ref="#PWR?"  Part="1" 
AR Path="/5ED7C65E/5F59A01E" Ref="#PWR?"  Part="1" 
AR Path="/5ED7C902/5F59A01E" Ref="#PWR?"  Part="1" 
AR Path="/5ED7CB90/5F59A01E" Ref="#PWR?"  Part="1" 
AR Path="/5ED7CDDE/5F59A01E" Ref="#PWR?"  Part="1" 
AR Path="/5ED7D240/5F59A01E" Ref="#PWR?"  Part="1" 
AR Path="/5EDB009B/5F59A01E" Ref="#PWR?"  Part="1" 
AR Path="/5F59A01E" Ref="#PWR?"  Part="1" 
AR Path="/5ED64706/5F59A01E" Ref="#PWR021"  Part="1" 
AR Path="/5ED65121/5F59A01E" Ref="#PWR?"  Part="1" 
AR Path="/5ED6635F/5F59A01E" Ref="#PWR?"  Part="1" 
AR Path="/5ED66DA7/5F59A01E" Ref="#PWR?"  Part="1" 
AR Path="/5ED67AD9/5F59A01E" Ref="#PWR?"  Part="1" 
AR Path="/5ED6832A/5F59A01E" Ref="#PWR?"  Part="1" 
F 0 "#PWR021" H 5500 4250 50  0001 C CNN
F 1 "GND" H 5505 4327 39  0000 C CNN
F 2 "" H 5500 4500 50  0001 C CNN
F 3 "" H 5500 4500 50  0001 C CNN
	1    5500 4500
	1    0    0    -1  
$EndComp
Wire Wire Line
	5500 4500 5500 4400
Wire Wire Line
	5000 4200 4900 4200
Connection ~ 5000 4200
$Comp
L Device:Q_NMOS_GSD Q?
U 1 1 5F59BE38
P 6900 4200
AR Path="/5ED67AD9/5F1DE120/5F59BE38" Ref="Q?"  Part="1" 
AR Path="/5ED6635F/5F1DE120/5F59BE38" Ref="Q?"  Part="1" 
AR Path="/5ED65121/5F1DE120/5F59BE38" Ref="Q?"  Part="1" 
AR Path="/5ED64706/5F1DE120/5F59BE38" Ref="Q?"  Part="1" 
AR Path="/5ED66DA7/5F1DE120/5F59BE38" Ref="Q?"  Part="1" 
AR Path="/5ED6832A/5F1DE120/5F59BE38" Ref="Q?"  Part="1" 
AR Path="/5ED67AD9/5F59BE38" Ref="Q?"  Part="1" 
AR Path="/5ED6635F/5F59BE38" Ref="Q?"  Part="1" 
AR Path="/5ED65121/5F59BE38" Ref="Q?"  Part="1" 
AR Path="/5ED64706/5F59BE38" Ref="Q4"  Part="1" 
AR Path="/5ED66DA7/5F59BE38" Ref="Q?"  Part="1" 
AR Path="/5ED6832A/5F59BE38" Ref="Q?"  Part="1" 
F 0 "Q4" H 7104 4246 39  0000 L CNN
F 1 "Si2302CDS" H 7104 4155 39  0000 L CNN
F 2 "Package_TO_SOT_SMD:SOT-23" H 7100 4300 50  0001 C CNN
F 3 "https://eu.mouser.com/datasheet/2/427/si2302cds-1764899.pdf" H 6900 4200 50  0001 C CNN
	1    6900 4200
	1    0    0    -1  
$EndComp
Text HLabel 6400 4200 0    39   Input ~ 0
F4
Wire Wire Line
	6500 4300 6500 4200
$Comp
L power:GND #PWR?
U 1 1 5F59BE40
P 6500 4500
AR Path="/5ED67AD9/5F1DE120/5F59BE40" Ref="#PWR?"  Part="1" 
AR Path="/5ED6635F/5F1DE120/5F59BE40" Ref="#PWR?"  Part="1" 
AR Path="/5ED65121/5F1DE120/5F59BE40" Ref="#PWR?"  Part="1" 
AR Path="/5ED64706/5F1DE120/5F59BE40" Ref="#PWR?"  Part="1" 
AR Path="/5ED66DA7/5F1DE120/5F59BE40" Ref="#PWR?"  Part="1" 
AR Path="/5ED6832A/5F1DE120/5F59BE40" Ref="#PWR?"  Part="1" 
AR Path="/5ED67AD9/5F59BE40" Ref="#PWR?"  Part="1" 
AR Path="/5ED6635F/5F59BE40" Ref="#PWR?"  Part="1" 
AR Path="/5ED65121/5F59BE40" Ref="#PWR?"  Part="1" 
AR Path="/5ED64706/5F59BE40" Ref="#PWR022"  Part="1" 
AR Path="/5ED66DA7/5F59BE40" Ref="#PWR?"  Part="1" 
AR Path="/5ED6832A/5F59BE40" Ref="#PWR?"  Part="1" 
F 0 "#PWR022" H 6500 4250 39  0001 C CNN
F 1 "GND" H 6505 4327 39  0000 C CNN
F 2 "" H 6500 4500 39  0001 C CNN
F 3 "" H 6500 4500 39  0001 C CNN
	1    6500 4500
	1    0    0    -1  
$EndComp
$Comp
L Device:R_Small R?
U 1 1 5F59BE46
P 6500 4400
AR Path="/5ED67AD9/5F1DE120/5F59BE46" Ref="R?"  Part="1" 
AR Path="/5ED6635F/5F1DE120/5F59BE46" Ref="R?"  Part="1" 
AR Path="/5ED65121/5F1DE120/5F59BE46" Ref="R?"  Part="1" 
AR Path="/5ED64706/5F1DE120/5F59BE46" Ref="R?"  Part="1" 
AR Path="/5ED66DA7/5F1DE120/5F59BE46" Ref="R?"  Part="1" 
AR Path="/5ED6832A/5F1DE120/5F59BE46" Ref="R?"  Part="1" 
AR Path="/5ED67AD9/5F59BE46" Ref="R?"  Part="1" 
AR Path="/5ED6635F/5F59BE46" Ref="R?"  Part="1" 
AR Path="/5ED65121/5F59BE46" Ref="R?"  Part="1" 
AR Path="/5ED64706/5F59BE46" Ref="R5"  Part="1" 
AR Path="/5ED66DA7/5F59BE46" Ref="R?"  Part="1" 
AR Path="/5ED6832A/5F59BE46" Ref="R?"  Part="1" 
F 0 "R5" H 6559 4446 39  0000 L CNN
F 1 "10k" H 6559 4355 39  0000 L CNN
F 2 "Resistor_SMD:R_0603_1608Metric" H 6500 4400 39  0001 C CNN
F 3 "~" H 6500 4400 39  0001 C CNN
	1    6500 4400
	1    0    0    -1  
$EndComp
Wire Wire Line
	6700 4200 6500 4200
$Comp
L power:GND #PWR?
U 1 1 5F59BE4D
P 7000 4500
AR Path="/5ED5ED9C/5F59BE4D" Ref="#PWR?"  Part="1" 
AR Path="/5ED70004/5F59BE4D" Ref="#PWR?"  Part="1" 
AR Path="/5ED71B98/5F59BE4D" Ref="#PWR?"  Part="1" 
AR Path="/5ED71E6C/5F59BE4D" Ref="#PWR?"  Part="1" 
AR Path="/5ED721CA/5F59BE4D" Ref="#PWR?"  Part="1" 
AR Path="/5ED73666/5F59BE4D" Ref="#PWR?"  Part="1" 
AR Path="/5ED7366A/5F59BE4D" Ref="#PWR?"  Part="1" 
AR Path="/5ED7C65E/5F59BE4D" Ref="#PWR?"  Part="1" 
AR Path="/5ED7C902/5F59BE4D" Ref="#PWR?"  Part="1" 
AR Path="/5ED7CB90/5F59BE4D" Ref="#PWR?"  Part="1" 
AR Path="/5ED7CDDE/5F59BE4D" Ref="#PWR?"  Part="1" 
AR Path="/5ED7D240/5F59BE4D" Ref="#PWR?"  Part="1" 
AR Path="/5EDB009B/5F59BE4D" Ref="#PWR?"  Part="1" 
AR Path="/5F59BE4D" Ref="#PWR?"  Part="1" 
AR Path="/5ED64706/5F59BE4D" Ref="#PWR024"  Part="1" 
AR Path="/5ED65121/5F59BE4D" Ref="#PWR?"  Part="1" 
AR Path="/5ED6635F/5F59BE4D" Ref="#PWR?"  Part="1" 
AR Path="/5ED66DA7/5F59BE4D" Ref="#PWR?"  Part="1" 
AR Path="/5ED67AD9/5F59BE4D" Ref="#PWR?"  Part="1" 
AR Path="/5ED6832A/5F59BE4D" Ref="#PWR?"  Part="1" 
F 0 "#PWR024" H 7000 4250 50  0001 C CNN
F 1 "GND" H 7005 4327 39  0000 C CNN
F 2 "" H 7000 4500 50  0001 C CNN
F 3 "" H 7000 4500 50  0001 C CNN
	1    7000 4500
	1    0    0    -1  
$EndComp
Wire Wire Line
	7000 4500 7000 4400
Wire Wire Line
	6500 4200 6400 4200
Connection ~ 6500 4200
$Comp
L Device:Q_NMOS_GSD Q?
U 1 1 5F59E686
P 8400 4200
AR Path="/5ED67AD9/5F1DE120/5F59E686" Ref="Q?"  Part="1" 
AR Path="/5ED6635F/5F1DE120/5F59E686" Ref="Q?"  Part="1" 
AR Path="/5ED65121/5F1DE120/5F59E686" Ref="Q?"  Part="1" 
AR Path="/5ED64706/5F1DE120/5F59E686" Ref="Q?"  Part="1" 
AR Path="/5ED66DA7/5F1DE120/5F59E686" Ref="Q?"  Part="1" 
AR Path="/5ED6832A/5F1DE120/5F59E686" Ref="Q?"  Part="1" 
AR Path="/5ED67AD9/5F59E686" Ref="Q?"  Part="1" 
AR Path="/5ED6635F/5F59E686" Ref="Q?"  Part="1" 
AR Path="/5ED65121/5F59E686" Ref="Q?"  Part="1" 
AR Path="/5ED64706/5F59E686" Ref="Q5"  Part="1" 
AR Path="/5ED66DA7/5F59E686" Ref="Q?"  Part="1" 
AR Path="/5ED6832A/5F59E686" Ref="Q?"  Part="1" 
F 0 "Q5" H 8604 4246 39  0000 L CNN
F 1 "Si2302CDS" H 8604 4155 39  0000 L CNN
F 2 "Package_TO_SOT_SMD:SOT-23" H 8600 4300 50  0001 C CNN
F 3 "https://eu.mouser.com/datasheet/2/427/si2302cds-1764899.pdf" H 8400 4200 50  0001 C CNN
	1    8400 4200
	1    0    0    -1  
$EndComp
Text HLabel 7900 4200 0    39   Input ~ 0
F5
Wire Wire Line
	8000 4300 8000 4200
$Comp
L power:GND #PWR?
U 1 1 5F59E68E
P 8000 4500
AR Path="/5ED67AD9/5F1DE120/5F59E68E" Ref="#PWR?"  Part="1" 
AR Path="/5ED6635F/5F1DE120/5F59E68E" Ref="#PWR?"  Part="1" 
AR Path="/5ED65121/5F1DE120/5F59E68E" Ref="#PWR?"  Part="1" 
AR Path="/5ED64706/5F1DE120/5F59E68E" Ref="#PWR?"  Part="1" 
AR Path="/5ED66DA7/5F1DE120/5F59E68E" Ref="#PWR?"  Part="1" 
AR Path="/5ED6832A/5F1DE120/5F59E68E" Ref="#PWR?"  Part="1" 
AR Path="/5ED67AD9/5F59E68E" Ref="#PWR?"  Part="1" 
AR Path="/5ED6635F/5F59E68E" Ref="#PWR?"  Part="1" 
AR Path="/5ED65121/5F59E68E" Ref="#PWR?"  Part="1" 
AR Path="/5ED64706/5F59E68E" Ref="#PWR025"  Part="1" 
AR Path="/5ED66DA7/5F59E68E" Ref="#PWR?"  Part="1" 
AR Path="/5ED6832A/5F59E68E" Ref="#PWR?"  Part="1" 
F 0 "#PWR025" H 8000 4250 39  0001 C CNN
F 1 "GND" H 8005 4327 39  0000 C CNN
F 2 "" H 8000 4500 39  0001 C CNN
F 3 "" H 8000 4500 39  0001 C CNN
	1    8000 4500
	1    0    0    -1  
$EndComp
$Comp
L Device:R_Small R?
U 1 1 5F59E694
P 8000 4400
AR Path="/5ED67AD9/5F1DE120/5F59E694" Ref="R?"  Part="1" 
AR Path="/5ED6635F/5F1DE120/5F59E694" Ref="R?"  Part="1" 
AR Path="/5ED65121/5F1DE120/5F59E694" Ref="R?"  Part="1" 
AR Path="/5ED64706/5F1DE120/5F59E694" Ref="R?"  Part="1" 
AR Path="/5ED66DA7/5F1DE120/5F59E694" Ref="R?"  Part="1" 
AR Path="/5ED6832A/5F1DE120/5F59E694" Ref="R?"  Part="1" 
AR Path="/5ED67AD9/5F59E694" Ref="R?"  Part="1" 
AR Path="/5ED6635F/5F59E694" Ref="R?"  Part="1" 
AR Path="/5ED65121/5F59E694" Ref="R?"  Part="1" 
AR Path="/5ED64706/5F59E694" Ref="R6"  Part="1" 
AR Path="/5ED66DA7/5F59E694" Ref="R?"  Part="1" 
AR Path="/5ED6832A/5F59E694" Ref="R?"  Part="1" 
F 0 "R6" H 8059 4446 39  0000 L CNN
F 1 "10k" H 8059 4355 39  0000 L CNN
F 2 "Resistor_SMD:R_0603_1608Metric" H 8000 4400 39  0001 C CNN
F 3 "~" H 8000 4400 39  0001 C CNN
	1    8000 4400
	1    0    0    -1  
$EndComp
Wire Wire Line
	8200 4200 8000 4200
$Comp
L power:GND #PWR?
U 1 1 5F59E69B
P 8500 4500
AR Path="/5ED5ED9C/5F59E69B" Ref="#PWR?"  Part="1" 
AR Path="/5ED70004/5F59E69B" Ref="#PWR?"  Part="1" 
AR Path="/5ED71B98/5F59E69B" Ref="#PWR?"  Part="1" 
AR Path="/5ED71E6C/5F59E69B" Ref="#PWR?"  Part="1" 
AR Path="/5ED721CA/5F59E69B" Ref="#PWR?"  Part="1" 
AR Path="/5ED73666/5F59E69B" Ref="#PWR?"  Part="1" 
AR Path="/5ED7366A/5F59E69B" Ref="#PWR?"  Part="1" 
AR Path="/5ED7C65E/5F59E69B" Ref="#PWR?"  Part="1" 
AR Path="/5ED7C902/5F59E69B" Ref="#PWR?"  Part="1" 
AR Path="/5ED7CB90/5F59E69B" Ref="#PWR?"  Part="1" 
AR Path="/5ED7CDDE/5F59E69B" Ref="#PWR?"  Part="1" 
AR Path="/5ED7D240/5F59E69B" Ref="#PWR?"  Part="1" 
AR Path="/5EDB009B/5F59E69B" Ref="#PWR?"  Part="1" 
AR Path="/5F59E69B" Ref="#PWR?"  Part="1" 
AR Path="/5ED64706/5F59E69B" Ref="#PWR027"  Part="1" 
AR Path="/5ED65121/5F59E69B" Ref="#PWR?"  Part="1" 
AR Path="/5ED6635F/5F59E69B" Ref="#PWR?"  Part="1" 
AR Path="/5ED66DA7/5F59E69B" Ref="#PWR?"  Part="1" 
AR Path="/5ED67AD9/5F59E69B" Ref="#PWR?"  Part="1" 
AR Path="/5ED6832A/5F59E69B" Ref="#PWR?"  Part="1" 
F 0 "#PWR027" H 8500 4250 50  0001 C CNN
F 1 "GND" H 8505 4327 39  0000 C CNN
F 2 "" H 8500 4500 50  0001 C CNN
F 3 "" H 8500 4500 50  0001 C CNN
	1    8500 4500
	1    0    0    -1  
$EndComp
Wire Wire Line
	8500 4500 8500 4400
Wire Wire Line
	8000 4200 7900 4200
Connection ~ 8000 4200
$Comp
L Device:Q_NMOS_GSD Q?
U 1 1 5F5A09A3
P 9900 4200
AR Path="/5ED67AD9/5F1DE120/5F5A09A3" Ref="Q?"  Part="1" 
AR Path="/5ED6635F/5F1DE120/5F5A09A3" Ref="Q?"  Part="1" 
AR Path="/5ED65121/5F1DE120/5F5A09A3" Ref="Q?"  Part="1" 
AR Path="/5ED64706/5F1DE120/5F5A09A3" Ref="Q?"  Part="1" 
AR Path="/5ED66DA7/5F1DE120/5F5A09A3" Ref="Q?"  Part="1" 
AR Path="/5ED6832A/5F1DE120/5F5A09A3" Ref="Q?"  Part="1" 
AR Path="/5ED67AD9/5F5A09A3" Ref="Q?"  Part="1" 
AR Path="/5ED6635F/5F5A09A3" Ref="Q?"  Part="1" 
AR Path="/5ED65121/5F5A09A3" Ref="Q?"  Part="1" 
AR Path="/5ED64706/5F5A09A3" Ref="Q6"  Part="1" 
AR Path="/5ED66DA7/5F5A09A3" Ref="Q?"  Part="1" 
AR Path="/5ED6832A/5F5A09A3" Ref="Q?"  Part="1" 
F 0 "Q6" H 10104 4246 39  0000 L CNN
F 1 "Si2302CDS" H 10104 4155 39  0000 L CNN
F 2 "Package_TO_SOT_SMD:SOT-23" H 10100 4300 50  0001 C CNN
F 3 "https://eu.mouser.com/datasheet/2/427/si2302cds-1764899.pdf" H 9900 4200 50  0001 C CNN
	1    9900 4200
	1    0    0    -1  
$EndComp
Text HLabel 9400 4200 0    39   Input ~ 0
F6
Wire Wire Line
	9500 4300 9500 4200
$Comp
L power:GND #PWR?
U 1 1 5F5A09AB
P 9500 4500
AR Path="/5ED67AD9/5F1DE120/5F5A09AB" Ref="#PWR?"  Part="1" 
AR Path="/5ED6635F/5F1DE120/5F5A09AB" Ref="#PWR?"  Part="1" 
AR Path="/5ED65121/5F1DE120/5F5A09AB" Ref="#PWR?"  Part="1" 
AR Path="/5ED64706/5F1DE120/5F5A09AB" Ref="#PWR?"  Part="1" 
AR Path="/5ED66DA7/5F1DE120/5F5A09AB" Ref="#PWR?"  Part="1" 
AR Path="/5ED6832A/5F1DE120/5F5A09AB" Ref="#PWR?"  Part="1" 
AR Path="/5ED67AD9/5F5A09AB" Ref="#PWR?"  Part="1" 
AR Path="/5ED6635F/5F5A09AB" Ref="#PWR?"  Part="1" 
AR Path="/5ED65121/5F5A09AB" Ref="#PWR?"  Part="1" 
AR Path="/5ED64706/5F5A09AB" Ref="#PWR028"  Part="1" 
AR Path="/5ED66DA7/5F5A09AB" Ref="#PWR?"  Part="1" 
AR Path="/5ED6832A/5F5A09AB" Ref="#PWR?"  Part="1" 
F 0 "#PWR028" H 9500 4250 39  0001 C CNN
F 1 "GND" H 9505 4327 39  0000 C CNN
F 2 "" H 9500 4500 39  0001 C CNN
F 3 "" H 9500 4500 39  0001 C CNN
	1    9500 4500
	1    0    0    -1  
$EndComp
$Comp
L Device:R_Small R?
U 1 1 5F5A09B1
P 9500 4400
AR Path="/5ED67AD9/5F1DE120/5F5A09B1" Ref="R?"  Part="1" 
AR Path="/5ED6635F/5F1DE120/5F5A09B1" Ref="R?"  Part="1" 
AR Path="/5ED65121/5F1DE120/5F5A09B1" Ref="R?"  Part="1" 
AR Path="/5ED64706/5F1DE120/5F5A09B1" Ref="R?"  Part="1" 
AR Path="/5ED66DA7/5F1DE120/5F5A09B1" Ref="R?"  Part="1" 
AR Path="/5ED6832A/5F1DE120/5F5A09B1" Ref="R?"  Part="1" 
AR Path="/5ED67AD9/5F5A09B1" Ref="R?"  Part="1" 
AR Path="/5ED6635F/5F5A09B1" Ref="R?"  Part="1" 
AR Path="/5ED65121/5F5A09B1" Ref="R?"  Part="1" 
AR Path="/5ED64706/5F5A09B1" Ref="R7"  Part="1" 
AR Path="/5ED66DA7/5F5A09B1" Ref="R?"  Part="1" 
AR Path="/5ED6832A/5F5A09B1" Ref="R?"  Part="1" 
F 0 "R7" H 9559 4446 39  0000 L CNN
F 1 "10k" H 9559 4355 39  0000 L CNN
F 2 "Resistor_SMD:R_0603_1608Metric" H 9500 4400 39  0001 C CNN
F 3 "~" H 9500 4400 39  0001 C CNN
	1    9500 4400
	1    0    0    -1  
$EndComp
Wire Wire Line
	9700 4200 9500 4200
$Comp
L power:GND #PWR?
U 1 1 5F5A09B8
P 10000 4500
AR Path="/5ED5ED9C/5F5A09B8" Ref="#PWR?"  Part="1" 
AR Path="/5ED70004/5F5A09B8" Ref="#PWR?"  Part="1" 
AR Path="/5ED71B98/5F5A09B8" Ref="#PWR?"  Part="1" 
AR Path="/5ED71E6C/5F5A09B8" Ref="#PWR?"  Part="1" 
AR Path="/5ED721CA/5F5A09B8" Ref="#PWR?"  Part="1" 
AR Path="/5ED73666/5F5A09B8" Ref="#PWR?"  Part="1" 
AR Path="/5ED7366A/5F5A09B8" Ref="#PWR?"  Part="1" 
AR Path="/5ED7C65E/5F5A09B8" Ref="#PWR?"  Part="1" 
AR Path="/5ED7C902/5F5A09B8" Ref="#PWR?"  Part="1" 
AR Path="/5ED7CB90/5F5A09B8" Ref="#PWR?"  Part="1" 
AR Path="/5ED7CDDE/5F5A09B8" Ref="#PWR?"  Part="1" 
AR Path="/5ED7D240/5F5A09B8" Ref="#PWR?"  Part="1" 
AR Path="/5EDB009B/5F5A09B8" Ref="#PWR?"  Part="1" 
AR Path="/5F5A09B8" Ref="#PWR?"  Part="1" 
AR Path="/5ED64706/5F5A09B8" Ref="#PWR030"  Part="1" 
AR Path="/5ED65121/5F5A09B8" Ref="#PWR?"  Part="1" 
AR Path="/5ED6635F/5F5A09B8" Ref="#PWR?"  Part="1" 
AR Path="/5ED66DA7/5F5A09B8" Ref="#PWR?"  Part="1" 
AR Path="/5ED67AD9/5F5A09B8" Ref="#PWR?"  Part="1" 
AR Path="/5ED6832A/5F5A09B8" Ref="#PWR?"  Part="1" 
F 0 "#PWR030" H 10000 4250 50  0001 C CNN
F 1 "GND" H 10005 4327 39  0000 C CNN
F 2 "" H 10000 4500 50  0001 C CNN
F 3 "" H 10000 4500 50  0001 C CNN
	1    10000 4500
	1    0    0    -1  
$EndComp
Wire Wire Line
	10000 4500 10000 4400
Wire Wire Line
	9500 4200 9400 4200
Connection ~ 9500 4200
$Comp
L power:+5V #PWR?
U 1 1 5F5B791C
P 4000 3150
AR Path="/5F5B791C" Ref="#PWR?"  Part="1" 
AR Path="/5ED5ED9C/5F5B791C" Ref="#PWR?"  Part="1" 
AR Path="/5ED73666/5F5B791C" Ref="#PWR?"  Part="1" 
AR Path="/5ED721CA/5F5B791C" Ref="#PWR?"  Part="1" 
AR Path="/5ED71E6C/5F5B791C" Ref="#PWR?"  Part="1" 
AR Path="/5ED70004/5F5B791C" Ref="#PWR?"  Part="1" 
AR Path="/5ED71B98/5F5B791C" Ref="#PWR?"  Part="1" 
AR Path="/5EDB009B/5F5B791C" Ref="#PWR?"  Part="1" 
AR Path="/5ED64706/5F5B791C" Ref="#PWR017"  Part="1" 
AR Path="/5ED65121/5F5B791C" Ref="#PWR?"  Part="1" 
AR Path="/5ED6635F/5F5B791C" Ref="#PWR?"  Part="1" 
AR Path="/5ED66DA7/5F5B791C" Ref="#PWR?"  Part="1" 
AR Path="/5ED67AD9/5F5B791C" Ref="#PWR?"  Part="1" 
AR Path="/5ED6832A/5F5B791C" Ref="#PWR?"  Part="1" 
F 0 "#PWR017" H 4000 3000 50  0001 C CNN
F 1 "+5V" H 4000 3300 39  0000 C CNN
F 2 "" H 4000 3150 50  0001 C CNN
F 3 "" H 4000 3150 50  0001 C CNN
	1    4000 3150
	1    0    0    -1  
$EndComp
Wire Notes Line
	4050 3500 3950 3500
Wire Notes Line
	3950 3500 3950 3650
Wire Notes Line
	3950 3650 4050 3650
Wire Notes Line
	4050 3650 4050 3500
Wire Notes Line
	4000 3650 4000 3800
$Comp
L power:+5V #PWR?
U 1 1 5F5B88A6
P 5500 3150
AR Path="/5F5B88A6" Ref="#PWR?"  Part="1" 
AR Path="/5ED5ED9C/5F5B88A6" Ref="#PWR?"  Part="1" 
AR Path="/5ED73666/5F5B88A6" Ref="#PWR?"  Part="1" 
AR Path="/5ED721CA/5F5B88A6" Ref="#PWR?"  Part="1" 
AR Path="/5ED71E6C/5F5B88A6" Ref="#PWR?"  Part="1" 
AR Path="/5ED70004/5F5B88A6" Ref="#PWR?"  Part="1" 
AR Path="/5ED71B98/5F5B88A6" Ref="#PWR?"  Part="1" 
AR Path="/5EDB009B/5F5B88A6" Ref="#PWR?"  Part="1" 
AR Path="/5ED64706/5F5B88A6" Ref="#PWR020"  Part="1" 
AR Path="/5ED65121/5F5B88A6" Ref="#PWR?"  Part="1" 
AR Path="/5ED6635F/5F5B88A6" Ref="#PWR?"  Part="1" 
AR Path="/5ED66DA7/5F5B88A6" Ref="#PWR?"  Part="1" 
AR Path="/5ED67AD9/5F5B88A6" Ref="#PWR?"  Part="1" 
AR Path="/5ED6832A/5F5B88A6" Ref="#PWR?"  Part="1" 
F 0 "#PWR020" H 5500 3000 50  0001 C CNN
F 1 "+5V" H 5500 3300 39  0000 C CNN
F 2 "" H 5500 3150 50  0001 C CNN
F 3 "" H 5500 3150 50  0001 C CNN
	1    5500 3150
	1    0    0    -1  
$EndComp
Wire Notes Line
	5550 3500 5450 3500
Wire Notes Line
	5450 3500 5450 3650
Wire Notes Line
	5450 3650 5550 3650
Wire Notes Line
	5550 3650 5550 3500
Wire Notes Line
	5500 3650 5500 3800
$Comp
L power:+5V #PWR?
U 1 1 5F5BA11B
P 7000 3150
AR Path="/5F5BA11B" Ref="#PWR?"  Part="1" 
AR Path="/5ED5ED9C/5F5BA11B" Ref="#PWR?"  Part="1" 
AR Path="/5ED73666/5F5BA11B" Ref="#PWR?"  Part="1" 
AR Path="/5ED721CA/5F5BA11B" Ref="#PWR?"  Part="1" 
AR Path="/5ED71E6C/5F5BA11B" Ref="#PWR?"  Part="1" 
AR Path="/5ED70004/5F5BA11B" Ref="#PWR?"  Part="1" 
AR Path="/5ED71B98/5F5BA11B" Ref="#PWR?"  Part="1" 
AR Path="/5EDB009B/5F5BA11B" Ref="#PWR?"  Part="1" 
AR Path="/5ED64706/5F5BA11B" Ref="#PWR023"  Part="1" 
AR Path="/5ED65121/5F5BA11B" Ref="#PWR?"  Part="1" 
AR Path="/5ED6635F/5F5BA11B" Ref="#PWR?"  Part="1" 
AR Path="/5ED66DA7/5F5BA11B" Ref="#PWR?"  Part="1" 
AR Path="/5ED67AD9/5F5BA11B" Ref="#PWR?"  Part="1" 
AR Path="/5ED6832A/5F5BA11B" Ref="#PWR?"  Part="1" 
F 0 "#PWR023" H 7000 3000 50  0001 C CNN
F 1 "+5V" H 7000 3300 39  0000 C CNN
F 2 "" H 7000 3150 50  0001 C CNN
F 3 "" H 7000 3150 50  0001 C CNN
	1    7000 3150
	1    0    0    -1  
$EndComp
Wire Notes Line
	7050 3500 6950 3500
Wire Notes Line
	6950 3500 6950 3650
Wire Notes Line
	6950 3650 7050 3650
Wire Notes Line
	7050 3650 7050 3500
Wire Notes Line
	7000 3650 7000 3800
$Comp
L power:+5V #PWR?
U 1 1 5F5BB06F
P 8500 3150
AR Path="/5F5BB06F" Ref="#PWR?"  Part="1" 
AR Path="/5ED5ED9C/5F5BB06F" Ref="#PWR?"  Part="1" 
AR Path="/5ED73666/5F5BB06F" Ref="#PWR?"  Part="1" 
AR Path="/5ED721CA/5F5BB06F" Ref="#PWR?"  Part="1" 
AR Path="/5ED71E6C/5F5BB06F" Ref="#PWR?"  Part="1" 
AR Path="/5ED70004/5F5BB06F" Ref="#PWR?"  Part="1" 
AR Path="/5ED71B98/5F5BB06F" Ref="#PWR?"  Part="1" 
AR Path="/5EDB009B/5F5BB06F" Ref="#PWR?"  Part="1" 
AR Path="/5ED64706/5F5BB06F" Ref="#PWR026"  Part="1" 
AR Path="/5ED65121/5F5BB06F" Ref="#PWR?"  Part="1" 
AR Path="/5ED6635F/5F5BB06F" Ref="#PWR?"  Part="1" 
AR Path="/5ED66DA7/5F5BB06F" Ref="#PWR?"  Part="1" 
AR Path="/5ED67AD9/5F5BB06F" Ref="#PWR?"  Part="1" 
AR Path="/5ED6832A/5F5BB06F" Ref="#PWR?"  Part="1" 
F 0 "#PWR026" H 8500 3000 50  0001 C CNN
F 1 "+5V" H 8500 3300 39  0000 C CNN
F 2 "" H 8500 3150 50  0001 C CNN
F 3 "" H 8500 3150 50  0001 C CNN
	1    8500 3150
	1    0    0    -1  
$EndComp
Wire Notes Line
	8550 3500 8450 3500
Wire Notes Line
	8450 3500 8450 3650
Wire Notes Line
	8450 3650 8550 3650
Wire Notes Line
	8550 3650 8550 3500
Wire Notes Line
	8500 3650 8500 3800
$Comp
L power:+5V #PWR?
U 1 1 5F5BC8DC
P 10000 3150
AR Path="/5F5BC8DC" Ref="#PWR?"  Part="1" 
AR Path="/5ED5ED9C/5F5BC8DC" Ref="#PWR?"  Part="1" 
AR Path="/5ED73666/5F5BC8DC" Ref="#PWR?"  Part="1" 
AR Path="/5ED721CA/5F5BC8DC" Ref="#PWR?"  Part="1" 
AR Path="/5ED71E6C/5F5BC8DC" Ref="#PWR?"  Part="1" 
AR Path="/5ED70004/5F5BC8DC" Ref="#PWR?"  Part="1" 
AR Path="/5ED71B98/5F5BC8DC" Ref="#PWR?"  Part="1" 
AR Path="/5EDB009B/5F5BC8DC" Ref="#PWR?"  Part="1" 
AR Path="/5ED64706/5F5BC8DC" Ref="#PWR029"  Part="1" 
AR Path="/5ED65121/5F5BC8DC" Ref="#PWR?"  Part="1" 
AR Path="/5ED6635F/5F5BC8DC" Ref="#PWR?"  Part="1" 
AR Path="/5ED66DA7/5F5BC8DC" Ref="#PWR?"  Part="1" 
AR Path="/5ED67AD9/5F5BC8DC" Ref="#PWR?"  Part="1" 
AR Path="/5ED6832A/5F5BC8DC" Ref="#PWR?"  Part="1" 
F 0 "#PWR029" H 10000 3000 50  0001 C CNN
F 1 "+5V" H 10000 3300 39  0000 C CNN
F 2 "" H 10000 3150 50  0001 C CNN
F 3 "" H 10000 3150 50  0001 C CNN
	1    10000 3150
	1    0    0    -1  
$EndComp
Wire Notes Line
	10050 3500 9950 3500
Wire Notes Line
	9950 3500 9950 3650
Wire Notes Line
	9950 3650 10050 3650
Wire Notes Line
	10050 3650 10050 3500
Wire Notes Line
	10000 3650 10000 3800
Wire Notes Line
	10000 3500 10000 3350
Wire Notes Line
	8500 3500 8500 3350
Wire Notes Line
	7000 3500 7000 3350
Wire Notes Line
	5500 3500 5500 3350
Wire Notes Line
	4000 3500 4000 3350
$Comp
L Connector_Generic:Conn_01x01 J5
U 1 1 5F768401
P 5500 3350
F 0 "J5" V 5464 3262 50  0000 R CNN
F 1 "M5" V 5373 3262 50  0000 R CNN
F 2 "LEGOS:WP-SMBU_Wuerth_7466105" H 5500 3350 50  0001 C CNN
F 3 "https://www.we-online.com/catalog/datasheet/7466105.pdf" H 5500 3350 50  0001 C CNN
F 4 "7466105" V 2500 3350 50  0001 C CNN "Mfr"
	1    5500 3350
	0    -1   1    0   
$EndComp
$Comp
L Connector_Generic:Conn_01x01 J6
U 1 1 5F776702
P 5500 3800
F 0 "J6" V 5464 3712 50  0000 R CNN
F 1 "M5" V 5373 3712 50  0000 R CNN
F 2 "LEGOS:WP-SMBU_Wuerth_7466105" H 5500 3800 50  0001 C CNN
F 3 "https://www.we-online.com/catalog/datasheet/7466105.pdf" H 5500 3800 50  0001 C CNN
F 4 "7466105" V 2500 3350 50  0001 C CNN "Mfr"
	1    5500 3800
	0    -1   -1   0   
$EndComp
$Comp
L Connector_Generic:Conn_01x01 J7
U 1 1 5F7687E1
P 7000 3350
F 0 "J7" V 6964 3262 50  0000 R CNN
F 1 "M5" V 6873 3262 50  0000 R CNN
F 2 "LEGOS:WP-SMBU_Wuerth_7466105" H 7000 3350 50  0001 C CNN
F 3 "https://www.we-online.com/catalog/datasheet/7466105.pdf" H 7000 3350 50  0001 C CNN
F 4 "7466105" V 2500 3350 50  0001 C CNN "Mfr"
	1    7000 3350
	0    -1   1    0   
$EndComp
$Comp
L Connector_Generic:Conn_01x01 J8
U 1 1 5F776708
P 7000 3800
F 0 "J8" V 6964 3712 50  0000 R CNN
F 1 "M5" V 6873 3712 50  0000 R CNN
F 2 "LEGOS:WP-SMBU_Wuerth_7466105" H 7000 3800 50  0001 C CNN
F 3 "https://www.we-online.com/catalog/datasheet/7466105.pdf" H 7000 3800 50  0001 C CNN
F 4 "7466105" V 2500 3350 50  0001 C CNN "Mfr"
	1    7000 3800
	0    -1   -1   0   
$EndComp
$Comp
L Connector_Generic:Conn_01x01 J10
U 1 1 5F77670E
P 8500 3800
F 0 "J10" V 8464 3712 50  0000 R CNN
F 1 "M5" V 8373 3712 50  0000 R CNN
F 2 "LEGOS:WP-SMBU_Wuerth_7466105" H 8500 3800 50  0001 C CNN
F 3 "https://www.we-online.com/catalog/datasheet/7466105.pdf" H 8500 3800 50  0001 C CNN
F 4 "7466105" V 2500 3350 50  0001 C CNN "Mfr"
	1    8500 3800
	0    -1   -1   0   
$EndComp
$Comp
L Connector_Generic:Conn_01x01 J9
U 1 1 5F76927C
P 8500 3350
F 0 "J9" V 8464 3262 50  0000 R CNN
F 1 "M5" V 8373 3262 50  0000 R CNN
F 2 "LEGOS:WP-SMBU_Wuerth_7466105" H 8500 3350 50  0001 C CNN
F 3 "https://www.we-online.com/catalog/datasheet/7466105.pdf" H 8500 3350 50  0001 C CNN
F 4 "7466105" V 2500 3350 50  0001 C CNN "Mfr"
	1    8500 3350
	0    -1   1    0   
$EndComp
$Comp
L Connector_Generic:Conn_01x01 J12
U 1 1 5F776714
P 10000 3800
F 0 "J12" V 9964 3712 50  0000 R CNN
F 1 "M5" V 9873 3712 50  0000 R CNN
F 2 "LEGOS:WP-SMBU_Wuerth_7466105" H 10000 3800 50  0001 C CNN
F 3 "https://www.we-online.com/catalog/datasheet/7466105.pdf" H 10000 3800 50  0001 C CNN
F 4 "7466105" V 2500 3350 50  0001 C CNN "Mfr"
	1    10000 3800
	0    -1   -1   0   
$EndComp
$Comp
L Connector_Generic:Conn_01x01 J11
U 1 1 5F76971C
P 10000 3350
F 0 "J11" V 9964 3262 50  0000 R CNN
F 1 "M5" V 9873 3262 50  0000 R CNN
F 2 "LEGOS:WP-SMBU_Wuerth_7466105" H 10000 3350 50  0001 C CNN
F 3 "https://www.we-online.com/catalog/datasheet/7466105.pdf" H 10000 3350 50  0001 C CNN
F 4 "7466105" V 2500 3350 50  0001 C CNN "Mfr"
	1    10000 3350
	0    -1   1    0   
$EndComp
$Comp
L Connector_Generic:Conn_01x01 J4
U 1 1 5F7766FC
P 4000 3800
F 0 "J4" V 3964 3712 50  0000 R CNN
F 1 "M5" V 3873 3712 50  0000 R CNN
F 2 "LEGOS:WP-SMBU_Wuerth_7466105" H 4000 3800 50  0001 C CNN
F 3 "https://www.we-online.com/catalog/datasheet/7466105.pdf" H 4000 3800 50  0001 C CNN
F 4 "7466105" V 2500 3350 50  0001 C CNN "Mfr"
	1    4000 3800
	0    -1   -1   0   
$EndComp
$Comp
L Connector_Generic:Conn_01x01 J3
U 1 1 5F767E14
P 4000 3350
F 0 "J3" V 3964 3262 50  0000 R CNN
F 1 "M5" V 3873 3262 50  0000 R CNN
F 2 "LEGOS:WP-SMBU_Wuerth_7466105" H 4000 3350 50  0001 C CNN
F 3 "https://www.we-online.com/catalog/datasheet/7466105.pdf" H 4000 3350 50  0001 C CNN
F 4 "7466105" V 2500 3350 50  0001 C CNN "Mfr"
	1    4000 3350
	0    -1   1    0   
$EndComp
$Comp
L Connector_Generic:Conn_01x01 J2
U 1 1 5F7766F6
P 2500 3800
F 0 "J2" V 2464 3712 50  0000 R CNN
F 1 "M5" V 2373 3712 50  0000 R CNN
F 2 "LEGOS:WP-SMBU_Wuerth_7466105" H 2500 3800 50  0001 C CNN
F 3 "https://www.we-online.com/catalog/datasheet/7466105.pdf" H 2500 3800 50  0001 C CNN
F 4 "7466105" V 2500 3350 50  0001 C CNN "Mfr"
	1    2500 3800
	0    -1   -1   0   
$EndComp
$Comp
L Connector_Generic:Conn_01x01 J1
U 1 1 5F60834F
P 2500 3350
F 0 "J1" V 2464 3262 50  0000 R CNN
F 1 "M5" V 2373 3262 50  0000 R CNN
F 2 "LEGOS:WP-SMBU_Wuerth_7466105" H 2500 3350 50  0001 C CNN
F 3 "https://www.we-online.com/catalog/datasheet/7466105.pdf" H 2500 3350 50  0001 C CNN
F 4 "7466105" V 2500 3350 50  0001 C CNN "Mfr"
	1    2500 3350
	0    -1   1    0   
$EndComp
$EndSCHEMATC
