(module Touch_Slider (layer F.Cu) (tedit 5F6B9329)
  (descr "6 Segment Touch Slider 8x70")
  (attr smd)
  (fp_text reference REF** (at 1.27 -5.95) (layer F.SilkS)
    (effects (font (size 1 1) (thickness 0.15)))
  )
  (fp_text value "Touch Slider" (at 1.27 -4.65) (layer F.Fab)
    (effects (font (size 1 1) (thickness 0.15)))
  )
  (fp_line (start -34.4 -4) (end -34.4 4) (layer F.SilkS) (width 0.12))
  (fp_line (start -34.4 4) (end -19.5 4) (layer F.SilkS) (width 0.12))
  (fp_line (start -19.5 4) (end -25.1 0) (layer F.SilkS) (width 0.12))
  (fp_line (start -25.1 0) (end -19.5 -4) (layer F.SilkS) (width 0.12))
  (fp_line (start -19.5 -4) (end -34.4 -4) (layer F.SilkS) (width 0.12))
  (fp_line (start -25.1 0) (end -19.5 -4) (layer F.SilkS) (width 0.12))
  (fp_line (start -19.5 4) (end -25.1 0) (layer F.SilkS) (width 0.12))
  (fp_line (start -7.8 4) (end -13.4 0) (layer F.SilkS) (width 0.12))
  (fp_line (start -7.8 4) (end -13.4 0) (layer F.SilkS) (width 0.12))
  (fp_line (start -13.4 0) (end -7.8 -4) (layer F.SilkS) (width 0.12))
  (fp_line (start 3.8 4) (end -1.8 0) (layer F.SilkS) (width 0.12))
  (fp_line (start 3.8 4) (end -1.8 0) (layer F.SilkS) (width 0.12))
  (fp_line (start -1.8 0) (end 3.8 -4) (layer F.SilkS) (width 0.12))
  (fp_line (start 15.5 4) (end 9.9 0) (layer F.SilkS) (width 0.12))
  (fp_line (start 15.5 4) (end 9.9 0) (layer F.SilkS) (width 0.12))
  (fp_line (start 9.9 0) (end 15.5 -4) (layer F.SilkS) (width 0.12))
  (fp_line (start 27.2 4) (end 21.6 0) (layer F.SilkS) (width 0.12))
  (fp_line (start 21.6 0) (end 27.2 -4) (layer F.SilkS) (width 0.12))
  (fp_line (start 27.2 4) (end 21.6 0) (layer F.SilkS) (width 0.12))
  (fp_line (start -19 4) (end -24.6 0) (layer F.SilkS) (width 0.12))
  (fp_line (start -24.6 0) (end -19 -4) (layer F.SilkS) (width 0.12))
  (fp_line (start -7.3 4) (end -12.9 0) (layer F.SilkS) (width 0.12))
  (fp_line (start 4.3 4) (end -1.3 0) (layer F.SilkS) (width 0.12))
  (fp_line (start -19 4) (end -24.6 0) (layer F.SilkS) (width 0.12))
  (fp_line (start 4.3 4) (end -1.3 0) (layer F.SilkS) (width 0.12))
  (fp_line (start -24.6 0) (end -19 -4) (layer F.SilkS) (width 0.12))
  (fp_line (start -7.3 4) (end -12.9 0) (layer F.SilkS) (width 0.12))
  (fp_line (start -1.3 0) (end 4.3 -4) (layer F.SilkS) (width 0.12))
  (fp_line (start -12.9 0) (end -7.3 -4) (layer F.SilkS) (width 0.12))
  (fp_line (start 27.7 4) (end 22.1 0) (layer F.SilkS) (width 0.12))
  (fp_line (start 27.7 4) (end 22.1 0) (layer F.SilkS) (width 0.12))
  (fp_line (start 16 4) (end 10.4 0) (layer F.SilkS) (width 0.12))
  (fp_line (start 10.4 0) (end 16 -4) (layer F.SilkS) (width 0.12))
  (fp_line (start 16 4) (end 10.4 0) (layer F.SilkS) (width 0.12))
  (fp_line (start 22.1 0) (end 27.7 -4) (layer F.SilkS) (width 0.12))
  (fp_line (start 27.7 -4) (end 37 -4) (layer F.SilkS) (width 0.12))
  (fp_line (start 37 -4) (end 37 4) (layer F.SilkS) (width 0.12))
  (fp_line (start 37 4) (end 27.7 4) (layer F.SilkS) (width 0.12))
  (fp_line (start 27.2 4) (end 16 4) (layer F.SilkS) (width 0.12))
  (fp_line (start 15.5 4) (end 4.3 4) (layer F.SilkS) (width 0.12))
  (fp_line (start 3.8 4) (end -7.3 4) (layer F.SilkS) (width 0.12))
  (fp_line (start -7.8 4) (end -19 4) (layer F.SilkS) (width 0.12))
  (fp_line (start 27.2 -4) (end 16 -4) (layer F.SilkS) (width 0.12))
  (fp_line (start 15.5 -4) (end 4.3 -4) (layer F.SilkS) (width 0.12))
  (fp_line (start -7.8 -4) (end -19 -4) (layer F.SilkS) (width 0.12))
  (fp_line (start 3.8 -4) (end -7.3 -4) (layer F.SilkS) (width 0.12))
  (pad 1 smd rect (at -29.757777 0) (size 9.305555 8) (layers F.Cu))
  (pad 1 smd trapezoid (at -25.105 2) (size 5.583333 4) (rect_delta 0 5.583333 ) (layers F.Cu))
  (pad 1 smd trapezoid (at -25.105 -2) (size 5.583333 4) (rect_delta 0 -5.583333 ) (layers F.Cu))
  (pad 2 smd rect (at -16.23 0) (size 5.583333 8) (layers F.Cu))
  (pad 2 smd trapezoid (at -13.438334 2) (size 5.583333 4) (rect_delta 0 5.583333 ) (layers F.Cu))
  (pad 2 smd trapezoid (at -13.438334 -2) (size 5.583333 4) (rect_delta 0 -5.583333 ) (layers F.Cu))
  (pad 2 smd trapezoid (at -21.813333 0) (size 5.583333 4) (rect_delta -4 0 ) (layers F.Cu))
  (pad 3 smd rect (at -4.563334 0) (size 5.583333 8) (layers F.Cu))
  (pad 3 smd trapezoid (at -1.771668 2) (size 5.583333 4) (rect_delta 0 5.583333 ) (layers F.Cu))
  (pad 3 smd trapezoid (at -1.771668 -2) (size 5.583333 4) (rect_delta 0 -5.583333 ) (layers F.Cu))
  (pad 3 smd trapezoid (at -10.146667 0) (size 5.583333 4) (rect_delta -4 0 ) (layers F.Cu))
  (pad 4 smd rect (at 7.103332 0) (size 5.583333 8) (layers F.Cu))
  (pad 4 smd trapezoid (at 9.894998 2) (size 5.583333 4) (rect_delta 0 5.583333 ) (layers F.Cu))
  (pad 4 smd trapezoid (at 9.894998 -2) (size 5.583333 4) (rect_delta 0 -5.583333 ) (layers F.Cu))
  (pad 4 smd trapezoid (at 1.519999 0) (size 5.583333 4) (rect_delta -4 0 ) (layers F.Cu))
  (pad 5 smd rect (at 18.769998 0) (size 5.583333 8) (layers F.Cu))
  (pad 5 smd trapezoid (at 21.561664 2) (size 5.583333 4) (rect_delta 0 5.583333 ) (layers F.Cu))
  (pad 5 smd trapezoid (at 21.561664 -2) (size 5.583333 4) (rect_delta 0 -5.583333 ) (layers F.Cu))
  (pad 5 smd trapezoid (at 13.186665 0) (size 5.583333 4) (rect_delta -4 0 ) (layers F.Cu))
  (pad 6 smd rect (at 32.297775 0) (size 9.305555 8) (layers F.Cu))
  (pad 6 smd trapezoid (at 24.853331 0) (size 5.583333 4) (rect_delta -4 0 ) (layers F.Cu))
)
