EESchema Schematic File Version 4
EELAYER 30 0
EELAYER END
$Descr A4 11693 8268
encoding utf-8
Sheet 1 9
Title "House"
Date "2020-10-02"
Rev "1.2"
Comp "Institute for Automation of Complex Power Systems - E.ON ERC - RWTH Aachen University"
Comment1 "Designer: D. Wienands, S. Melcher, L. Jeske, D. Moll"
Comment2 "Supervisor: C. Guarnieri Calò Carducci"
Comment3 ""
Comment4 ""
$EndDescr
$Comp
L power:GND #PWR09
U 1 1 5EF44022
P 4250 5100
F 0 "#PWR09" H 4250 4850 50  0001 C CNN
F 1 "GND" H 4255 4927 39  0000 C CNN
F 2 "" H 4250 5100 50  0001 C CNN
F 3 "" H 4250 5100 50  0001 C CNN
	1    4250 5100
	1    0    0    -1  
$EndComp
$Comp
L Device:CP_Small C3
U 1 1 5EF44028
P 4250 2100
F 0 "C3" H 4400 2050 39  0000 R CNN
F 1 "10u" H 4400 2150 39  0000 R CNN
F 2 "Capacitor_SMD:C_0603_1608Metric" H 4250 2100 50  0001 C CNN
F 3 "~" H 4250 2100 50  0001 C CNN
	1    4250 2100
	-1   0    0    1   
$EndComp
$Comp
L Device:C_Small C2
U 1 1 5EF4402E
P 4000 2100
F 0 "C2" H 3950 2050 39  0000 R CNN
F 1 "100n" H 4000 2150 39  0000 R CNN
F 2 "Capacitor_SMD:C_0603_1608Metric" H 4000 2100 50  0001 C CNN
F 3 "~" H 4000 2100 50  0001 C CNN
	1    4000 2100
	1    0    0    1   
$EndComp
Wire Wire Line
	4250 2200 4250 2300
Wire Wire Line
	4000 2200 4000 2300
$Comp
L power:GND #PWR07
U 1 1 5EF44036
P 4000 2000
F 0 "#PWR07" H 4000 1750 50  0001 C CNN
F 1 "GND" H 4005 1827 39  0000 C CNN
F 2 "" H 4000 2000 50  0001 C CNN
F 3 "" H 4000 2000 50  0001 C CNN
	1    4000 2000
	-1   0    0    1   
$EndComp
$Comp
L power:GND #PWR08
U 1 1 5EF4403C
P 4250 2000
F 0 "#PWR08" H 4250 1750 50  0001 C CNN
F 1 "GND" H 4255 1827 39  0000 C CNN
F 2 "" H 4250 2000 50  0001 C CNN
F 3 "" H 4250 2000 50  0001 C CNN
	1    4250 2000
	-1   0    0    1   
$EndComp
$Comp
L power:GND #PWR05
U 1 1 5EF44042
P 2700 2900
F 0 "#PWR05" H 2700 2650 50  0001 C CNN
F 1 "GND" H 2705 2727 39  0000 C CNN
F 2 "" H 2700 2900 50  0001 C CNN
F 3 "" H 2700 2900 50  0001 C CNN
	1    2700 2900
	1    0    0    -1  
$EndComp
Connection ~ 2700 2500
$Comp
L Device:C_Small C1
U 1 1 5EF44049
P 2700 2800
F 0 "C1" H 2650 2750 39  0000 R CNN
F 1 "10u" H 2650 2850 39  0000 R CNN
F 2 "Capacitor_SMD:C_0603_1608Metric" H 2700 2800 50  0001 C CNN
F 3 "~" H 2700 2800 50  0001 C CNN
	1    2700 2800
	1    0    0    1   
$EndComp
$Comp
L Device:R_Small R1
U 1 1 5EF4404F
P 2700 2250
F 0 "R1" H 2750 2200 39  0000 L CNN
F 1 "10k" H 2750 2250 39  0000 L CNN
F 2 "Resistor_SMD:R_0603_1608Metric" H 2700 2250 50  0001 C CNN
F 3 "~" H 2700 2250 50  0001 C CNN
	1    2700 2250
	-1   0    0    1   
$EndComp
Text Notes 5200 2500 0    28   ~ 0
UP during boot
Text Notes 5200 3100 0    28   ~ 0
DOWN during boot
Wire Wire Line
	4850 2600 4950 2600
Wire Wire Line
	4850 2800 4950 2800
Text Notes 5200 2700 0    28   ~ 0
DOWN during prog
Text Notes 5200 3400 0    28   ~ 0
UP during boot for log
Text Notes 3600 4250 1    28   ~ 0
Internally connected to the flash
Text Notes 5200 3000 0    28   ~ 0
UP during boot
Wire Wire Line
	4850 2500 4950 2500
Wire Wire Line
	2700 2500 2700 2700
Text Notes 3300 2700 2    28   ~ 0
only input
Wire Wire Line
	3750 2000 3750 2300
Wire Wire Line
	2700 2000 2700 2150
Wire Wire Line
	2700 2350 2700 2500
Text Label 4950 2800 0    39   ~ 0
RXD
Text Label 4950 2600 0    39   ~ 0
TXD
Text Label 2950 2500 0    50   ~ 0
EN
Text Label 4950 2500 0    39   ~ 0
ID
$Comp
L RF_Module:ESP32-WROOM-32D U2
U 1 1 5EF44083
P 4250 3700
F 0 "U2" H 3700 4200 50  0000 C CNN
F 1 "ESP32-WROOM-32D" H 3350 4100 50  0000 C CNN
F 2 "RF_Module:ESP32-WROOM-32" H 4250 2200 50  0001 C CNN
F 3 "https://www.espressif.com/sites/default/files/documentation/esp32-wroom-32d_esp32-wroom-32u_datasheet_en.pdf" H 3950 3750 50  0001 C CNN
	1    4250 3700
	1    0    0    -1  
$EndComp
Wire Wire Line
	4250 2300 4000 2300
Connection ~ 4250 2300
Connection ~ 4000 2300
Wire Wire Line
	4000 2300 3750 2300
NoConn ~ 3650 3700
NoConn ~ 3650 3800
NoConn ~ 3650 3900
NoConn ~ 3650 4000
NoConn ~ 3650 4100
NoConn ~ 3650 4200
Wire Wire Line
	4850 2700 4950 2700
Wire Wire Line
	4850 3500 4950 3500
Wire Wire Line
	4850 4200 4950 4200
Wire Wire Line
	6900 5250 7000 5250
Wire Wire Line
	4950 3000 4850 3000
Wire Wire Line
	4950 3400 4850 3400
Text Notes 4850 4300 0    28   ~ 0
DAC
Text Notes 4850 4200 0    28   ~ 0
DAC
Text Notes 2775 4275 0    39   ~ 0
Touch GPIO:\nT0 - IO4\nT1 - IO0\nT2 - IO2\nT3 - IO15\nT4 - IO13\nT5 - IO12\nT6 - IO14\nT7 - IO27\nT8 - IO33\nT9 - IO32
$Comp
L power:+3.3V #PWR011
U 1 1 5F117024
P 6900 2600
F 0 "#PWR011" H 6900 2450 50  0001 C CNN
F 1 "+3.3V" V 6900 2800 39  0000 C CNN
F 2 "" H 6900 2600 50  0001 C CNN
F 3 "" H 6900 2600 50  0001 C CNN
	1    6900 2600
	0    -1   -1   0   
$EndComp
Text Label 6900 1500 2    39   ~ 0
EN
Text Label 6900 1600 2    39   ~ 0
TXD
Text Label 6900 1700 2    39   ~ 0
RXD
Text Label 6900 1800 2    39   ~ 0
ID
$Comp
L power:+3.3V #PWR06
U 1 1 5F11ED91
P 3750 2000
F 0 "#PWR06" H 3750 1850 50  0001 C CNN
F 1 "+3.3V" H 3765 2173 39  0000 C CNN
F 2 "" H 3750 2000 50  0001 C CNN
F 3 "" H 3750 2000 50  0001 C CNN
	1    3750 2000
	1    0    0    -1  
$EndComp
$Comp
L power:+3.3V #PWR04
U 1 1 5F11F442
P 2700 2000
F 0 "#PWR04" H 2700 1850 50  0001 C CNN
F 1 "+3.3V" H 2715 2173 39  0000 C CNN
F 2 "" H 2700 2000 50  0001 C CNN
F 3 "" H 2700 2000 50  0001 C CNN
	1    2700 2000
	1    0    0    -1  
$EndComp
Wire Wire Line
	7000 2600 6900 2600
Wire Wire Line
	7000 2400 6900 2400
Wire Wire Line
	6900 2400 6900 2500
Wire Wire Line
	6900 2500 7000 2500
Connection ~ 6900 2400
Wire Wire Line
	7000 1500 6900 1500
Wire Wire Line
	7000 1600 6900 1600
Wire Wire Line
	7000 1900 6950 1900
Wire Wire Line
	4850 3200 4950 3200
Wire Wire Line
	4950 3300 4850 3300
Text Label 6900 5250 2    39   ~ 0
SOURCE
$Comp
L LEGOS:TouchButton BT1
U 1 1 5F25BB8A
P 9630 1105
F 0 "BT1" H 9881 738 39  0000 L CNN
F 1 "TouchButton" H 9881 663 39  0000 L CNN
F 2 "LEGOS:Touch_Button" H 10185 845 50  0001 C CNN
F 3 "" H 9630 1105 50  0001 C CNN
	1    9630 1105
	1    0    0    -1  
$EndComp
Text Label 9335 1510 2    39   ~ 0
TEMP+
Wire Wire Line
	9435 1510 9335 1510
$Comp
L LEGOS:TouchButton BT2
U 1 1 5F25CDE8
P 9630 1505
F 0 "BT2" H 9881 1138 39  0000 L CNN
F 1 "TouchButton" H 9881 1063 39  0000 L CNN
F 2 "LEGOS:Touch_Button" H 10185 1245 50  0001 C CNN
F 3 "" H 9630 1505 50  0001 C CNN
	1    9630 1505
	1    0    0    -1  
$EndComp
Text Label 9335 1910 2    39   ~ 0
TEMP-
Wire Wire Line
	9435 1910 9335 1910
Text Label 4950 3400 0    39   ~ 0
TEMP+
Text Label 4950 2700 0    39   ~ 0
TEMP-
Text Label 4950 4500 0    39   ~ 0
HEAT
Text Label 4950 4600 0    39   ~ 0
COOL
Wire Wire Line
	6900 4600 7000 4600
Wire Wire Line
	6900 4700 7000 4700
Wire Wire Line
	4950 3100 4850 3100
Wire Wire Line
	4950 2900 4850 2900
Wire Wire Line
	2700 2500 3650 2500
Text Notes 3300 2800 2    28   ~ 0
only input
Text Label 4950 4200 0    39   ~ 0
BCD_A
Wire Wire Line
	6900 3800 7000 3800
Wire Wire Line
	7000 3900 6900 3900
Wire Wire Line
	6900 4000 7000 4000
Wire Wire Line
	7000 4100 6900 4100
Wire Wire Line
	4950 4600 4850 4600
Wire Wire Line
	4950 4500 4850 4500
Wire Wire Line
	4950 4400 4850 4400
Text Notes 5200 4800 0    28   ~ 0
only input
Text Notes 5200 4700 0    28   ~ 0
only input
Wire Wire Line
	4950 4300 4850 4300
Wire Wire Line
	4950 3600 4850 3600
Wire Wire Line
	4850 3700 4950 3700
Wire Wire Line
	4950 3800 4850 3800
Wire Wire Line
	4850 3900 4950 3900
Wire Wire Line
	4950 4000 4850 4000
Wire Wire Line
	4850 4100 4950 4100
$Comp
L Power_Supervisor:LM809 U1
U 1 1 5F4B8C50
P 1650 2500
F 0 "U1" H 1421 2538 39  0000 R CNN
F 1 "TLV803E" H 1421 2463 39  0000 R CNN
F 2 "Package_TO_SOT_SMD:SOT-23" H 1950 2600 50  0001 C CNN
F 3 "https://www.ti.com/lit/ds/symlink/tlv803e.pdf" H 1950 2600 50  0001 C CNN
	1    1650 2500
	1    0    0    -1  
$EndComp
$Comp
L power:+3.3V #PWR01
U 1 1 5F4BB84D
P 1650 2000
F 0 "#PWR01" H 1650 1850 50  0001 C CNN
F 1 "+3.3V" H 1665 2173 39  0000 C CNN
F 2 "" H 1650 2000 50  0001 C CNN
F 3 "" H 1650 2000 50  0001 C CNN
	1    1650 2000
	1    0    0    -1  
$EndComp
Wire Wire Line
	1650 2000 1650 2100
$Comp
L power:GND #PWR02
U 1 1 5F4BDA61
P 1650 2900
F 0 "#PWR02" H 1650 2650 50  0001 C CNN
F 1 "GND" H 1655 2727 39  0000 C CNN
F 2 "" H 1650 2900 50  0001 C CNN
F 3 "" H 1650 2900 50  0001 C CNN
	1    1650 2900
	1    0    0    -1  
$EndComp
$Comp
L Switch:SW_Push SW1
U 1 1 5F98DC6C
P 2350 2700
F 0 "SW1" V 2300 2500 39  0000 L CNN
F 1 "PTS815" V 2350 2400 39  0000 L CNN
F 2 "LEGOS:PTS815" H 2350 2900 50  0001 C CNN
F 3 "~" H 2350 2900 50  0001 C CNN
	1    2350 2700
	0    1    1    0   
$EndComp
Wire Wire Line
	1950 2500 2350 2500
Connection ~ 2350 2500
Wire Wire Line
	2350 2500 2700 2500
$Comp
L power:GND #PWR03
U 1 1 5F990D1C
P 2350 2900
F 0 "#PWR03" H 2350 2650 50  0001 C CNN
F 1 "GND" H 2355 2727 39  0000 C CNN
F 2 "" H 2350 2900 50  0001 C CNN
F 3 "" H 2350 2900 50  0001 C CNN
	1    2350 2900
	1    0    0    -1  
$EndComp
$Sheet
S 7000 1400 575  600 
U 5F112078
F0 "Connectors" 39
F1 "sub_connectors.sch" 39
F2 "EN" O L 7000 1500 39 
F3 "TXD" O L 7000 1600 39 
F4 "RXD" I L 7000 1700 39 
F5 "IO0" B L 7000 1800 39 
F6 "ID" B L 7000 1900 39 
$EndSheet
$Sheet
S 7000 2300 550  400 
U 5F111DB3
F0 "Telemetry" 39
F1 "sub_telemetry.sch" 39
F2 "VCOM" I L 7000 2400 39 
F3 "V+" I L 7000 2500 39 
F4 "V-" I L 7000 2600 39 
F5 "~IRQ" O R 7550 2400 39 
F6 "A1" I R 7550 2500 39 
F7 "A0" I R 7550 2600 39 
$EndSheet
$Comp
L LEGOS:VBUS #PWR010
U 1 1 5F11690B
P 6900 2400
F 0 "#PWR010" H 6900 2250 50  0001 C CNN
F 1 "VBUS" V 6900 2600 39  0000 C CNN
F 2 "" H 6900 2400 50  0001 C CNN
F 3 "" H 6900 2400 50  0001 C CNN
	1    6900 2400
	0    -1   -1   0   
$EndComp
$Comp
L power:GND #PWR014
U 1 1 5F9A344A
P 7650 2600
F 0 "#PWR014" H 7650 2350 50  0001 C CNN
F 1 "GND" H 7655 2427 39  0000 C CNN
F 2 "" H 7650 2600 50  0001 C CNN
F 3 "" H 7650 2600 50  0001 C CNN
	1    7650 2600
	0    -1   -1   0   
$EndComp
Wire Wire Line
	7650 2600 7550 2600
Wire Wire Line
	7550 2500 7650 2500
Wire Wire Line
	7650 2500 7650 2600
Connection ~ 7650 2600
Wire Wire Line
	7650 2400 7550 2400
Text Label 7650 2400 0    39   ~ 0
~IRQBUS
$Comp
L power:+3.3V #PWR013
U 1 1 5F9AD6FE
P 6900 3300
F 0 "#PWR013" H 6900 3150 50  0001 C CNN
F 1 "+3.3V" V 6900 3500 39  0000 C CNN
F 2 "" H 6900 3300 50  0001 C CNN
F 3 "" H 6900 3300 50  0001 C CNN
	1    6900 3300
	0    -1   -1   0   
$EndComp
Wire Wire Line
	7000 3300 6900 3300
Wire Wire Line
	7000 3100 6900 3100
Wire Wire Line
	7650 3300 7550 3300
Wire Wire Line
	7650 3100 7550 3100
Text Label 7650 3100 0    39   ~ 0
~CS
$Sheet
S 7000 3000 550  400 
U 5F9AD70B
F0 "Solar Power" 39
F1 "sub_power_slave.sch" 39
F2 "VIN" I L 7000 3100 39 
F3 "VOUT" I L 7000 3300 39 
F4 "~CS" O R 7550 3100 39 
F5 "~IRQ" I R 7550 3300 39 
$EndSheet
$Comp
L power:+5V #PWR?
U 1 1 5F9BB1FB
P 6900 3100
AR Path="/5F112078/5F9BB1FB" Ref="#PWR?"  Part="1" 
AR Path="/5F9BB1FB" Ref="#PWR012"  Part="1" 
F 0 "#PWR012" H 6900 2950 50  0001 C CNN
F 1 "+5V" V 6900 3300 39  0000 C CNN
F 2 "" H 6900 3100 50  0001 C CNN
F 3 "" H 6900 3100 50  0001 C CNN
	1    6900 3100
	0    -1   -1   0   
$EndComp
Text Label 7650 3300 0    39   ~ 0
~IRQEXT
$Sheet
S 7000 3700 550  500 
U 5F276426
F0 "Display" 39
F1 "sub_display.sch" 39
F2 "D2" I R 7550 4000 39 
F3 "D1" I R 7550 3900 39 
F4 "D0" I R 7550 3800 39 
F5 "BRIGHT" I R 7550 4100 39 
F6 "BCD0" I L 7000 3800 39 
F7 "BCD1" I L 7000 3900 39 
F8 "BCD2" I L 7000 4000 39 
F9 "BCD3" I L 7000 4100 39 
$EndSheet
Wire Wire Line
	7550 4100 7650 4100
Wire Wire Line
	7650 4000 7550 4000
Wire Wire Line
	7550 3900 7650 3900
Wire Wire Line
	7650 3800 7550 3800
Text Label 7650 3800 0    39   ~ 0
D0
Text Label 4950 4300 0    39   ~ 0
BCD_D
Text Label 7650 3900 0    39   ~ 0
D1
Text Label 7650 4000 0    39   ~ 0
D2
Text Label 7650 4100 0    39   ~ 0
DB
Text Label 4950 3500 0    39   ~ 0
D1
Text Label 4950 3600 0    39   ~ 0
D2
Text Label 4950 3100 0    39   ~ 0
DB
Text Label 6900 3800 2    39   ~ 0
BCD_A
Text Label 6900 3900 2    39   ~ 0
BCD_B
Text Label 6900 4000 2    39   ~ 0
BCD_C
Text Label 6900 4100 2    39   ~ 0
BCD_D
Text GLabel 4950 3900 2    39   Input ~ 0
CLK
Text Label 4950 4100 0    39   ~ 0
~CS
Text Label 6900 4600 2    39   ~ 0
HEAT
Text Label 6900 4700 2    39   ~ 0
COOL
Text Notes 3750 6000 0    50   ~ 0
I2C address\n1000000 Telemetry Consumer\n1000100 Telemetry Producer\n1000001 GPIO Expander\n1001000 Temperature Outside\n1001100 Temperature Inside
Wire Wire Line
	3550 2700 3650 2700
Wire Wire Line
	3550 2800 3650 2800
Text Label 3550 2800 2    39   ~ 0
~IRQBUS
Text Label 3550 2700 2    39   ~ 0
~IRQEXT
$Sheet
S 7000 4500 550  300 
U 5F25F1E7
F0 "Thermal Load" 39
F1 "sub_load_thermal.sch" 39
F2 "HEAT" I L 7000 4600 39 
F3 "COOL" I L 7000 4700 39 
$EndSheet
$Sheet
S 7000 5100 550  300 
U 5EFE1C3B
F0 "Electrical Load" 39
F1 "sub_load_electrical.sch" 39
F2 "SOURCE" I L 7000 5250 39 
$EndSheet
Text Label 4950 3800 0    39   ~ 0
SOURCE
Text Label 10350 2950 0    39   ~ 0
LIGHT
Text Label 4950 4700 0    39   ~ 0
LIGHT
Wire Wire Line
	4950 4700 4850 4700
$Comp
L Device:Solar_Cell SC1
U 1 1 5F50A790
P 8750 2900
F 0 "SC1" H 8858 2988 39  0000 L CNN
F 1 "PV" H 8858 2913 39  0000 L CNN
F 2 "" V 8750 2960 50  0001 C CNN
F 3 "" V 8750 2960 50  0001 C CNN
	1    8750 2900
	-1   0    0    1   
$EndComp
Wire Wire Line
	8750 3150 8750 3100
Wire Notes Line
	8500 2500 8500 3800
Wire Notes Line
	8500 3800 9500 3800
Wire Notes Line
	9500 3800 9500 2500
Wire Notes Line
	9500 2500 8500 2500
Text Notes 8500 2450 0    50   ~ 0
OFF-BOARD\n
$Comp
L power:+5V #PWR?
U 1 1 5F6E6242
P 9425 4900
AR Path="/5F112078/5F6E6242" Ref="#PWR?"  Part="1" 
AR Path="/5F6E6242" Ref="#PWR0129"  Part="1" 
F 0 "#PWR0129" H 9425 4750 50  0001 C CNN
F 1 "+5V" V 9425 5075 39  0000 C CNN
F 2 "" H 9425 4900 50  0001 C CNN
F 3 "" H 9425 4900 50  0001 C CNN
	1    9425 4900
	0    -1   -1   0   
$EndComp
Text Label 4950 3300 0    39   ~ 0
BCD_B
Text Label 4950 4400 0    39   ~ 0
BCD_C
Text GLabel 4950 3000 2    39   Input ~ 0
SDA
Text GLabel 4950 3700 2    39   Input ~ 0
SCL
Text GLabel 4950 4000 2    39   Input ~ 0
MOSI
Text Label 4950 3200 0    39   ~ 0
D0
$Sheet
S 7000 800  550  300 
U 5F56A024
F0 "Mechanical" 39
F1 "sub_mechanical.sch" 39
$EndSheet
$Comp
L Connector_Generic:Conn_01x06 J5
U 1 1 5F72043A
P 9625 4700
F 0 "J5" H 9543 4099 39  0000 C CNN
F 1 "Conn_01x06" H 9543 4174 39  0000 C CNN
F 2 "Connector_PinHeader_1.27mm:PinHeader_1x06_P1.27mm_Horizontal" H 9625 4700 50  0001 C CNN
F 3 "https://www.mouser.de/datasheet/2/181/M50-393-1101505.pdf" H 9625 4700 50  0001 C CNN
F 4 "M50-3930642" H 9625 4700 50  0001 C CNN "Mfr"
	1    9625 4700
	1    0    0    -1  
$EndComp
$Comp
L power:GND #PWR0131
U 1 1 5F7226C2
P 9425 4700
F 0 "#PWR0131" H 9425 4450 50  0001 C CNN
F 1 "GND" V 9425 4525 39  0000 C CNN
F 2 "" H 9425 4700 50  0001 C CNN
F 3 "" H 9425 4700 50  0001 C CNN
	1    9425 4700
	0    1    1    0   
$EndComp
Text GLabel 9425 4500 0    39   Input ~ 0
SOLAR
Text GLabel 9425 4600 0    39   Input ~ 0
HEATER
Text GLabel 9425 4800 0    39   Input ~ 0
AC
Text Label 9425 5000 2    39   ~ 0
PV
Wire Wire Line
	6900 1800 6950 1800
Wire Wire Line
	7000 1700 6900 1700
Wire Wire Line
	6950 1800 6950 1900
Connection ~ 6950 1800
Wire Wire Line
	6950 1800 7000 1800
Text GLabel 8700 4800 0    39   Input ~ 0
AC
Text GLabel 8700 4500 0    39   Input ~ 0
SOLAR
$Comp
L power:GND #PWR0137
U 1 1 5F732160
P 8700 4700
F 0 "#PWR0137" H 8700 4450 50  0001 C CNN
F 1 "GND" V 8700 4525 39  0000 C CNN
F 2 "" H 8700 4700 50  0001 C CNN
F 3 "" H 8700 4700 50  0001 C CNN
	1    8700 4700
	0    1    1    0   
$EndComp
Text GLabel 8700 4600 0    39   Input ~ 0
HEATER
$Comp
L power:+5V #PWR?
U 1 1 5F73214E
P 8700 4900
AR Path="/5F112078/5F73214E" Ref="#PWR?"  Part="1" 
AR Path="/5F73214E" Ref="#PWR0135"  Part="1" 
F 0 "#PWR0135" H 8700 4750 50  0001 C CNN
F 1 "+5V" V 8700 5075 39  0000 C CNN
F 2 "" H 8700 4900 50  0001 C CNN
F 3 "" H 8700 4900 50  0001 C CNN
	1    8700 4900
	0    -1   -1   0   
$EndComp
Text Label 8700 5000 2    39   ~ 0
PV
$Comp
L power:GND #PWR0115
U 1 1 5F6406F7
P 8750 3150
F 0 "#PWR0115" H 8750 2900 50  0001 C CNN
F 1 "GND" H 8755 2977 39  0000 C CNN
F 2 "" H 8750 3150 50  0001 C CNN
F 3 "" H 8750 3150 50  0001 C CNN
	1    8750 3150
	1    0    0    -1  
$EndComp
Wire Wire Line
	8750 2750 9000 2750
$Comp
L power:GND #PWR0130
U 1 1 5F66442F
P 9000 3150
F 0 "#PWR0130" H 9000 2900 50  0001 C CNN
F 1 "GND" H 9005 2977 39  0000 C CNN
F 2 "" H 9000 3150 50  0001 C CNN
F 3 "" H 9000 3150 50  0001 C CNN
	1    9000 3150
	1    0    0    -1  
$EndComp
$Comp
L Amplifier_Operational:LM321 U3
U 1 1 5F6C5EA6
P 9850 2950
F 0 "U3" H 9875 2750 39  0000 C CNN
F 1 "LM321LV" H 9950 2800 39  0000 C CNN
F 2 "Package_TO_SOT_SMD:SOT-23-5" H 9850 2950 50  0001 C CNN
F 3 "http://www.ti.com/lit/ds/symlink/lm321lv.pdf" H 9850 2950 50  0001 C CNN
F 4 "LM321LVIDBVR" H 9850 2950 50  0001 C CNN "Mfr"
	1    9850 2950
	1    0    0    1   
$EndComp
Wire Wire Line
	8750 2750 8750 2800
$Comp
L power:GND #PWR0132
U 1 1 5F6E6CB5
P 9750 2650
F 0 "#PWR0132" H 9750 2400 50  0001 C CNN
F 1 "GND" H 9755 2477 39  0000 C CNN
F 2 "" H 9750 2650 50  0001 C CNN
F 3 "" H 9750 2650 50  0001 C CNN
	1    9750 2650
	-1   0    0    1   
$EndComp
$Comp
L power:+3.3V #PWR0133
U 1 1 5F6E7DF3
P 9950 3250
F 0 "#PWR0133" H 9950 3100 50  0001 C CNN
F 1 "+3.3V" H 9965 3423 39  0000 C CNN
F 2 "" H 9950 3250 50  0001 C CNN
F 3 "" H 9950 3250 50  0001 C CNN
	1    9950 3250
	1    0    0    -1  
$EndComp
$Comp
L Device:C_Small C7
U 1 1 5F6E9276
P 9750 3350
F 0 "C7" H 9700 3300 39  0000 R CNN
F 1 "100n" H 9750 3400 39  0000 R CNN
F 2 "Capacitor_SMD:C_0603_1608Metric" H 9750 3350 50  0001 C CNN
F 3 "~" H 9750 3350 50  0001 C CNN
	1    9750 3350
	1    0    0    1   
$EndComp
$Comp
L power:GND #PWR0138
U 1 1 5F6E9D8D
P 9750 3450
F 0 "#PWR0138" H 9750 3200 50  0001 C CNN
F 1 "GND" H 9755 3277 39  0000 C CNN
F 2 "" H 9750 3450 50  0001 C CNN
F 3 "" H 9750 3450 50  0001 C CNN
	1    9750 3450
	1    0    0    -1  
$EndComp
Wire Wire Line
	9950 3250 9750 3250
Connection ~ 9750 3250
Wire Wire Line
	9000 2750 9000 2900
Wire Wire Line
	9550 3050 9550 3150
Wire Wire Line
	9550 3150 9000 3150
Connection ~ 9000 3150
Wire Wire Line
	9550 2850 9550 2750
Wire Wire Line
	9550 2750 9000 2750
Connection ~ 9000 2750
Wire Wire Line
	9550 2550 9550 2750
Connection ~ 9550 2750
Wire Wire Line
	10350 2550 10350 2625
Wire Wire Line
	10350 2950 10200 2950
$Comp
L Device:R_Small R77
U 1 1 5F6FCF5C
P 10350 3150
F 0 "R77" H 10400 3100 39  0000 L CNN
F 1 "1k" H 10400 3150 39  0000 L CNN
F 2 "Resistor_SMD:R_0603_1608Metric" H 10350 3150 50  0001 C CNN
F 3 "~" H 10350 3150 50  0001 C CNN
	1    10350 3150
	-1   0    0    1   
$EndComp
Wire Wire Line
	10350 2950 10350 3050
Connection ~ 10350 2950
$Comp
L power:GND #PWR0139
U 1 1 5F700436
P 10350 3350
F 0 "#PWR0139" H 10350 3100 50  0001 C CNN
F 1 "GND" H 10355 3177 39  0000 C CNN
F 2 "" H 10350 3350 50  0001 C CNN
F 3 "" H 10350 3350 50  0001 C CNN
	1    10350 3350
	1    0    0    -1  
$EndComp
Wire Wire Line
	10350 3250 10350 3350
$Comp
L Device:C_Small C13
U 1 1 5F8E9925
P 10350 2725
F 0 "C13" H 10300 2675 39  0000 R CNN
F 1 "220p" H 10350 2775 39  0000 R CNN
F 2 "Capacitor_SMD:C_0603_1608Metric" H 10350 2725 50  0001 C CNN
F 3 "~" H 10350 2725 50  0001 C CNN
	1    10350 2725
	-1   0    0    -1  
$EndComp
Wire Wire Line
	10350 2825 10350 2950
$Comp
L Device:R_Small R75
U 1 1 5F8EBC68
P 10200 2725
F 0 "R75" H 10250 2675 39  0000 L CNN
F 1 "1k" H 10250 2725 39  0000 L CNN
F 2 "Resistor_SMD:R_0603_1608Metric" H 10200 2725 50  0001 C CNN
F 3 "~" H 10200 2725 50  0001 C CNN
	1    10200 2725
	-1   0    0    1   
$EndComp
Wire Wire Line
	9550 2550 10200 2550
Wire Wire Line
	10200 2625 10200 2550
Connection ~ 10200 2550
Wire Wire Line
	10200 2550 10350 2550
Wire Wire Line
	10200 2825 10200 2950
Connection ~ 10200 2950
Wire Wire Line
	10200 2950 10150 2950
Text Label 8750 2750 2    39   ~ 0
PV
$Comp
L Connector_Generic:Conn_01x06 J4
U 1 1 5F73215A
P 8900 4700
F 0 "J4" H 8818 4099 39  0000 C CNN
F 1 "Conn_01x06" H 8818 4174 39  0000 C CNN
F 2 "Connector_PinSocket_1.27mm:PinSocket_1x06_P1.27mm_Vertical_SMD_Pin1Right" H 8900 4700 50  0001 C CNN
F 3 "https://www.mouser.de/datasheet/2/181/M50-314-1100657.pdf" H 8900 4700 50  0001 C CNN
F 4 "M50-3140645" H 8900 4700 50  0001 C CNN "Mfr"
	1    8900 4700
	1    0    0    -1  
$EndComp
$Comp
L Connector_Generic:Conn_01x02 J1
U 1 1 5F6B0928
P 9200 2900
F 0 "J1" H 9150 2550 39  0000 C CNN
F 1 "Conn_01x02" H 9275 2600 39  0000 C CNN
F 2 "Connector_PinHeader_1.27mm:PinHeader_1x02_P1.27mm_Horizontal" H 9200 2900 50  0001 C CNN
F 3 "~" H 9200 2900 50  0001 C CNN
	1    9200 2900
	1    0    0    -1  
$EndComp
Wire Wire Line
	9000 3000 9000 3150
$EndSCHEMATC
