(module "drawing" (layer F.Cu)
(fp_text reference Ref** (at 0 0) (layer F.SilkS) hide
(effects (font (size 1.27 1.27) (thickness 0.15)))
)
(fp_text value Val** (at 0 0) (layer F.SilkS) hide
(effects (font (size 1.27 1.27) (thickness 0.15)))
)
  (fp_poly (pts (xy 0.144562 -3.235218) (xy 0.195580 -3.222741) (xy 0.233395 -3.197125) (xy 0.239850 -3.190875) (xy 0.247806 -3.182645) (xy 0.256358 -3.172869) (xy 0.266470 -3.159885) (xy 0.279109 -3.142032)
     (xy 0.295238 -3.117645) (xy 0.315823 -3.085063) (xy 0.341827 -3.042623) (xy 0.374217 -2.988662) (xy 0.413956 -2.921519) (xy 0.462009 -2.839529) (xy 0.519342 -2.741032) (xy 0.586918 -2.624363)
     (xy 0.665703 -2.487861) (xy 0.756661 -2.329863) (xy 0.860758 -2.148707) (xy 0.978958 -1.942729) (xy 1.112225 -1.710268) (xy 1.261524 -1.449661) (xy 1.427821 -1.159245) (xy 1.612080 -0.837357)
     (xy 1.815266 -0.482335) (xy 2.038343 -0.092517) (xy 2.078756 -0.021894) (xy 3.513666 2.485629) (xy 3.513666 3.259666) (xy 0.037041 3.257995) (xy -0.343594 3.257748) (xy -0.712895 3.257384)
     (xy -1.068629 3.256909) (xy -1.408560 3.256332) (xy -1.730457 3.255661) (xy -2.032085 3.254904) (xy -2.311210 3.254069) (xy -2.565599 3.253162) (xy -2.793018 3.252193) (xy -2.991234 3.251170)
     (xy -3.158013 3.250099) (xy -3.291121 3.248989) (xy -3.388325 3.247848) (xy -3.447391 3.246684) (xy -3.466042 3.245648) (xy -3.477425 3.228041) (xy -3.485350 3.182993) (xy -3.490191 3.106139)
     (xy -3.492323 2.993113) (xy -3.492500 2.936996) (xy -3.492500 2.746882) (xy -2.982046 2.746882) (xy -2.978911 2.755569) (xy -2.955020 2.757573) (xy -2.891782 2.759457) (xy -2.792101 2.761218)
     (xy -2.658883 2.762856) (xy -2.495032 2.764369) (xy -2.303452 2.765755) (xy -2.087047 2.767013) (xy -1.848723 2.768141) (xy -1.591384 2.769138) (xy -1.317935 2.770001) (xy -1.031280 2.770730)
     (xy -0.734323 2.771323) (xy -0.429969 2.771779) (xy -0.121123 2.772095) (xy 0.189311 2.772270) (xy 0.498428 2.772303) (xy 0.803324 2.772192) (xy 1.101094 2.771935) (xy 1.388834 2.771532)
     (xy 1.663639 2.770980) (xy 1.922604 2.770277) (xy 2.162826 2.769424) (xy 2.381399 2.768416) (xy 2.575419 2.767254) (xy 2.741981 2.765936) (xy 2.878181 2.764460) (xy 2.981115 2.762824)
     (xy 3.047877 2.761027) (xy 3.075563 2.759068) (xy 3.076125 2.758819) (xy 3.079125 2.755694) (xy 3.080700 2.751178) (xy 3.079483 2.742788) (xy 3.074110 2.728038) (xy 3.063215 2.704444)
     (xy 3.045433 2.669522) (xy 3.019399 2.620787) (xy 2.983747 2.555754) (xy 2.937111 2.471939) (xy 2.878128 2.366857) (xy 2.805430 2.238024) (xy 2.717653 2.082955) (xy 2.613432 1.899167)
     (xy 2.491401 1.684173) (xy 2.350195 1.435490) (xy 2.310309 1.365250) (xy 2.191607 1.156193) (xy 2.074205 0.949399) (xy 1.960648 0.749355) (xy 1.853483 0.560544) (xy 1.755254 0.387453)
     (xy 1.668507 0.234566) (xy 1.595789 0.106370) (xy 1.539643 0.007350) (xy 1.511492 -0.042334) (xy 1.299368 -0.416773) (xy 1.107218 -0.755694) (xy 0.934252 -1.060472) (xy 0.779684 -1.332480)
     (xy 0.642722 -1.573092) (xy 0.522579 -1.783684) (xy 0.418466 -1.965628) (xy 0.329594 -2.120300) (xy 0.255175 -2.249074) (xy 0.194419 -2.353322) (xy 0.146537 -2.434421) (xy 0.110742 -2.493744)
     (xy 0.086244 -2.532665) (xy 0.072254 -2.552559) (xy 0.068732 -2.555895) (xy 0.053914 -2.539711) (xy 0.020518 -2.490535) (xy -0.029128 -2.412186) (xy -0.092694 -2.308484) (xy -0.167852 -2.183247)
     (xy -0.252273 -2.040293) (xy -0.343627 -1.883442) (xy -0.382569 -1.815963) (xy -0.489821 -1.629611) (xy -0.602404 -1.433989) (xy -0.715821 -1.236911) (xy -0.825575 -1.046191) (xy -0.927170 -0.869643)
     (xy -1.016109 -0.715080) (xy -1.080454 -0.603250) (xy -1.293525 -0.232923) (xy -1.486715 0.102840) (xy -1.661251 0.406170) (xy -1.818358 0.679198) (xy -1.959265 0.924056) (xy -2.085197 1.142875)
     (xy -2.197383 1.337785) (xy -2.297048 1.510919) (xy -2.385419 1.664408) (xy -2.463723 1.800382) (xy -2.533188 1.920972) (xy -2.595040 2.028311) (xy -2.650505 2.124530) (xy -2.700811 2.211759)
     (xy -2.747185 2.292129) (xy -2.749141 2.295518) (xy -2.835996 2.447702) (xy -2.901501 2.566499) (xy -2.946868 2.654341) (xy -2.973311 2.713658) (xy -2.982046 2.746882) (xy -3.492500 2.746882)
     (xy -3.492500 2.639020) (xy -2.742030 1.335385) (xy -2.603274 1.094315) (xy -2.447310 0.823280) (xy -2.278014 0.529019) (xy -2.099264 0.218276) (xy -1.914936 -0.102209) (xy -1.728909 -0.425693)
     (xy -1.545060 -0.745436) (xy -1.367266 -1.054694) (xy -1.199404 -1.346727) (xy -1.103607 -1.513417) (xy -0.966901 -1.750776) (xy -0.834793 -1.979130) (xy -0.708992 -2.195582) (xy -0.591210 -2.397236)
     (xy -0.483155 -2.581196) (xy -0.386540 -2.744564) (xy -0.303074 -2.884445) (xy -0.234467 -2.997941) (xy -0.182430 -3.082157) (xy -0.148672 -3.134195) (xy -0.138101 -3.148542) (xy -0.092317 -3.198824)
     (xy -0.054980 -3.225697) (xy -0.009488 -3.236482) (xy 0.060760 -3.238499) (xy 0.065938 -3.238500) (xy 0.144562 -3.235218) )(layer F.SilkS) (width  0.010000)
  )
  (fp_poly (pts (xy -0.154474 -1.634475) (xy -0.105954 -1.602092) (xy -0.040876 -1.552573) (xy 0.015936 -1.505992) (xy 0.188468 -1.360265) (xy 0.400940 -1.345201) (xy 0.491558 -1.337046) (xy 0.565461 -1.327143)
     (xy 0.613041 -1.316964) (xy 0.625360 -1.310806) (xy 0.618151 -1.288602) (xy 0.592527 -1.233445) (xy 0.550596 -1.149407) (xy 0.494466 -1.040563) (xy 0.426246 -0.910983) (xy 0.348042 -0.764743)
     (xy 0.261964 -0.605914) (xy 0.234987 -0.556543) (xy 0.146947 -0.395196) (xy 0.065935 -0.245720) (xy -0.005923 -0.112114) (xy -0.066505 0.001628) (xy -0.113684 0.091509) (xy -0.145336 0.153533)
     (xy -0.159336 0.183702) (xy -0.159765 0.185957) (xy -0.138794 0.180785) (xy -0.083262 0.162442) (xy 0.001790 0.132722) (xy 0.111324 0.093417) (xy 0.240298 0.046319) (xy 0.383674 -0.006779)
     (xy 0.415324 -0.018593) (xy 0.561044 -0.072759) (xy 0.693365 -0.121372) (xy 0.807258 -0.162630) (xy 0.897694 -0.194731) (xy 0.959645 -0.215875) (xy 0.988082 -0.224259) (xy 0.989329 -0.224227)
     (xy 0.985483 -0.203079) (xy 0.971943 -0.144990) (xy 0.949716 -0.053976) (xy 0.919811 0.065947) (xy 0.883237 0.210762) (xy 0.841003 0.376453) (xy 0.794116 0.559004) (xy 0.743775 0.753670)
     (xy 0.491737 1.725083) (xy 0.558077 1.739510) (xy 0.612969 1.748829) (xy 0.692635 1.759298) (xy 0.778180 1.768483) (xy 0.854526 1.777771) (xy 0.912840 1.788733) (xy 0.941662 1.799157)
     (xy 0.942548 1.800189) (xy 0.930303 1.818324) (xy 0.890382 1.860708) (xy 0.826770 1.923486) (xy 0.743450 2.002804) (xy 0.644407 2.094809) (xy 0.534785 2.194601) (xy 0.385347 2.329263)
     (xy 0.264097 2.438217) (xy 0.167841 2.524170) (xy 0.093387 2.589831) (xy 0.037542 2.637908) (xy -0.002884 2.671107) (xy -0.031086 2.692137) (xy -0.050254 2.703707) (xy -0.063582 2.708523)
     (xy -0.072031 2.709333) (xy -0.092973 2.689971) (xy -0.117591 2.637610) (xy -0.137280 2.577041) (xy -0.154057 2.518509) (xy -0.180730 2.427166) (xy -0.215019 2.310745) (xy -0.254642 2.176979)
     (xy -0.297317 2.033601) (xy -0.319926 1.957916) (xy -0.360640 1.821178) (xy -0.396970 1.697960) (xy -0.427241 1.594043) (xy -0.449779 1.515207) (xy -0.462908 1.467229) (xy -0.465608 1.455208)
     (xy -0.458063 1.442170) (xy -0.431794 1.443323) (xy -0.381565 1.460238) (xy -0.302143 1.494486) (xy -0.241672 1.522426) (xy -0.064356 1.605519) (xy -0.020612 1.453634) (xy 0.003787 1.369481)
     (xy 0.035646 1.260387) (xy 0.070387 1.141999) (xy 0.096233 1.054311) (xy 0.124365 0.958254) (xy 0.147478 0.877756) (xy 0.163241 0.821047) (xy 0.169324 0.796358) (xy 0.169333 0.796159)
     (xy 0.162286 0.793841) (xy 0.139036 0.798673) (xy 0.096416 0.811793) (xy 0.031260 0.834340) (xy -0.059598 0.867452) (xy -0.179323 0.912267) (xy -0.331082 0.969923) (xy -0.518041 1.041559)
     (xy -0.587137 1.068128) (xy -0.728807 1.122138) (xy -0.857695 1.170315) (xy -0.968498 1.210754) (xy -1.055914 1.241550) (xy -1.114638 1.260799) (xy -1.139369 1.266596) (xy -1.139508 1.266551)
     (xy -1.136288 1.245826) (xy -1.120745 1.188870) (xy -1.094152 1.099544) (xy -1.057784 0.981707) (xy -1.012913 0.839218) (xy -0.960815 0.675939) (xy -0.902762 0.495727) (xy -0.840028 0.302444)
     (xy -0.773888 0.099949) (xy -0.705615 -0.107898) (xy -0.636484 -0.317238) (xy -0.567767 -0.524211) (xy -0.500740 -0.724956) (xy -0.436675 -0.915615) (xy -0.376846 -1.092327) (xy -0.322529 -1.251233)
     (xy -0.274995 -1.388473) (xy -0.235520 -1.500187) (xy -0.205376 -1.582516) (xy -0.185839 -1.631599) (xy -0.178820 -1.644311) (xy -0.154474 -1.634475) )(layer F.SilkS) (width  0.010000)
  )
)