(module PTS815 (layer F.Cu) (tedit 5F818F99)
  (attr smd)
  (fp_text reference REF** (at 0 0.5) (layer F.SilkS)
    (effects (font (size 1 1) (thickness 0.15)))
  )
  (fp_text value PTS815 (at 0 -0.5) (layer F.Fab)
    (effects (font (size 1 1) (thickness 0.15)))
  )
  (fp_line (start -2.1 -1.6) (end 2.1 -1.6) (layer Dwgs.User) (width 0.12))
  (fp_line (start 2.1 -1.6) (end 2.1 1.6) (layer Dwgs.User) (width 0.12))
  (fp_line (start 2.1 1.6) (end -2.1 1.6) (layer Dwgs.User) (width 0.12))
  (fp_line (start -2.1 1.6) (end -2.1 -1.6) (layer Dwgs.User) (width 0.12))
  (fp_line (start -2.3 -1.5) (end -2.3 -1.8) (layer F.SilkS) (width 0.12))
  (fp_line (start -2.3 -1.8) (end 2.3 -1.8) (layer F.SilkS) (width 0.12))
  (fp_line (start 2.3 -1.8) (end 2.3 -1.5) (layer F.SilkS) (width 0.12))
  (fp_line (start -2.3 -0.6) (end -2.3 0.6) (layer F.SilkS) (width 0.12))
  (fp_line (start 2.3 -0.6) (end 2.3 0.6) (layer F.SilkS) (width 0.12))
  (fp_line (start -2.3 1.5) (end -2.3 1.8) (layer F.SilkS) (width 0.12))
  (fp_line (start -2.3 1.8) (end 2.3 1.8) (layer F.SilkS) (width 0.12))
  (fp_line (start 2.3 1.8) (end 2.3 1.5) (layer F.SilkS) (width 0.12))
  (pad 1 smd rect (at -2.25 -1.075) (size 1 0.7) (layers F.Cu F.Paste F.Mask))
  (pad 1 smd rect (at 2.25 -1.075) (size 1 0.7) (layers F.Cu F.Paste F.Mask))
  (pad 2 smd rect (at 2.25 1.075) (size 1 0.7) (layers F.Cu F.Paste F.Mask))
  (pad 2 smd rect (at -2.25 1.075) (size 1 0.7) (layers F.Cu F.Paste F.Mask))
  (model ${KIPRJMOD}/../../libs/3D/PTS815SJK250.stp
    (at (xyz 0 0 0))
    (scale (xyz 1 1 1))
    (rotate (xyz 0 0 90))
  )
)
