EESchema Schematic File Version 4
EELAYER 30 0
EELAYER END
$Descr A4 11693 8268
encoding utf-8
Sheet 1 7
Title "Hospital"
Date "2020-10-02"
Rev "1.2"
Comp "Institute for Automation of Complex Power Systems - E.ON ERC - RWTH Aachen University"
Comment1 "Designer: D. Wienands, S. Melcher, L. Jeske, D. Moll"
Comment2 "Supervisor: C. Guarnieri Calò Carducci"
Comment3 ""
Comment4 ""
$EndDescr
Text Notes 1650 5800 0    50   ~ 0
https://dl.espressif.com/dl/schematics/esp32-pico-kit-v4.1_schematic.pdf
$Comp
L power:GND #PWR09
U 1 1 5EF53AE5
P 3600 5100
F 0 "#PWR09" H 3600 4850 50  0001 C CNN
F 1 "GND" H 3605 4927 50  0000 C CNN
F 2 "" H 3600 5100 50  0001 C CNN
F 3 "" H 3600 5100 50  0001 C CNN
	1    3600 5100
	1    0    0    -1  
$EndComp
$Comp
L Device:CP_Small C3
U 1 1 5EF53AEB
P 3600 2100
F 0 "C3" H 3750 2050 39  0000 R CNN
F 1 "10u" H 3750 2150 39  0000 R CNN
F 2 "Capacitor_SMD:C_0603_1608Metric" H 3600 2100 50  0001 C CNN
F 3 "~" H 3600 2100 50  0001 C CNN
	1    3600 2100
	-1   0    0    1   
$EndComp
$Comp
L Device:C_Small C2
U 1 1 5EF53AF1
P 3350 2100
F 0 "C2" H 3300 2050 39  0000 R CNN
F 1 "100n" H 3350 2150 39  0000 R CNN
F 2 "Capacitor_SMD:C_0603_1608Metric" H 3350 2100 50  0001 C CNN
F 3 "~" H 3350 2100 50  0001 C CNN
	1    3350 2100
	1    0    0    1   
$EndComp
Wire Wire Line
	3600 2200 3600 2300
Wire Wire Line
	3350 2200 3350 2300
$Comp
L power:GND #PWR07
U 1 1 5EF53AF9
P 3350 2000
F 0 "#PWR07" H 3350 1750 50  0001 C CNN
F 1 "GND" H 3355 1827 39  0000 C CNN
F 2 "" H 3350 2000 50  0001 C CNN
F 3 "" H 3350 2000 50  0001 C CNN
	1    3350 2000
	-1   0    0    1   
$EndComp
$Comp
L power:GND #PWR08
U 1 1 5EF53AFF
P 3600 2000
F 0 "#PWR08" H 3600 1750 50  0001 C CNN
F 1 "GND" H 3605 1827 39  0000 C CNN
F 2 "" H 3600 2000 50  0001 C CNN
F 3 "" H 3600 2000 50  0001 C CNN
	1    3600 2000
	-1   0    0    1   
$EndComp
$Comp
L power:GND #PWR05
U 1 1 5EF53B05
P 2500 2900
F 0 "#PWR05" H 2500 2650 50  0001 C CNN
F 1 "GND" H 2505 2727 39  0000 C CNN
F 2 "" H 2500 2900 50  0001 C CNN
F 3 "" H 2500 2900 50  0001 C CNN
	1    2500 2900
	1    0    0    -1  
$EndComp
Connection ~ 2500 2500
$Comp
L Device:C_Small C1
U 1 1 5EF53B0C
P 2500 2800
F 0 "C1" H 2450 2750 39  0000 R CNN
F 1 "10u" H 2450 2850 39  0000 R CNN
F 2 "Capacitor_SMD:C_0603_1608Metric" H 2500 2800 50  0001 C CNN
F 3 "~" H 2500 2800 50  0001 C CNN
	1    2500 2800
	1    0    0    1   
$EndComp
$Comp
L Device:R_Small R1
U 1 1 5EF53B12
P 2500 2250
F 0 "R1" H 2550 2200 39  0000 L CNN
F 1 "10k" H 2550 2250 39  0000 L CNN
F 2 "Resistor_SMD:R_0603_1608Metric" H 2500 2250 50  0001 C CNN
F 3 "~" H 2500 2250 50  0001 C CNN
	1    2500 2250
	-1   0    0    1   
$EndComp
Text Notes 4650 2500 0    28   ~ 0
UP during boot
Text Notes 4650 3100 0    28   ~ 0
DOWN during boot
Text Notes 4650 2700 0    28   ~ 0
DOWN during prog
Text Notes 4650 3400 0    28   ~ 0
UP during boot for log
Text Notes 2950 4250 1    28   ~ 0
Internally connected to the flash
Text Notes 4650 3000 0    28   ~ 0
UP during boot
Text Notes 4200 2500 0    39   ~ 0
IO0
Wire Wire Line
	2500 2500 2500 2700
Text Notes 4400 4700 2    28   ~ 0
only input
Text Notes 4400 4800 2    28   ~ 0
only input
Text Notes 2950 2700 2    28   ~ 0
only input
Text Notes 2950 2800 2    28   ~ 0
only input
Wire Wire Line
	2500 2500 3000 2500
Wire Wire Line
	2500 2000 2500 2150
Wire Wire Line
	2500 2350 2500 2500
Text Label 4400 2800 0    39   ~ 0
RXD
Text Label 4400 2600 0    39   ~ 0
TXD
Text Label 2650 2500 0    39   ~ 0
EN
Text Label 4400 2500 0    39   ~ 0
ID
$Comp
L RF_Module:ESP32-WROOM-32D U2
U 1 1 5EF53B46
P 3600 3700
F 0 "U2" H 3050 4200 50  0000 C CNN
F 1 "ESP32-WROOM-32D" H 2700 4100 50  0000 C CNN
F 2 "RF_Module:ESP32-WROOM-32" H 3600 2200 50  0001 C CNN
F 3 "https://www.espressif.com/sites/default/files/documentation/esp32-wroom-32d_esp32-wroom-32u_datasheet_en.pdf" H 3300 3750 50  0001 C CNN
	1    3600 3700
	1    0    0    -1  
$EndComp
Wire Wire Line
	3600 2300 3350 2300
Connection ~ 3600 2300
Connection ~ 3350 2300
NoConn ~ 3000 2800
NoConn ~ 3000 2700
NoConn ~ 3000 3700
NoConn ~ 3000 3800
NoConn ~ 3000 3900
NoConn ~ 3000 4000
NoConn ~ 3000 4100
NoConn ~ 3000 4200
Text Notes 4200 4200 0    50   ~ 0
DAC
Text Notes 4200 4300 0    50   ~ 0
DAC
Wire Wire Line
	4200 2500 4400 2500
Wire Wire Line
	4200 2600 4400 2600
Wire Wire Line
	4200 2800 4400 2800
Wire Wire Line
	4200 4200 4400 4200
Wire Wire Line
	4200 2900 4400 2900
Wire Wire Line
	4200 4600 4400 4600
Wire Wire Line
	4200 4500 4400 4500
Text GLabel 4400 4200 2    39   Input ~ 0
SCL
Text GLabel 4400 4600 2    39   Input ~ 0
SDA
Wire Wire Line
	6000 3400 5950 3400
Text Label 5850 3100 2    39   ~ 0
EN
Text Label 5850 3200 2    39   ~ 0
TXD
Text Label 5850 3300 2    39   ~ 0
RXD
Text Label 5850 3400 2    39   ~ 0
ID
$Comp
L power:+3.3V #PWR06
U 1 1 5F1180A7
P 3050 2000
F 0 "#PWR06" H 3050 1850 50  0001 C CNN
F 1 "+3.3V" H 3065 2173 39  0000 C CNN
F 2 "" H 3050 2000 50  0001 C CNN
F 3 "" H 3050 2000 50  0001 C CNN
	1    3050 2000
	1    0    0    -1  
$EndComp
$Comp
L power:+3.3V #PWR04
U 1 1 5F118EFF
P 2500 2000
F 0 "#PWR04" H 2500 1850 50  0001 C CNN
F 1 "+3.3V" H 2515 2173 39  0000 C CNN
F 2 "" H 2500 2000 50  0001 C CNN
F 3 "" H 2500 2000 50  0001 C CNN
	1    2500 2000
	1    0    0    -1  
$EndComp
Wire Wire Line
	6000 3500 5950 3500
Wire Wire Line
	5950 3500 5950 3400
Connection ~ 5950 3400
Wire Wire Line
	5950 3400 5850 3400
Wire Wire Line
	6000 3300 5850 3300
Wire Wire Line
	6000 3200 5850 3200
Wire Wire Line
	6000 3100 5850 3100
Wire Wire Line
	3050 2300 3350 2300
Wire Wire Line
	3050 2000 3050 2300
$Comp
L Switch:SW_Push SW1
U 1 1 5F3A9002
P 2100 2700
F 0 "SW1" V 2000 2950 39  0000 R CNN
F 1 "PTS815" V 2050 3050 39  0000 R CNN
F 2 "LEGOS:PTS815" H 2100 2900 50  0001 C CNN
F 3 "~" H 2100 2900 50  0001 C CNN
	1    2100 2700
	0    -1   1    0   
$EndComp
Wire Wire Line
	2100 2500 2500 2500
$Comp
L power:GND #PWR03
U 1 1 5F3AAB3C
P 2100 2900
F 0 "#PWR03" H 2100 2650 50  0001 C CNN
F 1 "GND" H 2105 2727 39  0000 C CNN
F 2 "" H 2100 2900 50  0001 C CNN
F 3 "" H 2100 2900 50  0001 C CNN
	1    2100 2900
	1    0    0    -1  
$EndComp
$Comp
L Power_Supervisor:LM809 U1
U 1 1 5F3ACC93
P 1400 2500
F 0 "U1" H 1171 2538 39  0000 R CNN
F 1 "TLV803E" H 1171 2463 39  0000 R CNN
F 2 "Package_TO_SOT_SMD:SOT-23" H 1700 2600 50  0001 C CNN
F 3 "https://www.ti.com/lit/ds/symlink/tlv803e.pdf" H 1700 2600 50  0001 C CNN
	1    1400 2500
	1    0    0    -1  
$EndComp
Wire Wire Line
	2100 2500 1700 2500
Connection ~ 2100 2500
$Comp
L power:GND #PWR02
U 1 1 5F3B631B
P 1400 2900
F 0 "#PWR02" H 1400 2650 50  0001 C CNN
F 1 "GND" H 1405 2727 39  0000 C CNN
F 2 "" H 1400 2900 50  0001 C CNN
F 3 "" H 1400 2900 50  0001 C CNN
	1    1400 2900
	1    0    0    -1  
$EndComp
$Comp
L power:+3.3V #PWR01
U 1 1 5F3B672D
P 1400 2000
F 0 "#PWR01" H 1400 1850 50  0001 C CNN
F 1 "+3.3V" H 1415 2173 39  0000 C CNN
F 2 "" H 1400 2000 50  0001 C CNN
F 3 "" H 1400 2000 50  0001 C CNN
	1    1400 2000
	1    0    0    -1  
$EndComp
Wire Wire Line
	1400 2000 1400 2100
$Sheet
S 6000 3000 550  600 
U 5F10C6CA
F0 "Connectors" 39
F1 "sub_connectors.sch" 39
F2 "EN" O L 6000 3100 39 
F3 "TXD" O L 6000 3200 39 
F4 "RXD" I L 6000 3300 39 
F5 "IO0" B L 6000 3400 39 
F6 "ID" B L 6000 3500 39 
$EndSheet
$Sheet
S 6000 3875 550  525 
U 5F16F295
F0 "UPS" 39
F1 "sub_power_ups.sch" 39
F2 "~GRID" I L 6000 4150 39 
F3 "IN" I L 6000 4000 39 
F4 "OUT" I L 6000 4300 39 
F5 "LED1" I R 6550 4050 39 
F6 "LED2" I R 6550 4150 39 
F7 "LED3" I R 6550 4250 39 
$EndSheet
$Comp
L LEGOS:VBUS #PWR?
U 1 1 5F3CBDF5
P 5850 4000
AR Path="/5F10C458/5F3CBDF5" Ref="#PWR?"  Part="1" 
AR Path="/5F3CBDF5" Ref="#PWR010"  Part="1" 
F 0 "#PWR010" H 5850 3850 39  0001 C CNN
F 1 "VBUS" H 5865 4173 39  0000 C CNN
F 2 "" H 5850 4000 39  0001 C CNN
F 3 "" H 5850 4000 39  0001 C CNN
	1    5850 4000
	1    0    0    -1  
$EndComp
Wire Wire Line
	6000 4000 5850 4000
Wire Wire Line
	5850 4150 6000 4150
Text Label 5850 4150 2    39   ~ 0
~GRID
$Sheet
S 6000 4700 550  500 
U 5F10C458
F0 "Telemetry" 39
F1 "sub_telemetry.sch" 39
F2 "V+" I L 6000 4950 39 
F3 "V-" I L 6000 5100 39 
F4 "VCOM" I L 6000 4800 39 
F5 "~IRQ" O R 6550 4800 39 
F6 "A1" I R 6550 5100 39 
F7 "A0" I R 6550 4950 39 
$EndSheet
Wire Wire Line
	6000 4300 5850 4300
Wire Wire Line
	5850 4300 5850 4800
Wire Wire Line
	5850 4800 6000 4800
Wire Wire Line
	5850 4800 5850 4950
Wire Wire Line
	5850 4950 6000 4950
Connection ~ 5850 4800
$Comp
L power:+3.3V #PWR011
U 1 1 5F3D48C7
P 5850 5100
F 0 "#PWR011" H 5850 4950 50  0001 C CNN
F 1 "+3.3V" H 5865 5273 39  0000 C CNN
F 2 "" H 5850 5100 50  0001 C CNN
F 3 "" H 5850 5100 50  0001 C CNN
	1    5850 5100
	-1   0    0    1   
$EndComp
Wire Wire Line
	6000 5100 5850 5100
Wire Wire Line
	4200 2700 4400 2700
Text Label 4400 2700 0    39   ~ 0
LED1
Wire Wire Line
	4200 3400 4400 3400
Text Label 4400 3200 0    39   ~ 0
LED2
Wire Wire Line
	4200 3200 4400 3200
Text Label 4400 3100 0    39   ~ 0
LED3
Wire Wire Line
	4200 4300 4400 4300
Text Label 4400 3400 0    39   ~ 0
~GRID
Wire Wire Line
	6550 4050 6650 4050
Text Label 6650 4050 0    39   ~ 0
LED1
Wire Wire Line
	6550 4250 6650 4250
Text Label 6650 4250 0    39   ~ 0
LED3
Wire Wire Line
	6550 4150 6650 4150
Text Label 6650 4150 0    39   ~ 0
LED2
$Comp
L Device:LED D?
U 1 1 5F4222E4
P 9125 1825
AR Path="/5EF664BB/5F4222E4" Ref="D?"  Part="1" 
AR Path="/5F1EAFA9/5F4222E4" Ref="D?"  Part="1" 
AR Path="/5F4222E4" Ref="D2"  Part="1" 
AR Path="/5F3B4B8B/5F4222E4" Ref="D?"  Part="1" 
AR Path="/5F3CD302/5F4222E4" Ref="D?"  Part="1" 
F 0 "D2" V 9150 1675 39  0000 L CNN
F 1 "IN-S126AT5UW" V 9225 1825 39  0001 L CNN
F 2 "LED_SMD:LED_1206_3216Metric_Castellated" H 9125 1825 50  0001 C CNN
F 3 "http://inolux-corp.com/datasheet/SMDLED/Mono%20Color%20Top%20View/IN-S126AT%20Series_V1.0.pdf" H 9125 1825 50  0001 C CNN
F 4 "IN-S126AT5UW" V 9125 1825 50  0001 C CNN "Mfr"
	1    9125 1825
	0    -1   -1   0   
$EndComp
Wire Wire Line
	9125 1975 9125 2075
Wire Wire Line
	10625 1975 10625 2075
Wire Wire Line
	10625 2075 10125 2075
Connection ~ 9125 2075
Wire Wire Line
	9125 2075 9125 2175
Wire Wire Line
	9625 1975 9625 2075
Connection ~ 9625 2075
Wire Wire Line
	9625 2075 9125 2075
Wire Wire Line
	10125 1975 10125 2075
Connection ~ 10125 2075
Wire Wire Line
	10125 2075 9625 2075
$Comp
L power:GND #PWR?
U 1 1 5F422310
P 9125 3025
AR Path="/5F3B4B8B/5F422310" Ref="#PWR?"  Part="1" 
AR Path="/5F3CD302/5F422310" Ref="#PWR?"  Part="1" 
AR Path="/5F422310" Ref="#PWR023"  Part="1" 
F 0 "#PWR023" H 9125 2775 50  0001 C CNN
F 1 "GND" H 9130 2852 39  0000 C CNN
F 2 "" H 9125 3025 50  0001 C CNN
F 3 "" H 9125 3025 50  0001 C CNN
	1    9125 3025
	1    0    0    -1  
$EndComp
$Comp
L Device:R_Small R?
U 1 1 5F422316
P 9125 2275
AR Path="/5EF664BB/5F422316" Ref="R?"  Part="1" 
AR Path="/5F1EAFA9/5F422316" Ref="R?"  Part="1" 
AR Path="/5F422316" Ref="R5"  Part="1" 
AR Path="/5F3B4B8B/5F422316" Ref="R?"  Part="1" 
AR Path="/5F3CD302/5F422316" Ref="R?"  Part="1" 
F 0 "R5" H 9184 2321 39  0000 L CNN
F 1 "3.3" H 9184 2230 39  0000 L CNN
F 2 "Resistor_SMD:R_0603_1608Metric" H 9125 2275 50  0001 C CNN
F 3 "~" H 9125 2275 50  0001 C CNN
	1    9125 2275
	1    0    0    -1  
$EndComp
Wire Wire Line
	9125 2375 9125 2475
$Comp
L power:+3.3V #PWR?
U 1 1 5F42231D
P 9625 1575
AR Path="/5F3B4B8B/5F42231D" Ref="#PWR?"  Part="1" 
AR Path="/5F3CD302/5F42231D" Ref="#PWR?"  Part="1" 
AR Path="/5F42231D" Ref="#PWR024"  Part="1" 
F 0 "#PWR024" H 9625 1425 50  0001 C CNN
F 1 "+3.3V" H 9640 1740 39  0000 C CNN
F 2 "" H 9625 1575 50  0001 C CNN
F 3 "" H 9625 1575 50  0001 C CNN
	1    9625 1575
	1    0    0    -1  
$EndComp
Wire Wire Line
	9625 1575 9625 1675
$Comp
L power:+3.3V #PWR?
U 1 1 5F422324
P 9125 1575
AR Path="/5F3B4B8B/5F422324" Ref="#PWR?"  Part="1" 
AR Path="/5F3CD302/5F422324" Ref="#PWR?"  Part="1" 
AR Path="/5F422324" Ref="#PWR022"  Part="1" 
F 0 "#PWR022" H 9125 1425 50  0001 C CNN
F 1 "+3.3V" H 9140 1740 39  0000 C CNN
F 2 "" H 9125 1575 50  0001 C CNN
F 3 "" H 9125 1575 50  0001 C CNN
	1    9125 1575
	1    0    0    -1  
$EndComp
Wire Wire Line
	9125 1575 9125 1675
$Comp
L power:+3.3V #PWR?
U 1 1 5F42232B
P 10125 1575
AR Path="/5F3B4B8B/5F42232B" Ref="#PWR?"  Part="1" 
AR Path="/5F3CD302/5F42232B" Ref="#PWR?"  Part="1" 
AR Path="/5F42232B" Ref="#PWR025"  Part="1" 
F 0 "#PWR025" H 10125 1425 50  0001 C CNN
F 1 "+3.3V" H 10140 1740 39  0000 C CNN
F 2 "" H 10125 1575 50  0001 C CNN
F 3 "" H 10125 1575 50  0001 C CNN
	1    10125 1575
	1    0    0    -1  
$EndComp
Wire Wire Line
	10125 1575 10125 1675
$Comp
L power:+3.3V #PWR?
U 1 1 5F422332
P 10625 1575
AR Path="/5F3B4B8B/5F422332" Ref="#PWR?"  Part="1" 
AR Path="/5F3CD302/5F422332" Ref="#PWR?"  Part="1" 
AR Path="/5F422332" Ref="#PWR027"  Part="1" 
F 0 "#PWR027" H 10625 1425 50  0001 C CNN
F 1 "+3.3V" H 10640 1740 39  0000 C CNN
F 2 "" H 10625 1575 50  0001 C CNN
F 3 "" H 10625 1575 50  0001 C CNN
	1    10625 1575
	1    0    0    -1  
$EndComp
Wire Wire Line
	10625 1575 10625 1675
Wire Wire Line
	8125 2675 8275 2675
Text Notes 9275 2500 0    39   ~ 0
IN-S126AT5UW (White)\nVf = 3.1 @ If = 10 mA
$Comp
L Device:Q_NMOS_GSD Q2
U 1 1 5F42798C
P 9025 2675
F 0 "Q2" H 9230 2713 39  0000 L CNN
F 1 "Si2302CDS" H 9230 2638 39  0000 L CNN
F 2 "Package_TO_SOT_SMD:SOT-23" H 9225 2775 50  0001 C CNN
F 3 "https://eu.mouser.com/datasheet/2/427/si2302cds-1764899.pdf" H 9025 2675 50  0001 C CNN
	1    9025 2675
	1    0    0    -1  
$EndComp
Wire Wire Line
	10125 2175 10125 2075
Wire Wire Line
	10625 2175 10625 2075
$Comp
L power:+3.3V #PWR?
U 1 1 5F42BB40
P 10625 2575
AR Path="/5F3B4B8B/5F42BB40" Ref="#PWR?"  Part="1" 
AR Path="/5F3CD302/5F42BB40" Ref="#PWR?"  Part="1" 
AR Path="/5F42BB40" Ref="#PWR028"  Part="1" 
F 0 "#PWR028" H 10625 2425 50  0001 C CNN
F 1 "+3.3V" H 10640 2740 39  0000 C CNN
F 2 "" H 10625 2575 50  0001 C CNN
F 3 "" H 10625 2575 50  0001 C CNN
	1    10625 2575
	-1   0    0    1   
$EndComp
Wire Wire Line
	10625 2575 10625 2475
$Comp
L power:+3.3V #PWR?
U 1 1 5F42BB47
P 10125 2575
AR Path="/5F3B4B8B/5F42BB47" Ref="#PWR?"  Part="1" 
AR Path="/5F3CD302/5F42BB47" Ref="#PWR?"  Part="1" 
AR Path="/5F42BB47" Ref="#PWR026"  Part="1" 
F 0 "#PWR026" H 10125 2425 50  0001 C CNN
F 1 "+3.3V" H 10140 2740 39  0000 C CNN
F 2 "" H 10125 2575 50  0001 C CNN
F 3 "" H 10125 2575 50  0001 C CNN
	1    10125 2575
	-1   0    0    1   
$EndComp
Wire Wire Line
	10125 2575 10125 2475
$Comp
L Device:R_Small R?
U 1 1 5F430634
P 8275 2875
AR Path="/5EF664BB/5F430634" Ref="R?"  Part="1" 
AR Path="/5F1EAFA9/5F430634" Ref="R?"  Part="1" 
AR Path="/5F430634" Ref="R3"  Part="1" 
AR Path="/5F3B4B8B/5F430634" Ref="R?"  Part="1" 
AR Path="/5F3CD302/5F430634" Ref="R?"  Part="1" 
F 0 "R3" H 8334 2921 39  0000 L CNN
F 1 "10k" H 8334 2830 39  0000 L CNN
F 2 "Resistor_SMD:R_0603_1608Metric" H 8275 2875 50  0001 C CNN
F 3 "~" H 8275 2875 50  0001 C CNN
	1    8275 2875
	1    0    0    -1  
$EndComp
Wire Wire Line
	9125 2875 9125 3025
Wire Wire Line
	8275 2975 8275 3025
Wire Wire Line
	8275 2775 8275 2675
Connection ~ 8275 2675
$Comp
L power:GND #PWR?
U 1 1 5F43C883
P 8275 3025
AR Path="/5F3B4B8B/5F43C883" Ref="#PWR?"  Part="1" 
AR Path="/5F3CD302/5F43C883" Ref="#PWR?"  Part="1" 
AR Path="/5F43C883" Ref="#PWR019"  Part="1" 
F 0 "#PWR019" H 8275 2775 50  0001 C CNN
F 1 "GND" H 8280 2852 39  0000 C CNN
F 2 "" H 8275 3025 50  0001 C CNN
F 3 "" H 8275 3025 50  0001 C CNN
	1    8275 3025
	1    0    0    -1  
$EndComp
Connection ~ 10625 2075
$Comp
L power:+3.3V #PWR?
U 1 1 5F47D783
P 8125 1575
AR Path="/5F3B4B8B/5F47D783" Ref="#PWR?"  Part="1" 
AR Path="/5F3CD302/5F47D783" Ref="#PWR?"  Part="1" 
AR Path="/5F47D783" Ref="#PWR016"  Part="1" 
F 0 "#PWR016" H 8125 1425 50  0001 C CNN
F 1 "+3.3V" H 8140 1740 39  0000 C CNN
F 2 "" H 8125 1575 50  0001 C CNN
F 3 "" H 8125 1575 50  0001 C CNN
	1    8125 1575
	1    0    0    -1  
$EndComp
Wire Wire Line
	8125 1575 8125 1650
$Comp
L power:GND #PWR?
U 1 1 5F4F976F
P 7875 2450
AR Path="/5F3B4B8B/5F4F976F" Ref="#PWR?"  Part="1" 
AR Path="/5F3CD302/5F4F976F" Ref="#PWR?"  Part="1" 
AR Path="/5F4F976F" Ref="#PWR015"  Part="1" 
F 0 "#PWR015" H 7875 2200 50  0001 C CNN
F 1 "GND" H 7880 2277 39  0000 C CNN
F 2 "" H 7875 2450 50  0001 C CNN
F 3 "" H 7875 2450 50  0001 C CNN
	1    7875 2450
	1    0    0    -1  
$EndComp
$Comp
L power:+3.3V #PWR?
U 1 1 5F5019D9
P 7050 2150
AR Path="/5F3B4B8B/5F5019D9" Ref="#PWR?"  Part="1" 
AR Path="/5F3CD302/5F5019D9" Ref="#PWR?"  Part="1" 
AR Path="/5F5019D9" Ref="#PWR012"  Part="1" 
F 0 "#PWR012" H 7050 2000 50  0001 C CNN
F 1 "+3.3V" H 7065 2315 39  0000 C CNN
F 2 "" H 7050 2150 50  0001 C CNN
F 3 "" H 7050 2150 50  0001 C CNN
	1    7050 2150
	-1   0    0    -1  
$EndComp
$Comp
L power:GND #PWR?
U 1 1 5F5019D3
P 7050 2450
AR Path="/5F3B4B8B/5F5019D3" Ref="#PWR?"  Part="1" 
AR Path="/5F3CD302/5F5019D3" Ref="#PWR?"  Part="1" 
AR Path="/5F5019D3" Ref="#PWR013"  Part="1" 
F 0 "#PWR013" H 7050 2200 50  0001 C CNN
F 1 "GND" H 7055 2277 39  0000 C CNN
F 2 "" H 7050 2450 50  0001 C CNN
F 3 "" H 7050 2450 50  0001 C CNN
	1    7050 2450
	-1   0    0    -1  
$EndComp
Wire Wire Line
	7050 2350 6975 2350
Wire Wire Line
	6975 2250 7050 2250
Text Label 6975 2350 2    39   ~ 0
~HELI
Text Label 6975 2250 2    39   ~ 0
ROOM1
Text Label 7950 4450 2    39   ~ 0
~AUTO
Wire Wire Line
	8275 2675 8825 2675
$Comp
L power:GND #PWR?
U 1 1 5F6065C2
P 9125 5225
AR Path="/5F3B4B8B/5F6065C2" Ref="#PWR?"  Part="1" 
AR Path="/5F3CD302/5F6065C2" Ref="#PWR?"  Part="1" 
AR Path="/5F6065C2" Ref="#PWR021"  Part="1" 
F 0 "#PWR021" H 9125 4975 50  0001 C CNN
F 1 "GND" H 9130 5052 39  0000 C CNN
F 2 "" H 9125 5225 50  0001 C CNN
F 3 "" H 9125 5225 50  0001 C CNN
	1    9125 5225
	1    0    0    -1  
$EndComp
Wire Wire Line
	8100 4875 8250 4875
$Comp
L Device:Q_NMOS_GSD Q1
U 1 1 5F6065C9
P 9025 4875
F 0 "Q1" H 9230 4913 39  0000 L CNN
F 1 "Si2302CDS" H 9230 4838 39  0000 L CNN
F 2 "Package_TO_SOT_SMD:SOT-23" H 9225 4975 50  0001 C CNN
F 3 "https://eu.mouser.com/datasheet/2/427/si2302cds-1764899.pdf" H 9025 4875 50  0001 C CNN
	1    9025 4875
	1    0    0    -1  
$EndComp
$Comp
L Device:R_Small R?
U 1 1 5F6065CF
P 8250 5075
AR Path="/5EF664BB/5F6065CF" Ref="R?"  Part="1" 
AR Path="/5F1EAFA9/5F6065CF" Ref="R?"  Part="1" 
AR Path="/5F6065CF" Ref="R2"  Part="1" 
AR Path="/5F3B4B8B/5F6065CF" Ref="R?"  Part="1" 
AR Path="/5F3CD302/5F6065CF" Ref="R?"  Part="1" 
F 0 "R2" H 8309 5121 39  0000 L CNN
F 1 "10k" H 8309 5030 39  0000 L CNN
F 2 "Resistor_SMD:R_0603_1608Metric" H 8250 5075 50  0001 C CNN
F 3 "~" H 8250 5075 50  0001 C CNN
	1    8250 5075
	1    0    0    -1  
$EndComp
Wire Wire Line
	9125 5075 9125 5225
Wire Wire Line
	8250 5175 8250 5225
Wire Wire Line
	8250 4975 8250 4875
Connection ~ 8250 4875
$Comp
L power:GND #PWR?
U 1 1 5F6065D9
P 8250 5225
AR Path="/5F3B4B8B/5F6065D9" Ref="#PWR?"  Part="1" 
AR Path="/5F3CD302/5F6065D9" Ref="#PWR?"  Part="1" 
AR Path="/5F6065D9" Ref="#PWR018"  Part="1" 
F 0 "#PWR018" H 8250 4975 50  0001 C CNN
F 1 "GND" H 8255 5052 39  0000 C CNN
F 2 "" H 8250 5225 50  0001 C CNN
F 3 "" H 8250 5225 50  0001 C CNN
	1    8250 5225
	1    0    0    -1  
$EndComp
Wire Wire Line
	8100 4875 8100 4550
$Comp
L Device:LED D?
U 1 1 5F615431
P 9125 4025
AR Path="/5EF664BB/5F615431" Ref="D?"  Part="1" 
AR Path="/5F1EAFA9/5F615431" Ref="D?"  Part="1" 
AR Path="/5F615431" Ref="D1"  Part="1" 
AR Path="/5F3B4B8B/5F615431" Ref="D?"  Part="1" 
AR Path="/5F3CD302/5F615431" Ref="D?"  Part="1" 
F 0 "D1" V 9072 4103 39  0000 L CNN
F 1 "OVLAW4CB7" V 9163 4103 39  0000 L CNN
F 2 "LED_THT:LED_D3.0mm_Clear" H 9125 4025 50  0001 C CNN
F 3 "https://eu.mouser.com/datasheet/2/414/OVLAW4CB7-1530683.pdf" H 9125 4025 50  0001 C CNN
F 4 "OVLAW4CB7" V 9125 4025 50  0001 C CNN "Mfr"
	1    9125 4025
	0    -1   -1   0   
$EndComp
$Comp
L Device:R_Small R?
U 1 1 5F61543B
P 9125 4475
AR Path="/5EF664BB/5F61543B" Ref="R?"  Part="1" 
AR Path="/5F1EAFA9/5F61543B" Ref="R?"  Part="1" 
AR Path="/5F61543B" Ref="R4"  Part="1" 
AR Path="/5F3B4B8B/5F61543B" Ref="R?"  Part="1" 
AR Path="/5F3CD302/5F61543B" Ref="R?"  Part="1" 
F 0 "R4" H 9184 4521 39  0000 L CNN
F 1 "5" H 9184 4430 39  0000 L CNN
F 2 "Resistor_SMD:R_0603_1608Metric" H 9125 4475 50  0001 C CNN
F 3 "~" H 9125 4475 50  0001 C CNN
	1    9125 4475
	1    0    0    -1  
$EndComp
Wire Wire Line
	9125 4575 9125 4675
$Comp
L power:+3.3V #PWR?
U 1 1 5F615442
P 9125 3775
AR Path="/5F3B4B8B/5F615442" Ref="#PWR?"  Part="1" 
AR Path="/5F3CD302/5F615442" Ref="#PWR?"  Part="1" 
AR Path="/5F615442" Ref="#PWR020"  Part="1" 
F 0 "#PWR020" H 9125 3625 50  0001 C CNN
F 1 "+3.3V" H 9140 3940 39  0000 C CNN
F 2 "" H 9125 3775 50  0001 C CNN
F 3 "" H 9125 3775 50  0001 C CNN
	1    9125 3775
	1    0    0    -1  
$EndComp
Wire Wire Line
	9125 3775 9125 3875
Wire Wire Line
	9125 4175 9125 4375
Text Label 7950 4550 2    39   ~ 0
ROOM0
Wire Wire Line
	7950 4450 8225 4450
Wire Wire Line
	7950 4550 8100 4550
Wire Notes Line
	11150 3400 11150 1200
Text Notes 7600 1400 0    39   ~ 0
ROOF
Wire Wire Line
	8250 4875 8825 4875
Text Label 4400 3600 0    39   ~ 0
~HELI
Text Label 4400 2900 0    39   ~ 0
ROOM0
Text Label 4400 3500 0    39   ~ 0
ROOM1
Wire Wire Line
	6650 4800 6550 4800
Wire Wire Line
	6650 4950 6550 4950
Wire Wire Line
	6650 5100 6550 5100
$Comp
L power:GND #PWR?
U 1 1 5F41C2DA
P 6650 5100
AR Path="/5F3B4B8B/5F41C2DA" Ref="#PWR?"  Part="1" 
AR Path="/5F3CD302/5F41C2DA" Ref="#PWR?"  Part="1" 
AR Path="/5F41C2DA" Ref="#PWR0101"  Part="1" 
F 0 "#PWR0101" H 6650 4850 50  0001 C CNN
F 1 "GND" V 6650 4900 39  0000 C CNN
F 2 "" H 6650 5100 50  0001 C CNN
F 3 "" H 6650 5100 50  0001 C CNN
	1    6650 5100
	0    -1   -1   0   
$EndComp
Wire Wire Line
	6650 4950 6650 5100
Connection ~ 6650 5100
Text Label 6650 4800 0    39   ~ 0
~IRQ
Text Label 4400 4500 0    39   ~ 0
~IRQ
Wire Wire Line
	4400 3500 4200 3500
Wire Wire Line
	4400 3600 4200 3600
$Comp
L Device:LED D?
U 1 1 5F42BB35
P 10125 2325
AR Path="/5EF664BB/5F42BB35" Ref="D?"  Part="1" 
AR Path="/5F1EAFA9/5F42BB35" Ref="D?"  Part="1" 
AR Path="/5F42BB35" Ref="D5"  Part="1" 
AR Path="/5F3B4B8B/5F42BB35" Ref="D?"  Part="1" 
AR Path="/5F3CD302/5F42BB35" Ref="D?"  Part="1" 
F 0 "D5" V 10075 2400 39  0000 L CNN
F 1 "IN-S126AT5UW" V 10225 2325 39  0001 L CNN
F 2 "LED_SMD:LED_1206_3216Metric_Castellated" H 10125 2325 50  0001 C CNN
F 3 "http://inolux-corp.com/datasheet/SMDLED/Mono%20Color%20Top%20View/IN-S126AT%20Series_V1.0.pdf" H 10125 2325 50  0001 C CNN
F 4 "IN-S126AT5UW" V 10125 2325 50  0001 C CNN "Mfr"
	1    10125 2325
	0    1    1    0   
$EndComp
$Comp
L Device:LED D?
U 1 1 5F42BB2E
P 10625 2325
AR Path="/5EF664BB/5F42BB2E" Ref="D?"  Part="1" 
AR Path="/5F1EAFA9/5F42BB2E" Ref="D?"  Part="1" 
AR Path="/5F42BB2E" Ref="D7"  Part="1" 
AR Path="/5F3B4B8B/5F42BB2E" Ref="D?"  Part="1" 
AR Path="/5F3CD302/5F42BB2E" Ref="D?"  Part="1" 
F 0 "D7" V 10572 2403 39  0000 L CNN
F 1 "IN-S126AT5UW" V 10625 2400 39  0000 L CNN
F 2 "LED_SMD:LED_1206_3216Metric_Castellated" H 10625 2325 50  0001 C CNN
F 3 "http://inolux-corp.com/datasheet/SMDLED/Mono%20Color%20Top%20View/IN-S126AT%20Series_V1.0.pdf" H 10625 2325 50  0001 C CNN
F 4 "IN-S126AT5UW" V 10625 2325 50  0001 C CNN "Mfr"
	1    10625 2325
	0    1    1    0   
$EndComp
$Comp
L Device:LED D?
U 1 1 5F4222F9
P 10625 1825
AR Path="/5EF664BB/5F4222F9" Ref="D?"  Part="1" 
AR Path="/5F1EAFA9/5F4222F9" Ref="D?"  Part="1" 
AR Path="/5F4222F9" Ref="D6"  Part="1" 
AR Path="/5F3B4B8B/5F4222F9" Ref="D?"  Part="1" 
AR Path="/5F3CD302/5F4222F9" Ref="D?"  Part="1" 
F 0 "D6" V 10650 1675 39  0000 L CNN
F 1 "IN-S126AT5UW" V 10600 1300 39  0000 L CNN
F 2 "LED_SMD:LED_1206_3216Metric_Castellated" H 10625 1825 50  0001 C CNN
F 3 "http://inolux-corp.com/datasheet/SMDLED/Mono%20Color%20Top%20View/IN-S126AT%20Series_V1.0.pdf" H 10625 1825 50  0001 C CNN
F 4 "IN-S126AT5UW" V 10625 1825 50  0001 C CNN "Mfr"
	1    10625 1825
	0    -1   -1   0   
$EndComp
$Comp
L Device:LED D?
U 1 1 5F4222EB
P 9625 1825
AR Path="/5EF664BB/5F4222EB" Ref="D?"  Part="1" 
AR Path="/5F1EAFA9/5F4222EB" Ref="D?"  Part="1" 
AR Path="/5F4222EB" Ref="D3"  Part="1" 
AR Path="/5F3B4B8B/5F4222EB" Ref="D?"  Part="1" 
AR Path="/5F3CD302/5F4222EB" Ref="D?"  Part="1" 
F 0 "D3" V 9650 1675 39  0000 L CNN
F 1 "IN-S126AT5UW" V 9725 1825 39  0001 L CNN
F 2 "LED_SMD:LED_1206_3216Metric_Castellated" H 9625 1825 50  0001 C CNN
F 3 "http://inolux-corp.com/datasheet/SMDLED/Mono%20Color%20Top%20View/IN-S126AT%20Series_V1.0.pdf" H 9625 1825 50  0001 C CNN
F 4 "IN-S126AT5UW" V 9625 1825 50  0001 C CNN "Mfr"
	1    9625 1825
	0    -1   -1   0   
$EndComp
Text Label 4400 3000 0    39   ~ 0
~AUTO
Wire Notes Line
	7500 1200 7500 3400
Wire Wire Line
	8125 1850 8125 1900
$Comp
L Connector_Generic:Conn_01x04 J1
U 1 1 5F5019CB
P 7250 2350
F 0 "J1" H 7250 2025 50  0000 C CNN
F 1 "Conn_01x04" V 7350 2275 50  0000 C CNN
F 2 "Connector_PinSocket_2.54mm:PinSocket_1x04_P2.54mm_Vertical_SMD_Pin1Left" H 7250 2350 50  0001 C CNN
F 3 "https://www.mouser.de/datasheet/2/527/ssm_sm-1317000.pdf" H 7250 2350 50  0001 C CNN
F 4 "SSM-104-L-SV-TR" H 7250 2350 50  0001 C CNN "Mfr"
	1    7250 2350
	1    0    0    1   
$EndComp
$Comp
L power:+3.3V #PWR?
U 1 1 5F4FA5D2
P 7875 2150
AR Path="/5F3B4B8B/5F4FA5D2" Ref="#PWR?"  Part="1" 
AR Path="/5F3CD302/5F4FA5D2" Ref="#PWR?"  Part="1" 
AR Path="/5F4FA5D2" Ref="#PWR014"  Part="1" 
F 0 "#PWR014" H 7875 2000 50  0001 C CNN
F 1 "+3.3V" H 7890 2315 39  0000 C CNN
F 2 "" H 7875 2150 50  0001 C CNN
F 3 "" H 7875 2150 50  0001 C CNN
	1    7875 2150
	1    0    0    -1  
$EndComp
$Comp
L Connector_Generic:Conn_01x04 J2
U 1 1 5F48B00A
P 7675 2350
F 0 "J2" H 7675 2025 50  0000 C CNN
F 1 "Conn_01x04" V 7775 2275 50  0000 C CNN
F 2 "Connector_PinSocket_2.54mm:PinSocket_1x04_P2.54mm_Vertical_SMD_Pin1Left" H 7675 2350 50  0001 C CNN
F 3 "https://www.mouser.de/datasheet/2/527/ssm_sm-1317000.pdf" H 7675 2350 50  0001 C CNN
F 4 "SSM-104-L-SV-TR" H 7675 2350 50  0001 C CNN "Mfr"
	1    7675 2350
	-1   0    0    1   
$EndComp
$Comp
L power:GND #PWR?
U 1 1 5F4863EF
P 8125 1900
AR Path="/5F3B4B8B/5F4863EF" Ref="#PWR?"  Part="1" 
AR Path="/5F3CD302/5F4863EF" Ref="#PWR?"  Part="1" 
AR Path="/5F4863EF" Ref="#PWR017"  Part="1" 
F 0 "#PWR017" H 8125 1650 50  0001 C CNN
F 1 "GND" H 8130 1727 39  0000 C CNN
F 2 "" H 8125 1900 50  0001 C CNN
F 3 "" H 8125 1900 50  0001 C CNN
	1    8125 1900
	1    0    0    -1  
$EndComp
$Comp
L Device:CP_Small C4
U 1 1 5F47A024
P 8125 1750
F 0 "C4" H 8275 1700 39  0000 R CNN
F 1 "10u" H 8275 1800 39  0000 R CNN
F 2 "Capacitor_SMD:C_0603_1608Metric" H 8125 1750 50  0001 C CNN
F 3 "~" H 8125 1750 50  0001 C CNN
	1    8125 1750
	1    0    0    -1  
$EndComp
Wire Notes Line
	7500 3400 11150 3400
Wire Notes Line
	7500 1200 11150 1200
$Comp
L Device:LED D?
U 1 1 5F4222F2
P 10125 1825
AR Path="/5EF664BB/5F4222F2" Ref="D?"  Part="1" 
AR Path="/5F1EAFA9/5F4222F2" Ref="D?"  Part="1" 
AR Path="/5F4222F2" Ref="D4"  Part="1" 
AR Path="/5F3B4B8B/5F4222F2" Ref="D?"  Part="1" 
AR Path="/5F3CD302/5F4222F2" Ref="D?"  Part="1" 
F 0 "D4" V 10150 1675 39  0000 L CNN
F 1 "IN-S126AT5UW" V 10225 1825 39  0001 L CNN
F 2 "LED_SMD:LED_1206_3216Metric_Castellated" H 10125 1825 50  0001 C CNN
F 3 "http://inolux-corp.com/datasheet/SMDLED/Mono%20Color%20Top%20View/IN-S126AT%20Series_V1.0.pdf" H 10125 1825 50  0001 C CNN
F 4 "IN-S126AT5UW" V 10125 1825 50  0001 C CNN "Mfr"
	1    10125 1825
	0    -1   -1   0   
$EndComp
$Sheet
S 6000 2500 550  225 
U 5F553E06
F0 "Mechanical" 39
F1 "sub_mechanical.sch" 39
$EndSheet
Wire Wire Line
	7875 2250 8125 2250
Wire Wire Line
	8125 2250 8125 2675
Wire Wire Line
	8250 2250 8200 2250
Wire Wire Line
	8200 2250 8200 2350
Wire Wire Line
	8200 2350 7875 2350
Wire Wire Line
	4200 3000 4400 3000
Wire Wire Line
	4200 3100 4400 3100
$Sheet
S 8225 4200 550  500 
U 5F3CD302
F0 "Emergency-Auto" 39
F1 "sub_emergency_auto.sch" 39
F2 "~EMRGY" I L 8225 4450 39 
$EndSheet
$Sheet
S 8250 2000 550  500 
U 5F3B4B8B
F0 "Emergency-Heli" 39
F1 "sub_emergency_heli.sch" 39
F2 "~EMRGY" I L 8250 2250 39 
$EndSheet
$EndSCHEMATC
