EESchema Schematic File Version 4
EELAYER 30 0
EELAYER END
$Descr A4 11693 8268
encoding utf-8
Sheet 3 8
Title "Led Indicator"
Date "2020-08-10"
Rev "1.0"
Comp "Institute for Automation of Complex Power Systems - E.ON ERC - RWTH Aachen University"
Comment1 "Designer: D. Wienands, S. Melcher, L. Jeske, D. Moll"
Comment2 "Supervisor: C. Guarnieri Calò Carducci"
Comment3 ""
Comment4 ""
$EndDescr
$Comp
L power:GND #PWR020
U 1 1 5F0FC736
P 2000 4500
F 0 "#PWR020" H 2000 4250 50  0001 C CNN
F 1 "GND" H 2005 4327 39  0000 C CNN
F 2 "" H 2000 4500 50  0001 C CNN
F 3 "" H 2000 4500 50  0001 C CNN
	1    2000 4500
	1    0    0    -1  
$EndComp
Text HLabel 9400 4200 0    39   Input ~ 0
100%
Text HLabel 7400 4200 0    39   Input ~ 0
80%
Text HLabel 5400 4200 0    39   Input ~ 0
60%
Text HLabel 3400 4200 0    39   Input ~ 0
40%
Text HLabel 1400 4200 0    39   Input ~ 0
20%
$Comp
L Device:R_Small R4
U 1 1 5F0D130D
P 2000 3300
F 0 "R4" H 2059 3346 39  0000 L CNN
F 1 "80" H 2059 3255 39  0000 L CNN
F 2 "Resistor_SMD:R_0603_1608Metric" H 2000 3300 50  0001 C CNN
F 3 "~" H 2000 3300 50  0001 C CNN
	1    2000 3300
	1    0    0    -1  
$EndComp
$Comp
L Device:Q_NMOS_GSD Q1
U 1 1 5F10B78D
P 1900 4200
F 0 "Q1" H 2105 4246 50  0000 L CNN
F 1 "Si2302CDS" H 2105 4155 50  0000 L CNN
F 2 "Package_TO_SOT_SMD:SOT-23" H 2100 4300 50  0001 C CNN
F 3 "https://eu.mouser.com/datasheet/2/427/si2302cds-1764899.pdf" H 1900 4200 50  0001 C CNN
	1    1900 4200
	1    0    0    -1  
$EndComp
$Comp
L Device:R_Small R3
U 1 1 5F15B3F1
P 1500 4400
F 0 "R3" H 1559 4438 39  0000 L CNN
F 1 "10k" H 1559 4363 39  0000 L CNN
F 2 "Resistor_SMD:R_0603_1608Metric" H 1500 4400 50  0001 C CNN
F 3 "~" H 1500 4400 50  0001 C CNN
	1    1500 4400
	1    0    0    -1  
$EndComp
$Comp
L power:GND #PWR018
U 1 1 5F1628D3
P 1500 4500
F 0 "#PWR018" H 1500 4250 50  0001 C CNN
F 1 "GND" H 1505 4327 39  0000 C CNN
F 2 "" H 1500 4500 50  0001 C CNN
F 3 "" H 1500 4500 50  0001 C CNN
	1    1500 4500
	1    0    0    -1  
$EndComp
$Comp
L power:+5V #PWR019
U 1 1 5F0DA6F7
P 2000 3100
F 0 "#PWR019" H 2000 2950 50  0001 C CNN
F 1 "+5V" H 2015 3273 50  0000 C CNN
F 2 "" H 2000 3100 50  0001 C CNN
F 3 "" H 2000 3100 50  0001 C CNN
	1    2000 3100
	1    0    0    -1  
$EndComp
$Comp
L Device:LED D2
U 1 1 5F3676AD
P 2000 3700
F 0 "D2" V 2031 3582 39  0000 R CNN
F 1 "IN-S126AT5UW" V 1956 3582 39  0000 R CNN
F 2 "LED_SMD:LED_1206_3216Metric_Castellated" H 2000 3700 50  0001 C CNN
F 3 "http://inolux-corp.com/datasheet/SMDLED/Mono%20Color%20Top%20View/IN-S126AT%20Series_V1.0.pdf" H 2000 3700 50  0001 C CNN
	1    2000 3700
	0    -1   -1   0   
$EndComp
Wire Wire Line
	2000 3850 2000 4000
Wire Wire Line
	2000 3400 2000 3550
Wire Wire Line
	2000 3100 2000 3200
Wire Wire Line
	1700 4200 1500 4200
Wire Wire Line
	1500 4200 1500 4300
Wire Wire Line
	2000 4400 2000 4500
Wire Wire Line
	1400 4200 1500 4200
Connection ~ 1500 4200
$Comp
L power:GND #PWR023
U 1 1 5F38FBAC
P 4000 4500
F 0 "#PWR023" H 4000 4250 50  0001 C CNN
F 1 "GND" H 4005 4327 39  0000 C CNN
F 2 "" H 4000 4500 50  0001 C CNN
F 3 "" H 4000 4500 50  0001 C CNN
	1    4000 4500
	1    0    0    -1  
$EndComp
$Comp
L Device:R_Small R6
U 1 1 5F38FBB2
P 4000 3300
F 0 "R6" H 4059 3346 39  0000 L CNN
F 1 "80" H 4059 3255 39  0000 L CNN
F 2 "Resistor_SMD:R_0603_1608Metric" H 4000 3300 50  0001 C CNN
F 3 "~" H 4000 3300 50  0001 C CNN
	1    4000 3300
	1    0    0    -1  
$EndComp
$Comp
L Device:R_Small R5
U 1 1 5F38FBBE
P 3500 4400
F 0 "R5" H 3559 4438 39  0000 L CNN
F 1 "10k" H 3559 4363 39  0000 L CNN
F 2 "Resistor_SMD:R_0603_1608Metric" H 3500 4400 50  0001 C CNN
F 3 "~" H 3500 4400 50  0001 C CNN
	1    3500 4400
	1    0    0    -1  
$EndComp
$Comp
L power:GND #PWR021
U 1 1 5F38FBC4
P 3500 4500
F 0 "#PWR021" H 3500 4250 50  0001 C CNN
F 1 "GND" H 3505 4327 39  0000 C CNN
F 2 "" H 3500 4500 50  0001 C CNN
F 3 "" H 3500 4500 50  0001 C CNN
	1    3500 4500
	1    0    0    -1  
$EndComp
$Comp
L power:+5V #PWR022
U 1 1 5F38FBCA
P 4000 3100
F 0 "#PWR022" H 4000 2950 50  0001 C CNN
F 1 "+5V" H 4015 3273 50  0000 C CNN
F 2 "" H 4000 3100 50  0001 C CNN
F 3 "" H 4000 3100 50  0001 C CNN
	1    4000 3100
	1    0    0    -1  
$EndComp
$Comp
L Device:LED D3
U 1 1 5F38FBD0
P 4000 3700
F 0 "D3" V 4031 3582 39  0000 R CNN
F 1 "IN-S126AT5UW" V 3956 3582 39  0000 R CNN
F 2 "LED_SMD:LED_1206_3216Metric_Castellated" H 4000 3700 50  0001 C CNN
F 3 "http://inolux-corp.com/datasheet/SMDLED/Mono%20Color%20Top%20View/IN-S126AT%20Series_V1.0.pdf" H 4000 3700 50  0001 C CNN
	1    4000 3700
	0    -1   -1   0   
$EndComp
Wire Wire Line
	4000 3850 4000 4000
Wire Wire Line
	4000 3400 4000 3550
Wire Wire Line
	4000 3100 4000 3200
Wire Wire Line
	3700 4200 3500 4200
Wire Wire Line
	3500 4200 3500 4300
Wire Wire Line
	4000 4400 4000 4500
Wire Wire Line
	3400 4200 3500 4200
Connection ~ 3500 4200
$Comp
L power:GND #PWR026
U 1 1 5F391CA9
P 6000 4500
F 0 "#PWR026" H 6000 4250 50  0001 C CNN
F 1 "GND" H 6005 4327 39  0000 C CNN
F 2 "" H 6000 4500 50  0001 C CNN
F 3 "" H 6000 4500 50  0001 C CNN
	1    6000 4500
	1    0    0    -1  
$EndComp
$Comp
L Device:R_Small R8
U 1 1 5F391CAF
P 6000 3300
F 0 "R8" H 6059 3346 39  0000 L CNN
F 1 "80" H 6059 3255 39  0000 L CNN
F 2 "Resistor_SMD:R_0603_1608Metric" H 6000 3300 50  0001 C CNN
F 3 "~" H 6000 3300 50  0001 C CNN
	1    6000 3300
	1    0    0    -1  
$EndComp
$Comp
L Device:R_Small R7
U 1 1 5F391CBB
P 5500 4400
F 0 "R7" H 5559 4438 39  0000 L CNN
F 1 "10k" H 5559 4363 39  0000 L CNN
F 2 "Resistor_SMD:R_0603_1608Metric" H 5500 4400 50  0001 C CNN
F 3 "~" H 5500 4400 50  0001 C CNN
	1    5500 4400
	1    0    0    -1  
$EndComp
$Comp
L power:GND #PWR024
U 1 1 5F391CC1
P 5500 4500
F 0 "#PWR024" H 5500 4250 50  0001 C CNN
F 1 "GND" H 5505 4327 39  0000 C CNN
F 2 "" H 5500 4500 50  0001 C CNN
F 3 "" H 5500 4500 50  0001 C CNN
	1    5500 4500
	1    0    0    -1  
$EndComp
$Comp
L power:+5V #PWR025
U 1 1 5F391CC7
P 6000 3100
F 0 "#PWR025" H 6000 2950 50  0001 C CNN
F 1 "+5V" H 6015 3273 50  0000 C CNN
F 2 "" H 6000 3100 50  0001 C CNN
F 3 "" H 6000 3100 50  0001 C CNN
	1    6000 3100
	1    0    0    -1  
$EndComp
$Comp
L Device:LED D4
U 1 1 5F391CCD
P 6000 3700
F 0 "D4" V 6031 3582 39  0000 R CNN
F 1 "IN-S126AT5UW" V 5956 3582 39  0000 R CNN
F 2 "LED_SMD:LED_1206_3216Metric_Castellated" H 6000 3700 50  0001 C CNN
F 3 "http://inolux-corp.com/datasheet/SMDLED/Mono%20Color%20Top%20View/IN-S126AT%20Series_V1.0.pdf" H 6000 3700 50  0001 C CNN
	1    6000 3700
	0    -1   -1   0   
$EndComp
Wire Wire Line
	6000 3850 6000 4000
Wire Wire Line
	6000 3400 6000 3550
Wire Wire Line
	6000 3100 6000 3200
Wire Wire Line
	5700 4200 5500 4200
Wire Wire Line
	5500 4200 5500 4300
Wire Wire Line
	6000 4400 6000 4500
Wire Wire Line
	5400 4200 5500 4200
Connection ~ 5500 4200
$Comp
L power:GND #PWR029
U 1 1 5F395D3F
P 8000 4500
F 0 "#PWR029" H 8000 4250 50  0001 C CNN
F 1 "GND" H 8005 4327 39  0000 C CNN
F 2 "" H 8000 4500 50  0001 C CNN
F 3 "" H 8000 4500 50  0001 C CNN
	1    8000 4500
	1    0    0    -1  
$EndComp
$Comp
L Device:R_Small R10
U 1 1 5F395D45
P 8000 3300
F 0 "R10" H 8059 3346 39  0000 L CNN
F 1 "80" H 8059 3255 39  0000 L CNN
F 2 "Resistor_SMD:R_0603_1608Metric" H 8000 3300 50  0001 C CNN
F 3 "~" H 8000 3300 50  0001 C CNN
	1    8000 3300
	1    0    0    -1  
$EndComp
$Comp
L Device:R_Small R9
U 1 1 5F395D51
P 7500 4400
F 0 "R9" H 7559 4438 39  0000 L CNN
F 1 "10k" H 7559 4363 39  0000 L CNN
F 2 "Resistor_SMD:R_0603_1608Metric" H 7500 4400 50  0001 C CNN
F 3 "~" H 7500 4400 50  0001 C CNN
	1    7500 4400
	1    0    0    -1  
$EndComp
$Comp
L power:GND #PWR027
U 1 1 5F395D57
P 7500 4500
F 0 "#PWR027" H 7500 4250 50  0001 C CNN
F 1 "GND" H 7505 4327 39  0000 C CNN
F 2 "" H 7500 4500 50  0001 C CNN
F 3 "" H 7500 4500 50  0001 C CNN
	1    7500 4500
	1    0    0    -1  
$EndComp
$Comp
L power:+5V #PWR028
U 1 1 5F395D5D
P 8000 3100
F 0 "#PWR028" H 8000 2950 50  0001 C CNN
F 1 "+5V" H 8015 3273 50  0000 C CNN
F 2 "" H 8000 3100 50  0001 C CNN
F 3 "" H 8000 3100 50  0001 C CNN
	1    8000 3100
	1    0    0    -1  
$EndComp
$Comp
L Device:LED D5
U 1 1 5F395D63
P 8000 3700
F 0 "D5" V 8031 3582 39  0000 R CNN
F 1 "IN-S126AT5UW" V 7956 3582 39  0000 R CNN
F 2 "LED_SMD:LED_1206_3216Metric_Castellated" H 8000 3700 50  0001 C CNN
F 3 "http://inolux-corp.com/datasheet/SMDLED/Mono%20Color%20Top%20View/IN-S126AT%20Series_V1.0.pdf" H 8000 3700 50  0001 C CNN
	1    8000 3700
	0    -1   -1   0   
$EndComp
Wire Wire Line
	8000 3850 8000 4000
Wire Wire Line
	8000 3400 8000 3550
Wire Wire Line
	8000 3100 8000 3200
Wire Wire Line
	7700 4200 7500 4200
Wire Wire Line
	7500 4200 7500 4300
Wire Wire Line
	8000 4400 8000 4500
Wire Wire Line
	7400 4200 7500 4200
Connection ~ 7500 4200
$Comp
L power:GND #PWR032
U 1 1 5F3B98D4
P 10000 4500
F 0 "#PWR032" H 10000 4250 50  0001 C CNN
F 1 "GND" H 10005 4327 39  0000 C CNN
F 2 "" H 10000 4500 50  0001 C CNN
F 3 "" H 10000 4500 50  0001 C CNN
	1    10000 4500
	1    0    0    -1  
$EndComp
$Comp
L Device:R_Small R12
U 1 1 5F3B98DA
P 10000 3300
F 0 "R12" H 10059 3346 39  0000 L CNN
F 1 "80" H 10059 3255 39  0000 L CNN
F 2 "Resistor_SMD:R_0603_1608Metric" H 10000 3300 50  0001 C CNN
F 3 "~" H 10000 3300 50  0001 C CNN
	1    10000 3300
	1    0    0    -1  
$EndComp
$Comp
L Device:R_Small R11
U 1 1 5F3B98E6
P 9500 4400
F 0 "R11" H 9559 4438 39  0000 L CNN
F 1 "10k" H 9559 4363 39  0000 L CNN
F 2 "Resistor_SMD:R_0603_1608Metric" H 9500 4400 50  0001 C CNN
F 3 "~" H 9500 4400 50  0001 C CNN
	1    9500 4400
	1    0    0    -1  
$EndComp
$Comp
L power:GND #PWR030
U 1 1 5F3B98EC
P 9500 4500
F 0 "#PWR030" H 9500 4250 50  0001 C CNN
F 1 "GND" H 9505 4327 39  0000 C CNN
F 2 "" H 9500 4500 50  0001 C CNN
F 3 "" H 9500 4500 50  0001 C CNN
	1    9500 4500
	1    0    0    -1  
$EndComp
$Comp
L power:+5V #PWR031
U 1 1 5F3B98F2
P 10000 3100
F 0 "#PWR031" H 10000 2950 50  0001 C CNN
F 1 "+5V" H 10015 3273 50  0000 C CNN
F 2 "" H 10000 3100 50  0001 C CNN
F 3 "" H 10000 3100 50  0001 C CNN
	1    10000 3100
	1    0    0    -1  
$EndComp
$Comp
L Device:LED D6
U 1 1 5F3B98F8
P 10000 3700
F 0 "D6" V 10031 3582 39  0000 R CNN
F 1 "IN-S126AT5UW" V 9956 3582 39  0000 R CNN
F 2 "LED_SMD:LED_1206_3216Metric_Castellated" H 10000 3700 50  0001 C CNN
F 3 "http://inolux-corp.com/datasheet/SMDLED/Mono%20Color%20Top%20View/IN-S126AT%20Series_V1.0.pdf" H 10000 3700 50  0001 C CNN
	1    10000 3700
	0    -1   -1   0   
$EndComp
Wire Wire Line
	10000 3850 10000 4000
Wire Wire Line
	10000 3400 10000 3550
Wire Wire Line
	10000 3100 10000 3200
Wire Wire Line
	9700 4200 9500 4200
Wire Wire Line
	9500 4200 9500 4300
Wire Wire Line
	10000 4400 10000 4500
Wire Wire Line
	9400 4200 9500 4200
Connection ~ 9500 4200
$Comp
L Device:Q_NMOS_GSD Q2
U 1 1 5F940793
P 3900 4200
F 0 "Q2" H 4105 4246 50  0000 L CNN
F 1 "Si2302CDS" H 4105 4155 50  0000 L CNN
F 2 "Package_TO_SOT_SMD:SOT-23" H 4100 4300 50  0001 C CNN
F 3 "https://eu.mouser.com/datasheet/2/427/si2302cds-1764899.pdf" H 3900 4200 50  0001 C CNN
	1    3900 4200
	1    0    0    -1  
$EndComp
$Comp
L Device:Q_NMOS_GSD Q3
U 1 1 5F9413BA
P 5900 4200
F 0 "Q3" H 6105 4246 50  0000 L CNN
F 1 "Si2302CDS" H 6105 4155 50  0000 L CNN
F 2 "Package_TO_SOT_SMD:SOT-23" H 6100 4300 50  0001 C CNN
F 3 "https://eu.mouser.com/datasheet/2/427/si2302cds-1764899.pdf" H 5900 4200 50  0001 C CNN
	1    5900 4200
	1    0    0    -1  
$EndComp
$Comp
L Device:Q_NMOS_GSD Q4
U 1 1 5F942408
P 7900 4200
F 0 "Q4" H 8105 4246 50  0000 L CNN
F 1 "Si2302CDS" H 8105 4155 50  0000 L CNN
F 2 "Package_TO_SOT_SMD:SOT-23" H 8100 4300 50  0001 C CNN
F 3 "https://eu.mouser.com/datasheet/2/427/si2302cds-1764899.pdf" H 7900 4200 50  0001 C CNN
	1    7900 4200
	1    0    0    -1  
$EndComp
$Comp
L Device:Q_NMOS_GSD Q5
U 1 1 5F9430B8
P 9900 4200
F 0 "Q5" H 10105 4246 50  0000 L CNN
F 1 "Si2302CDS" H 10105 4155 50  0000 L CNN
F 2 "Package_TO_SOT_SMD:SOT-23" H 10100 4300 50  0001 C CNN
F 3 "https://eu.mouser.com/datasheet/2/427/si2302cds-1764899.pdf" H 9900 4200 50  0001 C CNN
	1    9900 4200
	1    0    0    -1  
$EndComp
$EndSCHEMATC
