EESchema Schematic File Version 4
EELAYER 30 0
EELAYER END
$Descr A4 11693 8268
encoding utf-8
Sheet 1 8
Title "Skyscraper"
Date "2020-10-02"
Rev "1.1"
Comp "Institute for Automation of Complex Power Systems - E.ON ERC - RWTH Aachen University"
Comment1 "Designer: D.Wienands, S.Melcher, L.Jeske, D.Moll"
Comment2 "Supervisor: C. Guarnieri Calò Carducci"
Comment3 ""
Comment4 ""
$EndDescr
$Comp
L power:GND #PWR?
U 1 1 5F05C072
P 3300 5450
AR Path="/5F0506E3/5F05C072" Ref="#PWR?"  Part="1" 
AR Path="/5F05C072" Ref="#PWR09"  Part="1" 
F 0 "#PWR09" H 3300 5200 50  0001 C CNN
F 1 "GND" H 3305 5277 50  0000 C CNN
F 2 "" H 3300 5450 50  0001 C CNN
F 3 "" H 3300 5450 50  0001 C CNN
	1    3300 5450
	1    0    0    -1  
$EndComp
$Comp
L Device:CP_Small C?
U 1 1 5F05C078
P 3300 2450
AR Path="/5F0506E3/5F05C078" Ref="C?"  Part="1" 
AR Path="/5F05C078" Ref="C3"  Part="1" 
F 0 "C3" H 3450 2400 39  0000 R CNN
F 1 "10u" H 3450 2500 39  0000 R CNN
F 2 "Capacitor_SMD:C_0603_1608Metric" H 3300 2450 50  0001 C CNN
F 3 "~" H 3300 2450 50  0001 C CNN
	1    3300 2450
	-1   0    0    1   
$EndComp
$Comp
L Device:C_Small C?
U 1 1 5F05C07E
P 3050 2450
AR Path="/5F0506E3/5F05C07E" Ref="C?"  Part="1" 
AR Path="/5F05C07E" Ref="C2"  Part="1" 
F 0 "C2" H 3000 2400 39  0000 R CNN
F 1 "100n" H 3050 2500 39  0000 R CNN
F 2 "Capacitor_SMD:C_0603_1608Metric" H 3050 2450 50  0001 C CNN
F 3 "~" H 3050 2450 50  0001 C CNN
	1    3050 2450
	1    0    0    1   
$EndComp
Wire Wire Line
	3300 2550 3300 2650
Wire Wire Line
	3050 2550 3050 2650
$Comp
L power:GND #PWR?
U 1 1 5F05C086
P 3050 2350
AR Path="/5F0506E3/5F05C086" Ref="#PWR?"  Part="1" 
AR Path="/5F05C086" Ref="#PWR07"  Part="1" 
F 0 "#PWR07" H 3050 2100 50  0001 C CNN
F 1 "GND" H 3055 2177 39  0000 C CNN
F 2 "" H 3050 2350 50  0001 C CNN
F 3 "" H 3050 2350 50  0001 C CNN
	1    3050 2350
	-1   0    0    1   
$EndComp
$Comp
L power:GND #PWR?
U 1 1 5F05C08C
P 3300 2350
AR Path="/5F0506E3/5F05C08C" Ref="#PWR?"  Part="1" 
AR Path="/5F05C08C" Ref="#PWR08"  Part="1" 
F 0 "#PWR08" H 3300 2100 50  0001 C CNN
F 1 "GND" H 3305 2177 39  0000 C CNN
F 2 "" H 3300 2350 50  0001 C CNN
F 3 "" H 3300 2350 50  0001 C CNN
	1    3300 2350
	-1   0    0    1   
$EndComp
$Comp
L power:GND #PWR?
U 1 1 5F05C092
P 2250 3250
AR Path="/5F0506E3/5F05C092" Ref="#PWR?"  Part="1" 
AR Path="/5F05C092" Ref="#PWR05"  Part="1" 
F 0 "#PWR05" H 2250 3000 50  0001 C CNN
F 1 "GND" H 2255 3077 39  0000 C CNN
F 2 "" H 2250 3250 50  0001 C CNN
F 3 "" H 2250 3250 50  0001 C CNN
	1    2250 3250
	1    0    0    -1  
$EndComp
$Comp
L Device:C_Small C?
U 1 1 5F05C099
P 2250 3050
AR Path="/5F0506E3/5F05C099" Ref="C?"  Part="1" 
AR Path="/5F05C099" Ref="C1"  Part="1" 
F 0 "C1" H 2200 3000 39  0000 R CNN
F 1 "10u" H 2200 3100 39  0000 R CNN
F 2 "Capacitor_SMD:C_0603_1608Metric" H 2250 3050 50  0001 C CNN
F 3 "~" H 2250 3050 50  0001 C CNN
	1    2250 3050
	1    0    0    1   
$EndComp
$Comp
L Device:R_Small R?
U 1 1 5F05C09F
P 2250 2650
AR Path="/5F0506E3/5F05C09F" Ref="R?"  Part="1" 
AR Path="/5F05C09F" Ref="R1"  Part="1" 
F 0 "R1" H 2300 2600 39  0000 L CNN
F 1 "10k" H 2300 2650 39  0000 L CNN
F 2 "Resistor_SMD:R_0603_1608Metric" H 2250 2650 50  0001 C CNN
F 3 "~" H 2250 2650 50  0001 C CNN
	1    2250 2650
	-1   0    0    1   
$EndComp
Text Notes 4250 2850 0    28   ~ 0
UP during boot
Text Notes 4250 3450 0    28   ~ 0
DOWN during boot
Wire Wire Line
	3900 2950 4000 2950
Wire Wire Line
	3900 3150 4000 3150
Text Notes 4250 3050 0    28   ~ 0
DOWN during prog
Text Notes 4250 3750 0    28   ~ 0
UP during boot for log
Text Notes 2650 4600 1    28   ~ 0
Internally connected to the flash
Text Notes 4250 3350 0    28   ~ 0
UP during boot
Wire Wire Line
	3900 2850 4000 2850
Text Notes 3900 2850 0    39   ~ 0
IO0
Text Notes 2650 3050 2    28   ~ 0
only input
Text Notes 2650 3150 2    28   ~ 0
only input
Text Label 4000 3150 0    39   ~ 0
RXD
Text Label 4000 2950 0    39   ~ 0
TXD
Text Label 2150 2850 2    39   ~ 0
EN
Text Label 4000 2850 0    39   ~ 0
ID
$Comp
L RF_Module:ESP32-WROOM-32D U?
U 1 1 5F05C0C3
P 3300 4050
AR Path="/5F0506E3/5F05C0C3" Ref="U?"  Part="1" 
AR Path="/5F05C0C3" Ref="U2"  Part="1" 
F 0 "U2" H 2750 4550 50  0000 C CNN
F 1 "ESP32-WROOM-32D" H 2400 4450 50  0000 C CNN
F 2 "RF_Module:ESP32-WROOM-32" H 3300 2550 50  0001 C CNN
F 3 "https://www.espressif.com/sites/default/files/documentation/esp32-wroom-32d_esp32-wroom-32u_datasheet_en.pdf" H 3000 4100 50  0001 C CNN
	1    3300 4050
	1    0    0    -1  
$EndComp
Wire Wire Line
	3300 2650 3050 2650
Connection ~ 3300 2650
NoConn ~ 2700 3150
NoConn ~ 2700 3050
NoConn ~ 2700 4050
NoConn ~ 2700 4150
NoConn ~ 2700 4250
NoConn ~ 2700 4350
NoConn ~ 2700 4450
NoConn ~ 2700 4550
Text Notes 3900 4550 0    28   ~ 0
DAC
Text Notes 3900 4650 0    28   ~ 0
DAC
Text GLabel 4000 4050 2    39   Input ~ 0
SCL
Text GLabel 4000 3350 2    39   Input ~ 0
SDA
$Comp
L LEGOS:VBUS #PWR010
U 1 1 5F10BB36
P 5875 4025
F 0 "#PWR010" H 5875 3875 50  0001 C CNN
F 1 "VBUS" H 5890 4198 39  0000 C CNN
F 2 "" H 5875 4025 50  0001 C CNN
F 3 "" H 5875 4025 50  0001 C CNN
	1    5875 4025
	1    0    0    -1  
$EndComp
$Comp
L power:+3.3V #PWR011
U 1 1 5F10C408
P 5875 4225
F 0 "#PWR011" H 5875 4075 50  0001 C CNN
F 1 "+3.3V" H 5890 4398 39  0000 C CNN
F 2 "" H 5875 4225 50  0001 C CNN
F 3 "" H 5875 4225 50  0001 C CNN
	1    5875 4225
	-1   0    0    1   
$EndComp
Text Label 5875 3150 2    39   ~ 0
EN
Text Label 5875 3250 2    39   ~ 0
TXD
Text Label 5875 3350 2    39   ~ 0
RXD
Text Label 5875 3450 2    39   ~ 0
ID
$Comp
L power:+3.3V #PWR06
U 1 1 5F112B69
P 2850 2350
F 0 "#PWR06" H 2850 2200 50  0001 C CNN
F 1 "+3.3V" H 2865 2523 39  0000 C CNN
F 2 "" H 2850 2350 50  0001 C CNN
F 3 "" H 2850 2350 50  0001 C CNN
	1    2850 2350
	1    0    0    -1  
$EndComp
$Comp
L power:+3.3V #PWR04
U 1 1 5F1130B3
P 2250 2450
F 0 "#PWR04" H 2250 2300 50  0001 C CNN
F 1 "+3.3V" H 2265 2623 39  0000 C CNN
F 2 "" H 2250 2450 50  0001 C CNN
F 3 "" H 2250 2450 50  0001 C CNN
	1    2250 2450
	1    0    0    -1  
$EndComp
Text Notes 3950 5050 0    28   ~ 0
only input
Text Notes 3950 5150 0    28   ~ 0
only input
Wire Wire Line
	5975 3450 5925 3450
Wire Wire Line
	5975 3350 5875 3350
Wire Wire Line
	5975 3250 5875 3250
Wire Wire Line
	5975 3150 5875 3150
Wire Wire Line
	5975 3550 5925 3550
Wire Wire Line
	5925 3550 5925 3450
Connection ~ 5925 3450
Wire Wire Line
	5925 3450 5875 3450
Wire Wire Line
	5975 4225 5875 4225
Wire Wire Line
	5975 4025 5875 4025
Wire Wire Line
	5975 4125 5875 4125
Wire Wire Line
	5875 4125 5875 4025
Connection ~ 5875 4025
Wire Wire Line
	2850 2350 2850 2650
Wire Wire Line
	2850 2650 3050 2650
Connection ~ 3050 2650
Wire Wire Line
	3900 4550 4000 4550
Wire Wire Line
	3900 4750 4000 4750
Wire Wire Line
	3900 4150 4000 4150
Wire Wire Line
	3900 4050 4000 4050
Wire Wire Line
	3900 3350 4000 3350
Wire Wire Line
	2250 2450 2250 2550
Wire Wire Line
	2250 2750 2250 2850
Connection ~ 2250 2850
Wire Wire Line
	2250 2850 2250 2950
Wire Wire Line
	2700 2850 2250 2850
$Sheet
S 5975 2550 550  200 
U 5F587068
F0 "Mechanical" 39
F1 "sub_mechanical.sch" 39
$EndSheet
$Sheet
S 5975 3050 550  600 
U 5F108703
F0 "Connectors" 39
F1 "sub_connectors.sch" 39
F2 "EN" O L 5975 3150 39 
F3 "TXD" O L 5975 3250 39 
F4 "RXD" I L 5975 3350 39 
F5 "IO0" B L 5975 3450 39 
F6 "ID" B L 5975 3550 39 
$EndSheet
$Sheet
S 5975 3925 550  400 
U 5F109AEC
F0 "Telemetry" 39
F1 "sub_telemetry.sch" 39
F2 "VCOM" I L 5975 4025 39 
F3 "V+" I L 5975 4125 39 
F4 "V-" I L 5975 4225 39 
F5 "~IRQ" O R 6525 4025 39 
F6 "A1" I R 6525 4125 39 
F7 "A0" I R 6525 4225 39 
$EndSheet
$Comp
L power:GND #PWR?
U 1 1 5F5894D7
P 6625 4225
AR Path="/5F0506E3/5F5894D7" Ref="#PWR?"  Part="1" 
AR Path="/5F5894D7" Ref="#PWR012"  Part="1" 
F 0 "#PWR012" H 6625 3975 50  0001 C CNN
F 1 "GND" V 6625 4025 39  0000 C CNN
F 2 "" H 6625 4225 50  0001 C CNN
F 3 "" H 6625 4225 50  0001 C CNN
	1    6625 4225
	0    -1   -1   0   
$EndComp
Wire Wire Line
	6625 4225 6525 4225
Wire Wire Line
	6525 4125 6625 4125
Wire Wire Line
	6625 4125 6625 4225
Connection ~ 6625 4225
Wire Wire Line
	6625 4025 6525 4025
Text Label 6625 4025 0    39   ~ 0
~IRQ
$Comp
L Switch:SW_Push SW1
U 1 1 5F593DA0
P 1850 3050
F 0 "SW1" V 1800 2850 39  0000 L CNN
F 1 "PTS815" V 1850 2750 39  0000 L CNN
F 2 "LEGOS:PTS815" H 1850 3250 50  0001 C CNN
F 3 "~" H 1850 3250 50  0001 C CNN
	1    1850 3050
	0    1    1    0   
$EndComp
$Comp
L power:GND #PWR?
U 1 1 5F595EAD
P 1850 3250
AR Path="/5F0506E3/5F595EAD" Ref="#PWR?"  Part="1" 
AR Path="/5F595EAD" Ref="#PWR03"  Part="1" 
F 0 "#PWR03" H 1850 3000 50  0001 C CNN
F 1 "GND" H 1855 3077 39  0000 C CNN
F 2 "" H 1850 3250 50  0001 C CNN
F 3 "" H 1850 3250 50  0001 C CNN
	1    1850 3250
	1    0    0    -1  
$EndComp
Wire Wire Line
	2250 3150 2250 3250
Wire Wire Line
	1850 2850 2250 2850
$Comp
L Power_Supervisor:LM809 U1
U 1 1 5F597D24
P 1100 2850
F 0 "U1" H 870 2896 39  0000 R CNN
F 1 "TLV803E" H 870 2813 50  0000 R CNN
F 2 "Package_TO_SOT_SMD:SOT-23" H 1400 2950 50  0001 C CNN
F 3 "https://www.ti.com/lit/ds/symlink/tlv803e.pdf" H 1400 2950 50  0001 C CNN
	1    1100 2850
	1    0    0    -1  
$EndComp
Wire Wire Line
	1850 2850 1400 2850
Connection ~ 1850 2850
$Comp
L power:GND #PWR?
U 1 1 5F5990EB
P 1100 3250
AR Path="/5F0506E3/5F5990EB" Ref="#PWR?"  Part="1" 
AR Path="/5F5990EB" Ref="#PWR02"  Part="1" 
F 0 "#PWR02" H 1100 3000 50  0001 C CNN
F 1 "GND" H 1105 3077 39  0000 C CNN
F 2 "" H 1100 3250 50  0001 C CNN
F 3 "" H 1100 3250 50  0001 C CNN
	1    1100 3250
	1    0    0    -1  
$EndComp
$Comp
L power:+3.3V #PWR01
U 1 1 5F5993CC
P 1100 2450
F 0 "#PWR01" H 1100 2300 50  0001 C CNN
F 1 "+3.3V" H 1115 2623 39  0000 C CNN
F 2 "" H 1100 2450 50  0001 C CNN
F 3 "" H 1100 2450 50  0001 C CNN
	1    1100 2450
	1    0    0    -1  
$EndComp
Wire Wire Line
	5975 4700 5875 4700
Wire Wire Line
	5975 4800 5875 4800
Wire Wire Line
	5975 5000 5875 5000
Text Label 5875 4700 2    39   ~ 0
FLAP
Text Label 5875 4800 2    39   ~ 0
FLOW
Text Label 5875 5000 2    39   ~ 0
EVENT
Text Label 8325 3500 0    39   ~ 0
LAMP_INT
$Comp
L power:+3.3V #PWR015
U 1 1 5F88AE7C
P 9000 1750
F 0 "#PWR015" H 9000 1600 50  0001 C CNN
F 1 "+3.3V" V 9000 1975 39  0000 C CNN
F 2 "" H 9000 1750 50  0001 C CNN
F 3 "" H 9000 1750 50  0001 C CNN
	1    9000 1750
	0    -1   -1   0   
$EndComp
Text Label 9000 2350 2    39   ~ 0
TV_BL
$Comp
L power:+3.3V #PWR017
U 1 1 5F891661
P 9000 2450
F 0 "#PWR017" H 9000 2300 50  0001 C CNN
F 1 "+3.3V" V 9000 2675 39  0000 C CNN
F 2 "" H 9000 2450 50  0001 C CNN
F 3 "" H 9000 2450 50  0001 C CNN
	1    9000 2450
	0    -1   -1   0   
$EndComp
$Comp
L power:GND #PWR?
U 1 1 5F892197
P 7900 2250
AR Path="/5F0506E3/5F892197" Ref="#PWR?"  Part="1" 
AR Path="/5F892197" Ref="#PWR018"  Part="1" 
F 0 "#PWR018" H 7900 2000 50  0001 C CNN
F 1 "GND" V 7900 2050 39  0000 C CNN
F 2 "" H 7900 2250 50  0001 C CNN
F 3 "" H 7900 2250 50  0001 C CNN
	1    7900 2250
	0    1    1    0   
$EndComp
$Sheet
S 7675 4075 550  600 
U 5F8F350D
F0 "SCADA" 39
F1 "sub_scada.sch" 39
F2 "FUEL" I L 7675 4175 39 
F3 "SOLAR" I L 7675 4275 39 
F4 "WIND" I L 7675 4375 39 
F5 "FAULT" I L 7675 4475 39 
F6 "LOAD" I L 7675 4575 39 
$EndSheet
Wire Wire Line
	10000 3275 10000 3325
$Comp
L power:+3.3V #PWR021
U 1 1 5F8CC441
P 10000 3000
AR Path="/5F8CC441" Ref="#PWR021"  Part="1" 
AR Path="/5F1D49F5/5F8CC441" Ref="#PWR?"  Part="1" 
AR Path="/5F202C6C/5F8CC441" Ref="#PWR?"  Part="1" 
AR Path="/5F1D940F/5F8CC441" Ref="#PWR?"  Part="1" 
AR Path="/5F89ACEF/5F8CC441" Ref="#PWR?"  Part="1" 
F 0 "#PWR021" H 10000 2850 50  0001 C CNN
F 1 "+3.3V" H 10015 3173 39  0000 C CNN
F 2 "" H 10000 3000 50  0001 C CNN
F 3 "" H 10000 3000 50  0001 C CNN
	1    10000 3000
	1    0    0    -1  
$EndComp
Wire Wire Line
	9600 3825 9500 3825
Wire Wire Line
	9600 3825 9700 3825
Connection ~ 9600 3825
Wire Wire Line
	9600 3825 9600 3925
$Comp
L Device:Q_NMOS_GSD Q?
U 1 1 5F8CC435
P 9900 3825
AR Path="/5F1D940F/5F8CC435" Ref="Q?"  Part="1" 
AR Path="/5F1D49F5/5F8CC435" Ref="Q?"  Part="1" 
AR Path="/5F8CC435" Ref="Q1"  Part="1" 
AR Path="/5F202C6C/5F8CC435" Ref="Q?"  Part="1" 
AR Path="/5F89ACEF/5F8CC435" Ref="Q?"  Part="1" 
F 0 "Q1" H 10105 3871 39  0000 L CNN
F 1 "Si2302CDS" H 10105 3780 39  0000 L CNN
F 2 "Package_TO_SOT_SMD:SOT-23" H 10100 3925 50  0001 C CNN
F 3 "https://eu.mouser.com/datasheet/2/427/si2302cds-1764899.pdf" H 9900 3825 50  0001 C CNN
	1    9900 3825
	1    0    0    -1  
$EndComp
$Comp
L Device:R_Small R2
U 1 1 5F8CC42F
P 9600 4025
AR Path="/5F8CC42F" Ref="R2"  Part="1" 
AR Path="/5F1D940F/5F8CC42F" Ref="R?"  Part="1" 
AR Path="/5F1D49F5/5F8CC42F" Ref="R?"  Part="1" 
AR Path="/5F202C6C/5F8CC42F" Ref="R?"  Part="1" 
AR Path="/5F89ACEF/5F8CC42F" Ref="R?"  Part="1" 
F 0 "R2" H 9650 3975 39  0000 L CNN
F 1 "10k" H 9650 4025 39  0000 L CNN
F 2 "Resistor_SMD:R_0603_1608Metric" H 9600 4025 50  0001 C CNN
F 3 "~" H 9600 4025 50  0001 C CNN
	1    9600 4025
	-1   0    0    1   
$EndComp
$Comp
L power:GND #PWR?
U 1 1 5F8CC429
P 10000 4175
AR Path="/5F1D940F/5F8CC429" Ref="#PWR?"  Part="1" 
AR Path="/5F1D49F5/5F8CC429" Ref="#PWR?"  Part="1" 
AR Path="/5F8CC429" Ref="#PWR022"  Part="1" 
AR Path="/5F202C6C/5F8CC429" Ref="#PWR?"  Part="1" 
AR Path="/5F89ACEF/5F8CC429" Ref="#PWR?"  Part="1" 
F 0 "#PWR022" H 10000 3925 50  0001 C CNN
F 1 "GND" H 10005 4002 50  0000 C CNN
F 2 "" H 10000 4175 50  0001 C CNN
F 3 "" H 10000 4175 50  0001 C CNN
	1    10000 4175
	1    0    0    -1  
$EndComp
$Comp
L power:GND #PWR?
U 1 1 5F8CC423
P 9600 4175
AR Path="/5F1D940F/5F8CC423" Ref="#PWR?"  Part="1" 
AR Path="/5F1D49F5/5F8CC423" Ref="#PWR?"  Part="1" 
AR Path="/5F8CC423" Ref="#PWR020"  Part="1" 
AR Path="/5F202C6C/5F8CC423" Ref="#PWR?"  Part="1" 
AR Path="/5F89ACEF/5F8CC423" Ref="#PWR?"  Part="1" 
F 0 "#PWR020" H 9600 3925 50  0001 C CNN
F 1 "GND" H 9605 4002 50  0000 C CNN
F 2 "" H 9600 4175 50  0001 C CNN
F 3 "" H 9600 4175 50  0001 C CNN
	1    9600 4175
	1    0    0    -1  
$EndComp
Wire Wire Line
	9600 4175 9600 4125
Wire Wire Line
	10000 4175 10000 4025
Text Label 9500 3825 2    39   ~ 0
TV
Wire Wire Line
	8325 3500 8225 3500
Text Label 7575 3500 2    39   ~ 0
LIGHT_INT
Wire Wire Line
	7575 3500 7675 3500
Text Label 9000 1950 2    39   ~ 0
LAMP_INT
Text Label 7900 1750 2    39   ~ 0
FUEL
Wire Wire Line
	7575 4175 7675 4175
Text Label 7900 1850 2    39   ~ 0
SOLAR
Wire Wire Line
	7575 4275 7675 4275
Text Label 7900 1950 2    39   ~ 0
WIND
Wire Wire Line
	7575 4375 7675 4375
Text Label 7900 2350 2    39   ~ 0
FAULT
Wire Wire Line
	7575 4475 7675 4475
Text Label 7900 2450 2    39   ~ 0
LOAD
Wire Wire Line
	7575 4575 7675 4575
Text Label 7575 3650 2    39   ~ 0
LIGHT_EXT
Wire Wire Line
	7575 3650 7675 3650
Text Label 8325 3650 0    39   ~ 0
LAMP_EXT
Wire Wire Line
	8325 3650 8225 3650
Text Label 9000 1850 2    39   ~ 0
LAMP_EXT
$Comp
L power:+3.3V #PWR019
U 1 1 5F9F603E
P 9925 1750
F 0 "#PWR019" H 9925 1600 50  0001 C CNN
F 1 "+3.3V" V 9925 1975 39  0000 C CNN
F 2 "" H 9925 1750 50  0001 C CNN
F 3 "" H 9925 1750 50  0001 C CNN
	1    9925 1750
	0    -1   -1   0   
$EndComp
$Comp
L Device:LED_Small D?
U 1 1 5FA04F2B
P 10000 3175
AR Path="/5F1D940F/5FA04F2B" Ref="D?"  Part="1" 
AR Path="/5F1D49F5/5FA04F2B" Ref="D?"  Part="1" 
AR Path="/5F202C6C/5FA04F2B" Ref="D?"  Part="1" 
AR Path="/5F7C0AF0/5FA04F2B" Ref="D?"  Part="1" 
AR Path="/5F89ACEF/5F7C0AF0/5FA04F2B" Ref="D?"  Part="1" 
AR Path="/5F8AB3A0/5FA04F2B" Ref="D?"  Part="1" 
AR Path="/5F8F350D/5FA04F2B" Ref="D?"  Part="1" 
AR Path="/5FA04F2B" Ref="D1"  Part="1" 
F 0 "D1" V 10050 3075 39  0000 R CNN
F 1 "SSL-LX2573SGD" V 10000 3075 31  0000 R CNN
F 2 "" V 10000 3175 50  0001 C CNN
F 3 "https://eu.mouser.com/datasheet/2/244/SSL-LX2573SGD-1778187.pdf" V 10000 3175 50  0001 C CNN
	1    10000 3175
	0    1    -1   0   
$EndComp
Wire Wire Line
	10000 3000 10000 3075
$Comp
L Device:R_Small R3
U 1 1 5FA08E69
P 10000 3475
AR Path="/5FA08E69" Ref="R3"  Part="1" 
AR Path="/5F1D940F/5FA08E69" Ref="R?"  Part="1" 
AR Path="/5F1D49F5/5FA08E69" Ref="R?"  Part="1" 
AR Path="/5F202C6C/5FA08E69" Ref="R?"  Part="1" 
AR Path="/5F89ACEF/5FA08E69" Ref="R?"  Part="1" 
AR Path="/5F8AB3A0/5FA08E69" Ref="R?"  Part="1" 
AR Path="/5F8F350D/5FA08E69" Ref="R?"  Part="1" 
F 0 "R3" H 10050 3425 39  0000 L CNN
F 1 "55" H 10050 3475 39  0000 L CNN
F 2 "Resistor_SMD:R_0603_1608Metric" H 10000 3475 50  0001 C CNN
F 3 "~" H 10000 3475 50  0001 C CNN
F 4 "RN55D5R00FB14" H 10000 3475 50  0001 C CNN "Mfr"
	1    10000 3475
	-1   0    0    1   
$EndComp
Text Label 9850 3325 2    39   ~ 0
TV_BL
Wire Wire Line
	10000 3325 9850 3325
Wire Wire Line
	10000 3575 10000 3625
Text Label 7575 4175 2    39   ~ 0
FUEL
Text Label 7575 4275 2    39   ~ 0
SOLAR
Text Label 7575 4375 2    39   ~ 0
WIND
Text Label 7575 4575 2    39   ~ 0
LOAD
Text Label 7575 4475 2    39   ~ 0
FAULT
$Sheet
S 7675 3375 550  400 
U 5F8AB3A0
F0 "Lights" 39
F1 "sub_lights.sch" 39
F2 "INT" I L 7675 3500 39 
F3 "LAMP_INT" I R 8225 3500 39 
F4 "EXT" I L 7675 3650 39 
F5 "LAMP_EXT" I R 8225 3650 39 
$EndSheet
$Sheet
S 5975 4600 550  500 
U 5F87D3D1
F0 "HVAC" 39
F1 "sub_hvac.sch" 39
F2 "SERVO" I L 5975 4700 39 
F3 "FAN" I L 5975 4800 39 
F4 "EVENT" I L 5975 5000 39 
F5 "HEAT" I L 5975 4900 39 
$EndSheet
Wire Wire Line
	5975 4900 5875 4900
Text Label 5875 4900 2    39   ~ 0
HEAT
Wire Wire Line
	7575 5150 7675 5150
Wire Wire Line
	7575 5250 7675 5250
Wire Wire Line
	7575 5350 7675 5350
Text Label 7575 5150 2    39   ~ 0
CYBER_ATTACK
Text Label 7575 5250 2    39   ~ 0
STATUS
Text Label 7575 5350 2    39   ~ 0
DATA_BREACH
$Sheet
S 7675 5050 550  400 
U 5F8B6860
F0 "Cyber Security" 39
F1 "sub_cyber.sch" 39
F2 "ATTACK" I L 7675 5150 39 
F3 "STATUS" I L 7675 5250 39 
F4 "DATA" I L 7675 5350 39 
F5 "CS_ATK" I R 8225 5150 39 
F6 "CS_STA" I R 8225 5250 39 
F7 "CS_DAT" I R 8225 5350 39 
$EndSheet
$Comp
L power:+3.3V #PWR013
U 1 1 5F8E8598
P 9000 2250
F 0 "#PWR013" H 9000 2100 50  0001 C CNN
F 1 "+3.3V" V 9000 2475 39  0000 C CNN
F 2 "" H 9000 2250 50  0001 C CNN
F 3 "" H 9000 2250 50  0001 C CNN
	1    9000 2250
	0    -1   -1   0   
$EndComp
$Comp
L Connector_Generic:Conn_01x03 J6
U 1 1 5F91F419
P 9200 1850
F 0 "J6" H 9280 1884 39  0000 L CNN
F 1 "Conn_01x03" H 9280 1809 39  0000 L CNN
F 2 "Connector_PinHeader_2.54mm:PinHeader_1x03_P2.54mm_Vertical" H 9200 1850 50  0001 C CNN
F 3 "~" H 9200 1850 50  0001 C CNN
	1    9200 1850
	1    0    0    -1  
$EndComp
Wire Wire Line
	8325 5150 8225 5150
Wire Wire Line
	8325 5250 8225 5250
Wire Wire Line
	8325 5350 8225 5350
Text Label 8325 5150 0    39   ~ 0
CS_ATK
Text Label 8325 5250 0    39   ~ 0
CS_STA
Text Label 8325 5350 0    39   ~ 0
CS_DAT
Text Label 9925 1850 2    39   ~ 0
CS_ATK
Text Label 9925 1950 2    39   ~ 0
CS_STA
Text Label 9925 2050 2    39   ~ 0
CS_DAT
$Comp
L Connector_Generic:Conn_01x04 J1
U 1 1 5F90E634
P 10125 1850
F 0 "J1" H 10205 1834 39  0000 L CNN
F 1 "Conn_01x04" H 10205 1759 39  0000 L CNN
F 2 "Connector_PinHeader_2.54mm:PinHeader_1x04_P2.54mm_Vertical" H 10125 1850 50  0001 C CNN
F 3 "~" H 10125 1850 50  0001 C CNN
	1    10125 1850
	1    0    0    -1  
$EndComp
Connection ~ 10000 3325
Wire Wire Line
	10000 3325 10000 3375
$Comp
L Connector_Generic:Conn_01x03 J5
U 1 1 5F932DC7
P 8100 1850
F 0 "J5" H 8180 1884 39  0000 L CNN
F 1 "Conn_01x03" H 8180 1809 39  0000 L CNN
F 2 "Connector_PinHeader_2.54mm:PinHeader_1x03_P2.54mm_Vertical" H 8100 1850 50  0001 C CNN
F 3 "~" H 8100 1850 50  0001 C CNN
	1    8100 1850
	1    0    0    -1  
$EndComp
$Comp
L Connector_Generic:Conn_01x03 J8
U 1 1 5F94D57B
P 9200 2350
F 0 "J8" H 9280 2384 39  0000 L CNN
F 1 "Conn_01x03" H 9280 2309 39  0000 L CNN
F 2 "Connector_PinHeader_2.54mm:PinHeader_1x03_P2.54mm_Vertical" H 9200 2350 50  0001 C CNN
F 3 "~" H 9200 2350 50  0001 C CNN
	1    9200 2350
	1    0    0    -1  
$EndComp
$Comp
L Connector_Generic:Conn_01x03 J7
U 1 1 5F952CE1
P 8100 2350
F 0 "J7" H 8180 2384 39  0000 L CNN
F 1 "Conn_01x03" H 8180 2309 39  0000 L CNN
F 2 "Connector_PinHeader_2.54mm:PinHeader_1x03_P2.54mm_Vertical" H 8100 2350 50  0001 C CNN
F 3 "~" H 8100 2350 50  0001 C CNN
	1    8100 2350
	1    0    0    -1  
$EndComp
Text Label 4000 3450 0    39   ~ 0
HEAT
Wire Wire Line
	4000 3450 3900 3450
Text Label 4000 3650 0    39   ~ 0
STATUS
Wire Wire Line
	4000 3650 3900 3650
Text Label 4000 4750 0    39   ~ 0
CYBER_ATTACK
Text Label 4000 4650 0    39   ~ 0
TV
Wire Wire Line
	4000 4650 3900 4650
Text Label 4000 4550 0    39   ~ 0
DATA_BREACH
Text Label 4000 4950 0    39   ~ 0
LIGHT_INT
Text Label 4000 4850 0    39   ~ 0
LIGHT_EXT
Wire Wire Line
	4000 4850 3900 4850
Wire Wire Line
	4000 4950 3900 4950
Text Label 4000 3750 0    39   ~ 0
FLAP
Wire Wire Line
	4000 3750 3900 3750
Text Label 4000 3050 0    39   ~ 0
FLOW
Wire Wire Line
	4000 3050 3900 3050
Text Label 4000 4150 0    39   ~ 0
FUEL
Text Label 4000 3950 0    39   ~ 0
SOLAR
Text Label 4000 4250 0    39   ~ 0
WIND
Text Label 4000 3850 0    39   ~ 0
LOAD
Text Label 4000 3250 0    39   ~ 0
FAULT
Wire Wire Line
	4000 3250 3900 3250
Wire Wire Line
	4000 3850 3900 3850
Wire Wire Line
	4000 3950 3900 3950
Wire Wire Line
	4000 4250 3900 4250
Wire Wire Line
	3900 4350 4000 4350
Text Label 4000 4350 0    39   ~ 0
EVENT
$EndSCHEMATC
