EESchema Schematic File Version 4
EELAYER 30 0
EELAYER END
$Descr A4 11693 8268
encoding utf-8
Sheet 5 7
Title "Virtual Load"
Date "2020-05-31"
Rev "1.0"
Comp "Institute for Automation of Complex Power Systems - E.ON ERC - RWTH Aachen University"
Comment1 "Designer: D. Wienands, S. Melcher, L. Jeske, D. Moll"
Comment2 "Supervisor: C. Guarnieri Calò Carducci"
Comment3 ""
Comment4 ""
$EndDescr
$Comp
L Device:Q_NMOS_GSD Q5
U 1 1 5ED4311C
P 6075 3825
F 0 "Q5" H 6279 3871 39  0000 L CNN
F 1 "Si2302CDS" H 6279 3780 39  0000 L CNN
F 2 "Package_TO_SOT_SMD:SOT-23" H 6275 3925 50  0001 C CNN
F 3 "https://eu.mouser.com/datasheet/2/427/si2302cds-1764899.pdf" H 6075 3825 50  0001 C CNN
	1    6075 3825
	1    0    0    -1  
$EndComp
$Comp
L power:+5V #PWR036
U 1 1 5ED43128
P 5275 3275
F 0 "#PWR036" H 5275 3125 50  0001 C CNN
F 1 "+5V" H 5290 3448 39  0000 C CNN
F 2 "" H 5275 3275 50  0001 C CNN
F 3 "" H 5275 3275 50  0001 C CNN
	1    5275 3275
	1    0    0    -1  
$EndComp
$Comp
L Device:R_Small R16
U 1 1 5ED43134
P 6175 4575
F 0 "R16" H 6234 4621 39  0000 L CNN
F 1 "30 - 1/2W" H 6234 4530 39  0001 L CNN
F 2 "Resistor_SMD:R_0805_2012Metric" H 6175 4575 50  0001 C CNN
F 3 "~" H 6175 4575 50  0001 C CNN
F 4 "ERJ-P06F30R0V" H 6175 4575 50  0001 C CNN "Mfr"
	1    6175 4575
	1    0    0    -1  
$EndComp
Wire Wire Line
	5075 3925 4975 3925
Wire Wire Line
	4975 3925 4975 4375
$Comp
L power:GND #PWR035
U 1 1 5ED43154
P 4625 4025
F 0 "#PWR035" H 4625 3775 50  0001 C CNN
F 1 "GND" H 4630 3852 39  0000 C CNN
F 2 "" H 4625 4025 50  0001 C CNN
F 3 "" H 4625 4025 50  0001 C CNN
	1    4625 4025
	1    0    0    -1  
$EndComp
Wire Wire Line
	4625 3725 5075 3725
Text Notes 6200 4200 0    50   ~ 0
MAX Current: 200mA
Text Notes 4725 3675 0    50   ~ 0
0-3.3 V
Text HLabel 3925 3725 0    39   Input ~ 0
IN
Wire Wire Line
	4975 4375 6175 4375
Wire Wire Line
	5875 3825 5775 3825
$Comp
L Device:R_Small R15
U 1 1 5ED66060
P 5775 4025
F 0 "R15" H 5834 4071 39  0000 L CNN
F 1 "10k" H 5834 3980 39  0000 L CNN
F 2 "Resistor_SMD:R_0603_1608Metric" H 5775 4025 39  0001 C CNN
F 3 "~" H 5775 4025 39  0001 C CNN
	1    5775 4025
	1    0    0    -1  
$EndComp
$Comp
L power:GND #PWR039
U 1 1 5ED66CAF
P 5775 4125
F 0 "#PWR039" H 5775 3875 39  0001 C CNN
F 1 "GND" H 5780 3952 39  0000 C CNN
F 2 "" H 5775 4125 39  0001 C CNN
F 3 "" H 5775 4125 39  0001 C CNN
	1    5775 4125
	1    0    0    -1  
$EndComp
Wire Wire Line
	5775 3925 5775 3825
Connection ~ 5775 3825
Wire Wire Line
	5775 3825 5675 3825
$Comp
L Device:R_Small R14
U 1 1 5ED8EE68
P 4375 3725
F 0 "R14" V 4575 3675 39  0000 L CNN
F 1 "4.7k" V 4475 3675 39  0000 L CNN
F 2 "Resistor_SMD:R_0603_1608Metric" H 4375 3725 39  0001 C CNN
F 3 "~" H 4375 3725 39  0001 C CNN
	1    4375 3725
	0    -1   -1   0   
$EndComp
Wire Wire Line
	4475 3725 4625 3725
Connection ~ 4625 3725
Wire Wire Line
	3925 3725 4125 3725
$Comp
L Device:C_Small C6
U 1 1 5ED904F3
P 4625 3925
F 0 "C6" H 4575 3875 39  0000 R CNN
F 1 "100n" H 4625 3975 39  0000 R CNN
F 2 "Capacitor_SMD:C_0603_1608Metric" H 4625 3925 39  0001 C CNN
F 3 "~" H 4625 3925 39  0001 C CNN
	1    4625 3925
	1    0    0    1   
$EndComp
Wire Wire Line
	4625 3825 4625 3725
Connection ~ 6175 4375
Wire Wire Line
	6175 4025 6175 4375
Wire Wire Line
	6175 4375 6175 4475
$Comp
L power:GND #PWR038
U 1 1 5EF4BC50
P 5475 3275
F 0 "#PWR038" H 5475 3025 39  0001 C CNN
F 1 "GND" H 5480 3102 39  0000 C CNN
F 2 "" H 5475 3275 39  0001 C CNN
F 3 "" H 5475 3275 39  0001 C CNN
	1    5475 3275
	-1   0    0    1   
$EndComp
$Comp
L Device:C_Small C7
U 1 1 5EF4A737
P 5475 3375
F 0 "C7" H 5425 3325 39  0000 R CNN
F 1 "100n" H 5475 3425 39  0000 R CNN
F 2 "Capacitor_SMD:C_0603_1608Metric" H 5475 3375 39  0001 C CNN
F 3 "~" H 5475 3375 39  0001 C CNN
	1    5475 3375
	-1   0    0    -1  
$EndComp
Wire Wire Line
	5275 3525 5275 3475
Wire Wire Line
	5275 3475 5475 3475
Connection ~ 5275 3475
Wire Wire Line
	5275 3475 5275 3275
Wire Wire Line
	6175 3275 6175 3625
$Comp
L Device:R_Small R13
U 1 1 5F06630D
P 4125 3925
F 0 "R13" H 4184 3971 39  0000 L CNN
F 1 "100k" H 4184 3880 39  0000 L CNN
F 2 "Resistor_SMD:R_0603_1608Metric" H 4125 3925 39  0001 C CNN
F 3 "~" H 4125 3925 39  0001 C CNN
	1    4125 3925
	1    0    0    -1  
$EndComp
$Comp
L power:GND #PWR034
U 1 1 5F066313
P 4125 4025
F 0 "#PWR034" H 4125 3775 39  0001 C CNN
F 1 "GND" H 4130 3852 39  0000 C CNN
F 2 "" H 4125 4025 39  0001 C CNN
F 3 "" H 4125 4025 39  0001 C CNN
	1    4125 4025
	1    0    0    -1  
$EndComp
Wire Wire Line
	4125 3825 4125 3725
Connection ~ 4125 3725
Wire Wire Line
	4125 3725 4275 3725
$Comp
L power:GND #PWR037
U 1 1 5F06152D
P 5275 4125
F 0 "#PWR037" H 5275 3875 50  0001 C CNN
F 1 "GND" H 5280 3952 39  0000 C CNN
F 2 "" H 5275 4125 50  0001 C CNN
F 3 "" H 5275 4125 50  0001 C CNN
	1    5275 4125
	1    0    0    -1  
$EndComp
$Comp
L power:GND #PWR041
U 1 1 5F062118
P 6175 4675
F 0 "#PWR041" H 6175 4425 39  0001 C CNN
F 1 "GND" H 6180 4502 39  0000 C CNN
F 2 "" H 6175 4675 39  0001 C CNN
F 3 "" H 6175 4675 39  0001 C CNN
	1    6175 4675
	1    0    0    -1  
$EndComp
$Comp
L Amplifier_Operational:AD8603 U2
U 1 1 5F309BDD
P 5375 3825
F 0 "U2" H 5375 4075 39  0000 L CNN
F 1 "TLV333IDBV" H 5375 3975 39  0000 L CNN
F 2 "Package_TO_SOT_SMD:SOT-23-5" H 5375 3825 50  0001 C CNN
F 3 "http://www.ti.com/lit/ds/symlink/tlv333.pdf" H 5375 4025 50  0001 C CNN
	1    5375 3825
	1    0    0    -1  
$EndComp
$Comp
L power:+3.3V #PWR?
U 1 1 5F33471E
P 6175 3275
AR Path="/5F33471E" Ref="#PWR?"  Part="1" 
AR Path="/5E872B89/5F33471E" Ref="#PWR?"  Part="1" 
AR Path="/5EE65594/5EE71F43/5F33471E" Ref="#PWR?"  Part="1" 
AR Path="/5EE65594/5F33471E" Ref="#PWR?"  Part="1" 
AR Path="/5F06E731/5F33471E" Ref="#PWR?"  Part="1" 
AR Path="/5F06EB4F/5F33471E" Ref="#PWR?"  Part="1" 
AR Path="/5F0706C1/5F33471E" Ref="#PWR?"  Part="1" 
AR Path="/5F070B09/5F33471E" Ref="#PWR?"  Part="1" 
AR Path="/5F070F02/5F33471E" Ref="#PWR?"  Part="1" 
AR Path="/5EE404E6/5F33471E" Ref="#PWR?"  Part="1" 
AR Path="/5ED37053/5F33471E" Ref="#PWR0101"  Part="1" 
AR Path="/5EF4D338/5F33471E" Ref="#PWR?"  Part="1" 
AR Path="/5ED6690B/5F33471E" Ref="#PWR?"  Part="1" 
AR Path="/5ED76C75/5F33471E" Ref="#PWR?"  Part="1" 
AR Path="/5EF58462/5F33471E" Ref="#PWR?"  Part="1" 
AR Path="/5EFD3723/5F33471E" Ref="#PWR?"  Part="1" 
AR Path="/5F128218/5F33471E" Ref="#PWR?"  Part="1" 
AR Path="/5ECB7EC7/5F128218/5F33471E" Ref="#PWR?"  Part="1" 
AR Path="/5F0E69AF/5F33471E" Ref="#PWR?"  Part="1" 
AR Path="/5F10E493/5F33471E" Ref="#PWR?"  Part="1" 
F 0 "#PWR0101" H 6175 3125 50  0001 C CNN
F 1 "+3.3V" H 6190 3448 39  0000 C CNN
F 2 "" H 6175 3275 50  0001 C CNN
F 3 "" H 6175 3275 50  0001 C CNN
	1    6175 3275
	-1   0    0    -1  
$EndComp
$Comp
L Device:R_Small R22
U 1 1 6176F4FC
P 6425 4575
F 0 "R22" H 6484 4621 39  0000 L CNN
F 1 "30 - 1/2W" H 6484 4530 39  0000 L CNN
F 2 "Resistor_SMD:R_0805_2012Metric" H 6425 4575 50  0001 C CNN
F 3 "~" H 6425 4575 50  0001 C CNN
F 4 "ERJ-P06F30R0V" H 6425 4575 50  0001 C CNN "Mfr"
	1    6425 4575
	1    0    0    -1  
$EndComp
Wire Wire Line
	6175 4375 6425 4375
Wire Wire Line
	6425 4375 6425 4475
$Comp
L power:GND #PWR0116
U 1 1 617705FB
P 6425 4675
F 0 "#PWR0116" H 6425 4425 39  0001 C CNN
F 1 "GND" H 6430 4502 39  0000 C CNN
F 2 "" H 6425 4675 39  0001 C CNN
F 3 "" H 6425 4675 39  0001 C CNN
	1    6425 4675
	1    0    0    -1  
$EndComp
$EndSCHEMATC
