EESchema Schematic File Version 4
EELAYER 30 0
EELAYER END
$Descr A4 11693 8268
encoding utf-8
Sheet 6 9
Title "Electrical Load"
Date "2020-08-26"
Rev "1.0"
Comp "Institute for Automation of Complex Power Systems - E.ON ERC - RWTH Aachen University"
Comment1 "Designer: D. Wienands, S. Melcher, L. Jeske, D. Moll"
Comment2 "Supervisor: C. Guarnieri Calò Carducci"
Comment3 ""
Comment4 ""
$EndDescr
Text HLabel 4500 2825 0    39   Input ~ 0
LOAD
$Comp
L Device:R_Small R14
U 1 1 5F5FADEC
P 4650 2975
AR Path="/5F2104BF/5F5FADEC" Ref="R14"  Part="1" 
AR Path="/5F5FADEC" Ref="R?"  Part="1" 
AR Path="/5F5F0002/5F5FADEC" Ref="R?"  Part="1" 
AR Path="/5F5772D0/5F5FADEC" Ref="R?"  Part="1" 
F 0 "R14" H 4709 3013 39  0000 L CNN
F 1 "10k" H 4709 2938 39  0000 L CNN
F 2 "Resistor_SMD:R_0603_1608Metric" H 4650 2975 50  0001 C CNN
F 3 "~" H 4650 2975 50  0001 C CNN
	1    4650 2975
	1    0    0    -1  
$EndComp
Wire Wire Line
	4650 2875 4650 2825
Wire Wire Line
	4650 2825 4700 2825
Wire Wire Line
	5000 3025 5000 3125
Wire Wire Line
	5000 3125 4650 3125
Wire Wire Line
	4650 3125 4650 3075
$Comp
L power:GND #PWR044
U 1 1 5F5FADF7
P 4650 3175
AR Path="/5F2104BF/5F5FADF7" Ref="#PWR044"  Part="1" 
AR Path="/5F5FADF7" Ref="#PWR?"  Part="1" 
AR Path="/5F5F0002/5F5FADF7" Ref="#PWR?"  Part="1" 
AR Path="/5F5772D0/5F5FADF7" Ref="#PWR?"  Part="1" 
F 0 "#PWR044" H 4650 2925 50  0001 C CNN
F 1 "GND" H 4655 3010 39  0000 C CNN
F 2 "" H 4650 3175 50  0001 C CNN
F 3 "" H 4650 3175 50  0001 C CNN
	1    4650 3175
	1    0    0    -1  
$EndComp
Wire Wire Line
	4650 3125 4650 3175
Connection ~ 4650 3125
Connection ~ 4650 2825
Wire Wire Line
	5000 1575 5000 1675
Wire Wire Line
	4500 2825 4650 2825
Wire Wire Line
	5000 2375 5000 2525
Wire Wire Line
	5000 2525 5350 2525
Wire Wire Line
	5350 2525 5350 2375
Connection ~ 5000 2525
Wire Wire Line
	5000 2525 5000 2625
$Comp
L Device:Q_NMOS_GSD Q4
U 1 1 5F4DF914
P 4900 2825
AR Path="/5F2104BF/5F4DF914" Ref="Q4"  Part="1" 
AR Path="/5F4DF914" Ref="Q?"  Part="1" 
AR Path="/5F5F0002/5F4DF914" Ref="Q?"  Part="1" 
AR Path="/5F496ED4/5F4DF914" Ref="Q?"  Part="1" 
AR Path="/5F5772D0/5F4DF914" Ref="Q?"  Part="1" 
F 0 "Q4" H 5105 2863 39  0000 L CNN
F 1 "Si2302CDS" H 5105 2788 39  0000 L CNN
F 2 "Package_TO_SOT_SMD:SOT-23" H 5100 2925 50  0001 C CNN
F 3 "https://eu.mouser.com/datasheet/2/427/si2302cds-1764899.pdf" H 4900 2825 50  0001 C CNN
	1    4900 2825
	1    0    0    -1  
$EndComp
$Comp
L power:+3.3V #PWR?
U 1 1 5F4E2664
P 5000 1575
AR Path="/5F4E2664" Ref="#PWR?"  Part="1" 
AR Path="/5F2104BF/5F4E2664" Ref="#PWR045"  Part="1" 
AR Path="/5F5772D0/5F4E2664" Ref="#PWR?"  Part="1" 
F 0 "#PWR045" H 5000 1425 50  0001 C CNN
F 1 "+3.3V" H 5015 1748 39  0000 C CNN
F 2 "" H 5000 1575 50  0001 C CNN
F 3 "" H 5000 1575 50  0001 C CNN
	1    5000 1575
	1    0    0    -1  
$EndComp
$Comp
L Device:LED D2
U 1 1 5F4E55D0
P 5000 2225
AR Path="/5F2104BF/5F4E55D0" Ref="D2"  Part="1" 
AR Path="/5F4E55D0" Ref="D?"  Part="1" 
AR Path="/5F5F0002/5F4E55D0" Ref="D?"  Part="1" 
AR Path="/5F496ED4/5F4E55D0" Ref="D?"  Part="1" 
AR Path="/5F5772D0/5F4E55D0" Ref="D?"  Part="1" 
F 0 "D2" V 5031 2107 39  0000 R CNN
F 1 "IN-S126ATA" V 4956 2107 39  0000 R CNN
F 2 "LED_SMD:LED_1206_3216Metric_Castellated" H 5000 2225 50  0001 C CNN
F 3 "http://inolux-corp.com/datasheet/SMDLED/Mono%20Color%20Top%20View/IN-S126AT%20Series_V1.0.pdf" H 5000 2225 50  0001 C CNN
	1    5000 2225
	0    1    -1   0   
$EndComp
Text Notes 4150 2500 0    39   ~ 0
Amber LED\nVf = 2.05 V @ If = 10 mA
$Comp
L Device:LED D5
U 1 1 5F4E6552
P 5350 2225
AR Path="/5F2104BF/5F4E6552" Ref="D5"  Part="1" 
AR Path="/5F4E6552" Ref="D?"  Part="1" 
AR Path="/5F5F0002/5F4E6552" Ref="D?"  Part="1" 
AR Path="/5F496ED4/5F4E6552" Ref="D?"  Part="1" 
AR Path="/5F5772D0/5F4E6552" Ref="D?"  Part="1" 
F 0 "D5" V 5381 2107 39  0000 R CNN
F 1 "IN-S126ATA" V 5306 2107 39  0001 R CNN
F 2 "LED_SMD:LED_1206_3216Metric_Castellated" H 5350 2225 50  0001 C CNN
F 3 "http://inolux-corp.com/datasheet/SMDLED/Mono%20Color%20Top%20View/IN-S126AT%20Series_V1.0.pdf" H 5350 2225 50  0001 C CNN
	1    5350 2225
	0    1    -1   0   
$EndComp
Wire Wire Line
	5350 2525 5700 2525
Wire Wire Line
	5700 2525 5700 2375
$Comp
L Device:LED D8
U 1 1 5F4E7F8B
P 5700 2225
AR Path="/5F2104BF/5F4E7F8B" Ref="D8"  Part="1" 
AR Path="/5F4E7F8B" Ref="D?"  Part="1" 
AR Path="/5F5F0002/5F4E7F8B" Ref="D?"  Part="1" 
AR Path="/5F496ED4/5F4E7F8B" Ref="D?"  Part="1" 
AR Path="/5F5772D0/5F4E7F8B" Ref="D?"  Part="1" 
F 0 "D8" V 5731 2107 39  0000 R CNN
F 1 "IN-S126ATA" V 5656 2107 39  0001 R CNN
F 2 "LED_SMD:LED_1206_3216Metric_Castellated" H 5700 2225 50  0001 C CNN
F 3 "http://inolux-corp.com/datasheet/SMDLED/Mono%20Color%20Top%20View/IN-S126AT%20Series_V1.0.pdf" H 5700 2225 50  0001 C CNN
	1    5700 2225
	0    1    -1   0   
$EndComp
Wire Wire Line
	5700 2525 6050 2525
Wire Wire Line
	6050 2525 6050 2375
$Comp
L Device:LED D11
U 1 1 5F4E83DD
P 6050 2225
AR Path="/5F2104BF/5F4E83DD" Ref="D11"  Part="1" 
AR Path="/5F4E83DD" Ref="D?"  Part="1" 
AR Path="/5F5F0002/5F4E83DD" Ref="D?"  Part="1" 
AR Path="/5F496ED4/5F4E83DD" Ref="D?"  Part="1" 
AR Path="/5F5772D0/5F4E83DD" Ref="D?"  Part="1" 
F 0 "D11" V 6081 2107 39  0000 R CNN
F 1 "IN-S126ATA" V 6006 2107 39  0001 R CNN
F 2 "LED_SMD:LED_1206_3216Metric_Castellated" H 6050 2225 50  0001 C CNN
F 3 "http://inolux-corp.com/datasheet/SMDLED/Mono%20Color%20Top%20View/IN-S126AT%20Series_V1.0.pdf" H 6050 2225 50  0001 C CNN
	1    6050 2225
	0    1    -1   0   
$EndComp
Wire Wire Line
	6050 2525 6400 2525
Wire Wire Line
	6400 2525 6400 2375
$Comp
L Device:LED D14
U 1 1 5F4E88FC
P 6400 2225
AR Path="/5F2104BF/5F4E88FC" Ref="D14"  Part="1" 
AR Path="/5F4E88FC" Ref="D?"  Part="1" 
AR Path="/5F5F0002/5F4E88FC" Ref="D?"  Part="1" 
AR Path="/5F496ED4/5F4E88FC" Ref="D?"  Part="1" 
AR Path="/5F5772D0/5F4E88FC" Ref="D?"  Part="1" 
F 0 "D14" V 6431 2107 39  0000 R CNN
F 1 "IN-S126ATA" V 6356 2107 39  0001 R CNN
F 2 "LED_SMD:LED_1206_3216Metric_Castellated" H 6400 2225 50  0001 C CNN
F 3 "http://inolux-corp.com/datasheet/SMDLED/Mono%20Color%20Top%20View/IN-S126AT%20Series_V1.0.pdf" H 6400 2225 50  0001 C CNN
	1    6400 2225
	0    1    -1   0   
$EndComp
Wire Wire Line
	6400 2525 6750 2525
Wire Wire Line
	6750 2525 6750 2375
$Comp
L Device:LED D15
U 1 1 5F4E8F66
P 6750 2225
AR Path="/5F2104BF/5F4E8F66" Ref="D15"  Part="1" 
AR Path="/5F4E8F66" Ref="D?"  Part="1" 
AR Path="/5F5F0002/5F4E8F66" Ref="D?"  Part="1" 
AR Path="/5F496ED4/5F4E8F66" Ref="D?"  Part="1" 
AR Path="/5F5772D0/5F4E8F66" Ref="D?"  Part="1" 
F 0 "D15" V 6781 2107 39  0000 R CNN
F 1 "IN-S126ATA" V 6706 2107 39  0001 R CNN
F 2 "LED_SMD:LED_1206_3216Metric_Castellated" H 6750 2225 50  0001 C CNN
F 3 "http://inolux-corp.com/datasheet/SMDLED/Mono%20Color%20Top%20View/IN-S126AT%20Series_V1.0.pdf" H 6750 2225 50  0001 C CNN
	1    6750 2225
	0    1    -1   0   
$EndComp
Wire Wire Line
	6750 2525 7100 2525
Wire Wire Line
	7100 2525 7100 2375
$Comp
L Device:LED D17
U 1 1 5F4ECDD8
P 7100 2225
AR Path="/5F2104BF/5F4ECDD8" Ref="D17"  Part="1" 
AR Path="/5F4ECDD8" Ref="D?"  Part="1" 
AR Path="/5F5F0002/5F4ECDD8" Ref="D?"  Part="1" 
AR Path="/5F496ED4/5F4ECDD8" Ref="D?"  Part="1" 
AR Path="/5F5772D0/5F4ECDD8" Ref="D?"  Part="1" 
F 0 "D17" V 7131 2107 39  0000 R CNN
F 1 "IN-S126ATA" V 7056 2107 39  0001 R CNN
F 2 "LED_SMD:LED_1206_3216Metric_Castellated" H 7100 2225 50  0001 C CNN
F 3 "http://inolux-corp.com/datasheet/SMDLED/Mono%20Color%20Top%20View/IN-S126AT%20Series_V1.0.pdf" H 7100 2225 50  0001 C CNN
	1    7100 2225
	0    1    -1   0   
$EndComp
Wire Wire Line
	7100 2525 7450 2525
Wire Wire Line
	7450 2525 7450 2375
$Comp
L Device:LED D19
U 1 1 5F4ECDE2
P 7450 2225
AR Path="/5F2104BF/5F4ECDE2" Ref="D19"  Part="1" 
AR Path="/5F4ECDE2" Ref="D?"  Part="1" 
AR Path="/5F5F0002/5F4ECDE2" Ref="D?"  Part="1" 
AR Path="/5F496ED4/5F4ECDE2" Ref="D?"  Part="1" 
AR Path="/5F5772D0/5F4ECDE2" Ref="D?"  Part="1" 
F 0 "D19" V 7481 2107 39  0000 R CNN
F 1 "IN-S126ATA" V 7406 2107 39  0001 R CNN
F 2 "LED_SMD:LED_1206_3216Metric_Castellated" H 7450 2225 50  0001 C CNN
F 3 "http://inolux-corp.com/datasheet/SMDLED/Mono%20Color%20Top%20View/IN-S126AT%20Series_V1.0.pdf" H 7450 2225 50  0001 C CNN
	1    7450 2225
	0    1    -1   0   
$EndComp
Wire Wire Line
	7450 2525 7800 2525
Wire Wire Line
	7800 2525 7800 2375
$Comp
L Device:LED D21
U 1 1 5F4ECDEC
P 7800 2225
AR Path="/5F2104BF/5F4ECDEC" Ref="D21"  Part="1" 
AR Path="/5F4ECDEC" Ref="D?"  Part="1" 
AR Path="/5F5F0002/5F4ECDEC" Ref="D?"  Part="1" 
AR Path="/5F496ED4/5F4ECDEC" Ref="D?"  Part="1" 
AR Path="/5F5772D0/5F4ECDEC" Ref="D?"  Part="1" 
F 0 "D21" V 7831 2107 39  0000 R CNN
F 1 "IN-S126ATA" V 7756 2107 39  0001 R CNN
F 2 "LED_SMD:LED_1206_3216Metric_Castellated" H 7800 2225 50  0001 C CNN
F 3 "http://inolux-corp.com/datasheet/SMDLED/Mono%20Color%20Top%20View/IN-S126AT%20Series_V1.0.pdf" H 7800 2225 50  0001 C CNN
	1    7800 2225
	0    1    -1   0   
$EndComp
Wire Wire Line
	7800 2525 8150 2525
Wire Wire Line
	8150 2525 8150 2375
$Comp
L Device:LED D23
U 1 1 5F4ECDF6
P 8150 2225
AR Path="/5F2104BF/5F4ECDF6" Ref="D23"  Part="1" 
AR Path="/5F4ECDF6" Ref="D?"  Part="1" 
AR Path="/5F5F0002/5F4ECDF6" Ref="D?"  Part="1" 
AR Path="/5F496ED4/5F4ECDF6" Ref="D?"  Part="1" 
AR Path="/5F5772D0/5F4ECDF6" Ref="D?"  Part="1" 
F 0 "D23" V 8181 2107 39  0000 R CNN
F 1 "IN-S126ATA" V 8106 2107 39  0001 R CNN
F 2 "LED_SMD:LED_1206_3216Metric_Castellated" H 8150 2225 50  0001 C CNN
F 3 "http://inolux-corp.com/datasheet/SMDLED/Mono%20Color%20Top%20View/IN-S126AT%20Series_V1.0.pdf" H 8150 2225 50  0001 C CNN
	1    8150 2225
	0    1    -1   0   
$EndComp
Wire Wire Line
	8150 2525 8500 2525
Wire Wire Line
	8500 2525 8500 2375
$Comp
L Device:LED D25
U 1 1 5F4ECE00
P 8500 2225
AR Path="/5F2104BF/5F4ECE00" Ref="D25"  Part="1" 
AR Path="/5F4ECE00" Ref="D?"  Part="1" 
AR Path="/5F5F0002/5F4ECE00" Ref="D?"  Part="1" 
AR Path="/5F496ED4/5F4ECE00" Ref="D?"  Part="1" 
AR Path="/5F5772D0/5F4ECE00" Ref="D?"  Part="1" 
F 0 "D25" V 8531 2107 39  0000 R CNN
F 1 "IN-S126ATA" V 8456 2107 39  0001 R CNN
F 2 "LED_SMD:LED_1206_3216Metric_Castellated" H 8500 2225 50  0001 C CNN
F 3 "http://inolux-corp.com/datasheet/SMDLED/Mono%20Color%20Top%20View/IN-S126AT%20Series_V1.0.pdf" H 8500 2225 50  0001 C CNN
	1    8500 2225
	0    1    -1   0   
$EndComp
Wire Wire Line
	8500 2525 8850 2525
Wire Wire Line
	8850 2525 8850 2375
$Comp
L Device:LED D27
U 1 1 5F4EF25F
P 8850 2225
AR Path="/5F2104BF/5F4EF25F" Ref="D27"  Part="1" 
AR Path="/5F4EF25F" Ref="D?"  Part="1" 
AR Path="/5F5F0002/5F4EF25F" Ref="D?"  Part="1" 
AR Path="/5F496ED4/5F4EF25F" Ref="D?"  Part="1" 
AR Path="/5F5772D0/5F4EF25F" Ref="D?"  Part="1" 
F 0 "D27" V 8881 2107 39  0000 R CNN
F 1 "IN-S126ATA" V 8806 2107 39  0001 R CNN
F 2 "LED_SMD:LED_1206_3216Metric_Castellated" H 8850 2225 50  0001 C CNN
F 3 "http://inolux-corp.com/datasheet/SMDLED/Mono%20Color%20Top%20View/IN-S126AT%20Series_V1.0.pdf" H 8850 2225 50  0001 C CNN
	1    8850 2225
	0    1    -1   0   
$EndComp
Connection ~ 5350 2525
Connection ~ 5700 2525
Connection ~ 6050 2525
Connection ~ 6400 2525
Connection ~ 6750 2525
Connection ~ 7100 2525
Connection ~ 7450 2525
Connection ~ 7800 2525
Connection ~ 8150 2525
Connection ~ 8500 2525
Text Notes 9700 5150 0    39   ~ 0
White LED\nVf = 3.1 V @ If = 10 mA
Wire Wire Line
	8575 5400 8575 5250
Wire Wire Line
	8925 5400 8925 5250
$Comp
L Device:Q_NMOS_GSD Q3
U 1 1 5F74D2B5
P 3900 5450
AR Path="/5F2104BF/5F74D2B5" Ref="Q3"  Part="1" 
AR Path="/5F74D2B5" Ref="Q?"  Part="1" 
AR Path="/5F5F0002/5F74D2B5" Ref="Q?"  Part="1" 
AR Path="/5F496ED4/5F74D2B5" Ref="Q?"  Part="1" 
AR Path="/5F5772D0/5F74D2B5" Ref="Q?"  Part="1" 
F 0 "Q3" H 4105 5488 39  0000 L CNN
F 1 "Si2302CDS" H 4105 5413 39  0000 L CNN
F 2 "Package_TO_SOT_SMD:SOT-23" H 4100 5550 50  0001 C CNN
F 3 "https://eu.mouser.com/datasheet/2/427/si2302cds-1764899.pdf" H 3900 5450 50  0001 C CNN
	1    3900 5450
	1    0    0    -1  
$EndComp
$Comp
L Device:Q_PMOS_GSD Q?
U 1 1 5F74D2BB
P 3900 4800
AR Path="/5F496ED4/5F74D2BB" Ref="Q?"  Part="1" 
AR Path="/5F74D2BB" Ref="Q?"  Part="1" 
AR Path="/5F5F0002/5F74D2BB" Ref="Q?"  Part="1" 
AR Path="/5F2104BF/5F74D2BB" Ref="Q2"  Part="1" 
AR Path="/5F5772D0/5F74D2BB" Ref="Q?"  Part="1" 
F 0 "Q2" H 4105 4762 39  0000 L CNN
F 1 "Si2301BDS" H 4105 4837 39  0000 L CNN
F 2 "Package_TO_SOT_SMD:SOT-23" H 4100 4900 50  0001 C CNN
F 3 "https://eu.mouser.com/datasheet/2/427/si2301bds-1765637.pdf" H 3900 4800 50  0001 C CNN
	1    3900 4800
	1    0    0    1   
$EndComp
Text HLabel 2575 4800 0    39   Input ~ 0
SOURCE
Text HLabel 3700 5450 0    39   Input ~ 0
SOURCE
$Comp
L Device:R_Small R12
U 1 1 5F74D2F4
P 2800 4950
AR Path="/5F2104BF/5F74D2F4" Ref="R12"  Part="1" 
AR Path="/5F74D2F4" Ref="R?"  Part="1" 
AR Path="/5F5F0002/5F74D2F4" Ref="R?"  Part="1" 
AR Path="/5F5772D0/5F74D2F4" Ref="R?"  Part="1" 
F 0 "R12" H 2859 4988 39  0000 L CNN
F 1 "10k" H 2859 4913 39  0000 L CNN
F 2 "Resistor_SMD:R_0603_1608Metric" H 2800 4950 50  0001 C CNN
F 3 "~" H 2800 4950 50  0001 C CNN
F 4 "" H 2800 4950 50  0001 C CNN "Mfr"
	1    2800 4950
	1    0    0    -1  
$EndComp
$Comp
L power:GND #PWR039
U 1 1 5F74D2FA
P 2800 5100
AR Path="/5F2104BF/5F74D2FA" Ref="#PWR039"  Part="1" 
AR Path="/5F74D2FA" Ref="#PWR?"  Part="1" 
AR Path="/5F5F0002/5F74D2FA" Ref="#PWR?"  Part="1" 
AR Path="/5F5772D0/5F74D2FA" Ref="#PWR?"  Part="1" 
F 0 "#PWR039" H 2800 4850 50  0001 C CNN
F 1 "GND" H 2805 4935 39  0000 C CNN
F 2 "" H 2800 5100 50  0001 C CNN
F 3 "" H 2800 5100 50  0001 C CNN
	1    2800 5100
	1    0    0    -1  
$EndComp
Wire Wire Line
	2800 5050 2800 5100
Wire Wire Line
	2800 4850 2800 4800
Text Notes 3700 4775 0    39   ~ 0
GRID
Text Notes 3700 5425 0    39   ~ 0
GAS
$Comp
L Device:R_Small R15
U 1 1 5F77AD0E
P 5000 1775
AR Path="/5F2104BF/5F77AD0E" Ref="R15"  Part="1" 
AR Path="/5F77AD0E" Ref="R?"  Part="1" 
AR Path="/5F5F0002/5F77AD0E" Ref="R?"  Part="1" 
AR Path="/5F5772D0/5F77AD0E" Ref="R?"  Part="1" 
F 0 "R15" H 5059 1813 39  0000 L CNN
F 1 "120" H 5059 1738 39  0000 L CNN
F 2 "Resistor_SMD:R_0603_1608Metric" H 5000 1775 50  0001 C CNN
F 3 "~" H 5000 1775 50  0001 C CNN
	1    5000 1775
	1    0    0    -1  
$EndComp
Wire Wire Line
	5000 1875 5000 2075
Wire Wire Line
	5350 1575 5350 1675
$Comp
L power:+3.3V #PWR?
U 1 1 5F783F74
P 5350 1575
AR Path="/5F783F74" Ref="#PWR?"  Part="1" 
AR Path="/5F2104BF/5F783F74" Ref="#PWR048"  Part="1" 
AR Path="/5F5772D0/5F783F74" Ref="#PWR?"  Part="1" 
F 0 "#PWR048" H 5350 1425 50  0001 C CNN
F 1 "+3.3V" H 5365 1748 39  0000 C CNN
F 2 "" H 5350 1575 50  0001 C CNN
F 3 "" H 5350 1575 50  0001 C CNN
	1    5350 1575
	1    0    0    -1  
$EndComp
$Comp
L Device:R_Small R18
U 1 1 5F783F7A
P 5350 1775
AR Path="/5F2104BF/5F783F7A" Ref="R18"  Part="1" 
AR Path="/5F783F7A" Ref="R?"  Part="1" 
AR Path="/5F5F0002/5F783F7A" Ref="R?"  Part="1" 
AR Path="/5F5772D0/5F783F7A" Ref="R?"  Part="1" 
F 0 "R18" H 5409 1813 39  0000 L CNN
F 1 "120" H 5409 1738 39  0000 L CNN
F 2 "Resistor_SMD:R_0603_1608Metric" H 5350 1775 50  0001 C CNN
F 3 "~" H 5350 1775 50  0001 C CNN
	1    5350 1775
	1    0    0    -1  
$EndComp
Wire Wire Line
	5350 1875 5350 2075
Wire Wire Line
	5700 1575 5700 1675
$Comp
L power:+3.3V #PWR?
U 1 1 5F7880F4
P 5700 1575
AR Path="/5F7880F4" Ref="#PWR?"  Part="1" 
AR Path="/5F2104BF/5F7880F4" Ref="#PWR051"  Part="1" 
AR Path="/5F5772D0/5F7880F4" Ref="#PWR?"  Part="1" 
F 0 "#PWR051" H 5700 1425 50  0001 C CNN
F 1 "+3.3V" H 5715 1748 39  0000 C CNN
F 2 "" H 5700 1575 50  0001 C CNN
F 3 "" H 5700 1575 50  0001 C CNN
	1    5700 1575
	1    0    0    -1  
$EndComp
$Comp
L Device:R_Small R21
U 1 1 5F7880FA
P 5700 1775
AR Path="/5F2104BF/5F7880FA" Ref="R21"  Part="1" 
AR Path="/5F7880FA" Ref="R?"  Part="1" 
AR Path="/5F5F0002/5F7880FA" Ref="R?"  Part="1" 
AR Path="/5F5772D0/5F7880FA" Ref="R?"  Part="1" 
F 0 "R21" H 5759 1813 39  0000 L CNN
F 1 "120" H 5759 1738 39  0000 L CNN
F 2 "Resistor_SMD:R_0603_1608Metric" H 5700 1775 50  0001 C CNN
F 3 "~" H 5700 1775 50  0001 C CNN
	1    5700 1775
	1    0    0    -1  
$EndComp
Wire Wire Line
	5700 1875 5700 2075
Wire Wire Line
	6050 1575 6050 1675
$Comp
L power:+3.3V #PWR?
U 1 1 5F78C5B2
P 6050 1575
AR Path="/5F78C5B2" Ref="#PWR?"  Part="1" 
AR Path="/5F2104BF/5F78C5B2" Ref="#PWR054"  Part="1" 
AR Path="/5F5772D0/5F78C5B2" Ref="#PWR?"  Part="1" 
F 0 "#PWR054" H 6050 1425 50  0001 C CNN
F 1 "+3.3V" H 6065 1748 39  0000 C CNN
F 2 "" H 6050 1575 50  0001 C CNN
F 3 "" H 6050 1575 50  0001 C CNN
	1    6050 1575
	1    0    0    -1  
$EndComp
$Comp
L Device:R_Small R24
U 1 1 5F78C5B8
P 6050 1775
AR Path="/5F2104BF/5F78C5B8" Ref="R24"  Part="1" 
AR Path="/5F78C5B8" Ref="R?"  Part="1" 
AR Path="/5F5F0002/5F78C5B8" Ref="R?"  Part="1" 
AR Path="/5F5772D0/5F78C5B8" Ref="R?"  Part="1" 
F 0 "R24" H 6109 1813 39  0000 L CNN
F 1 "120" H 6109 1738 39  0000 L CNN
F 2 "Resistor_SMD:R_0603_1608Metric" H 6050 1775 50  0001 C CNN
F 3 "~" H 6050 1775 50  0001 C CNN
	1    6050 1775
	1    0    0    -1  
$EndComp
Wire Wire Line
	6050 1875 6050 2075
Wire Wire Line
	6400 1575 6400 1675
$Comp
L power:+3.3V #PWR?
U 1 1 5F79519A
P 6400 1575
AR Path="/5F79519A" Ref="#PWR?"  Part="1" 
AR Path="/5F2104BF/5F79519A" Ref="#PWR057"  Part="1" 
AR Path="/5F5772D0/5F79519A" Ref="#PWR?"  Part="1" 
F 0 "#PWR057" H 6400 1425 50  0001 C CNN
F 1 "+3.3V" H 6415 1748 39  0000 C CNN
F 2 "" H 6400 1575 50  0001 C CNN
F 3 "" H 6400 1575 50  0001 C CNN
	1    6400 1575
	1    0    0    -1  
$EndComp
$Comp
L Device:R_Small R27
U 1 1 5F7951A0
P 6400 1775
AR Path="/5F2104BF/5F7951A0" Ref="R27"  Part="1" 
AR Path="/5F7951A0" Ref="R?"  Part="1" 
AR Path="/5F5F0002/5F7951A0" Ref="R?"  Part="1" 
AR Path="/5F5772D0/5F7951A0" Ref="R?"  Part="1" 
F 0 "R27" H 6459 1813 39  0000 L CNN
F 1 "120" H 6459 1738 39  0000 L CNN
F 2 "Resistor_SMD:R_0603_1608Metric" H 6400 1775 50  0001 C CNN
F 3 "~" H 6400 1775 50  0001 C CNN
	1    6400 1775
	1    0    0    -1  
$EndComp
Wire Wire Line
	6750 1575 6750 1675
$Comp
L power:+3.3V #PWR?
U 1 1 5F7951A8
P 6750 1575
AR Path="/5F7951A8" Ref="#PWR?"  Part="1" 
AR Path="/5F2104BF/5F7951A8" Ref="#PWR058"  Part="1" 
AR Path="/5F5772D0/5F7951A8" Ref="#PWR?"  Part="1" 
F 0 "#PWR058" H 6750 1425 50  0001 C CNN
F 1 "+3.3V" H 6765 1748 39  0000 C CNN
F 2 "" H 6750 1575 50  0001 C CNN
F 3 "" H 6750 1575 50  0001 C CNN
	1    6750 1575
	1    0    0    -1  
$EndComp
$Comp
L Device:R_Small R28
U 1 1 5F7951AE
P 6750 1775
AR Path="/5F2104BF/5F7951AE" Ref="R28"  Part="1" 
AR Path="/5F7951AE" Ref="R?"  Part="1" 
AR Path="/5F5F0002/5F7951AE" Ref="R?"  Part="1" 
AR Path="/5F5772D0/5F7951AE" Ref="R?"  Part="1" 
F 0 "R28" H 6809 1813 39  0000 L CNN
F 1 "120" H 6809 1738 39  0000 L CNN
F 2 "Resistor_SMD:R_0603_1608Metric" H 6750 1775 50  0001 C CNN
F 3 "~" H 6750 1775 50  0001 C CNN
	1    6750 1775
	1    0    0    -1  
$EndComp
Wire Wire Line
	7100 1575 7100 1675
$Comp
L power:+3.3V #PWR?
U 1 1 5F7951B6
P 7100 1575
AR Path="/5F7951B6" Ref="#PWR?"  Part="1" 
AR Path="/5F2104BF/5F7951B6" Ref="#PWR060"  Part="1" 
AR Path="/5F5772D0/5F7951B6" Ref="#PWR?"  Part="1" 
F 0 "#PWR060" H 7100 1425 50  0001 C CNN
F 1 "+3.3V" H 7115 1748 39  0000 C CNN
F 2 "" H 7100 1575 50  0001 C CNN
F 3 "" H 7100 1575 50  0001 C CNN
	1    7100 1575
	1    0    0    -1  
$EndComp
$Comp
L Device:R_Small R30
U 1 1 5F7951BC
P 7100 1775
AR Path="/5F2104BF/5F7951BC" Ref="R30"  Part="1" 
AR Path="/5F7951BC" Ref="R?"  Part="1" 
AR Path="/5F5F0002/5F7951BC" Ref="R?"  Part="1" 
AR Path="/5F5772D0/5F7951BC" Ref="R?"  Part="1" 
F 0 "R30" H 7159 1813 39  0000 L CNN
F 1 "120" H 7159 1738 39  0000 L CNN
F 2 "Resistor_SMD:R_0603_1608Metric" H 7100 1775 50  0001 C CNN
F 3 "~" H 7100 1775 50  0001 C CNN
	1    7100 1775
	1    0    0    -1  
$EndComp
Wire Wire Line
	7450 1575 7450 1675
$Comp
L power:+3.3V #PWR?
U 1 1 5F7951C4
P 7450 1575
AR Path="/5F7951C4" Ref="#PWR?"  Part="1" 
AR Path="/5F2104BF/5F7951C4" Ref="#PWR062"  Part="1" 
AR Path="/5F5772D0/5F7951C4" Ref="#PWR?"  Part="1" 
F 0 "#PWR062" H 7450 1425 50  0001 C CNN
F 1 "+3.3V" H 7465 1748 39  0000 C CNN
F 2 "" H 7450 1575 50  0001 C CNN
F 3 "" H 7450 1575 50  0001 C CNN
	1    7450 1575
	1    0    0    -1  
$EndComp
$Comp
L Device:R_Small R32
U 1 1 5F7951CA
P 7450 1775
AR Path="/5F2104BF/5F7951CA" Ref="R32"  Part="1" 
AR Path="/5F7951CA" Ref="R?"  Part="1" 
AR Path="/5F5F0002/5F7951CA" Ref="R?"  Part="1" 
AR Path="/5F5772D0/5F7951CA" Ref="R?"  Part="1" 
F 0 "R32" H 7509 1813 39  0000 L CNN
F 1 "120" H 7509 1738 39  0000 L CNN
F 2 "Resistor_SMD:R_0603_1608Metric" H 7450 1775 50  0001 C CNN
F 3 "~" H 7450 1775 50  0001 C CNN
	1    7450 1775
	1    0    0    -1  
$EndComp
Wire Wire Line
	6400 1875 6400 2075
Wire Wire Line
	6750 1875 6750 2075
Wire Wire Line
	7100 1875 7100 2075
Wire Wire Line
	7450 1875 7450 2075
Wire Wire Line
	7800 1575 7800 1675
$Comp
L power:+3.3V #PWR?
U 1 1 5F79DBED
P 7800 1575
AR Path="/5F79DBED" Ref="#PWR?"  Part="1" 
AR Path="/5F2104BF/5F79DBED" Ref="#PWR064"  Part="1" 
AR Path="/5F5772D0/5F79DBED" Ref="#PWR?"  Part="1" 
F 0 "#PWR064" H 7800 1425 50  0001 C CNN
F 1 "+3.3V" H 7815 1748 39  0000 C CNN
F 2 "" H 7800 1575 50  0001 C CNN
F 3 "" H 7800 1575 50  0001 C CNN
	1    7800 1575
	1    0    0    -1  
$EndComp
$Comp
L Device:R_Small R34
U 1 1 5F79DBF3
P 7800 1775
AR Path="/5F2104BF/5F79DBF3" Ref="R34"  Part="1" 
AR Path="/5F79DBF3" Ref="R?"  Part="1" 
AR Path="/5F5F0002/5F79DBF3" Ref="R?"  Part="1" 
AR Path="/5F5772D0/5F79DBF3" Ref="R?"  Part="1" 
F 0 "R34" H 7859 1813 39  0000 L CNN
F 1 "120" H 7859 1738 39  0000 L CNN
F 2 "Resistor_SMD:R_0603_1608Metric" H 7800 1775 50  0001 C CNN
F 3 "~" H 7800 1775 50  0001 C CNN
	1    7800 1775
	1    0    0    -1  
$EndComp
Wire Wire Line
	8150 1575 8150 1675
$Comp
L power:+3.3V #PWR?
U 1 1 5F79DBFB
P 8150 1575
AR Path="/5F79DBFB" Ref="#PWR?"  Part="1" 
AR Path="/5F2104BF/5F79DBFB" Ref="#PWR066"  Part="1" 
AR Path="/5F5772D0/5F79DBFB" Ref="#PWR?"  Part="1" 
F 0 "#PWR066" H 8150 1425 50  0001 C CNN
F 1 "+3.3V" H 8165 1748 39  0000 C CNN
F 2 "" H 8150 1575 50  0001 C CNN
F 3 "" H 8150 1575 50  0001 C CNN
	1    8150 1575
	1    0    0    -1  
$EndComp
$Comp
L Device:R_Small R36
U 1 1 5F79DC01
P 8150 1775
AR Path="/5F2104BF/5F79DC01" Ref="R36"  Part="1" 
AR Path="/5F79DC01" Ref="R?"  Part="1" 
AR Path="/5F5F0002/5F79DC01" Ref="R?"  Part="1" 
AR Path="/5F5772D0/5F79DC01" Ref="R?"  Part="1" 
F 0 "R36" H 8209 1813 39  0000 L CNN
F 1 "120" H 8209 1738 39  0000 L CNN
F 2 "Resistor_SMD:R_0603_1608Metric" H 8150 1775 50  0001 C CNN
F 3 "~" H 8150 1775 50  0001 C CNN
	1    8150 1775
	1    0    0    -1  
$EndComp
Wire Wire Line
	8500 1575 8500 1675
$Comp
L power:+3.3V #PWR?
U 1 1 5F79DC09
P 8500 1575
AR Path="/5F79DC09" Ref="#PWR?"  Part="1" 
AR Path="/5F2104BF/5F79DC09" Ref="#PWR068"  Part="1" 
AR Path="/5F5772D0/5F79DC09" Ref="#PWR?"  Part="1" 
F 0 "#PWR068" H 8500 1425 50  0001 C CNN
F 1 "+3.3V" H 8515 1748 39  0000 C CNN
F 2 "" H 8500 1575 50  0001 C CNN
F 3 "" H 8500 1575 50  0001 C CNN
	1    8500 1575
	1    0    0    -1  
$EndComp
$Comp
L Device:R_Small R38
U 1 1 5F79DC0F
P 8500 1775
AR Path="/5F2104BF/5F79DC0F" Ref="R38"  Part="1" 
AR Path="/5F79DC0F" Ref="R?"  Part="1" 
AR Path="/5F5F0002/5F79DC0F" Ref="R?"  Part="1" 
AR Path="/5F5772D0/5F79DC0F" Ref="R?"  Part="1" 
F 0 "R38" H 8559 1813 39  0000 L CNN
F 1 "120" H 8559 1738 39  0000 L CNN
F 2 "Resistor_SMD:R_0603_1608Metric" H 8500 1775 50  0001 C CNN
F 3 "~" H 8500 1775 50  0001 C CNN
	1    8500 1775
	1    0    0    -1  
$EndComp
Wire Wire Line
	8850 1575 8850 1675
$Comp
L power:+3.3V #PWR?
U 1 1 5F79DC17
P 8850 1575
AR Path="/5F79DC17" Ref="#PWR?"  Part="1" 
AR Path="/5F2104BF/5F79DC17" Ref="#PWR070"  Part="1" 
AR Path="/5F5772D0/5F79DC17" Ref="#PWR?"  Part="1" 
F 0 "#PWR070" H 8850 1425 50  0001 C CNN
F 1 "+3.3V" H 8865 1748 39  0000 C CNN
F 2 "" H 8850 1575 50  0001 C CNN
F 3 "" H 8850 1575 50  0001 C CNN
	1    8850 1575
	1    0    0    -1  
$EndComp
$Comp
L Device:R_Small R40
U 1 1 5F79DC1D
P 8850 1775
AR Path="/5F2104BF/5F79DC1D" Ref="R40"  Part="1" 
AR Path="/5F79DC1D" Ref="R?"  Part="1" 
AR Path="/5F5F0002/5F79DC1D" Ref="R?"  Part="1" 
AR Path="/5F5772D0/5F79DC1D" Ref="R?"  Part="1" 
F 0 "R40" H 8909 1813 39  0000 L CNN
F 1 "120" H 8909 1738 39  0000 L CNN
F 2 "Resistor_SMD:R_0603_1608Metric" H 8850 1775 50  0001 C CNN
F 3 "~" H 8850 1775 50  0001 C CNN
	1    8850 1775
	1    0    0    -1  
$EndComp
Wire Wire Line
	7800 1875 7800 2075
Wire Wire Line
	8150 1875 8150 2075
Wire Wire Line
	8500 1875 8500 2075
Wire Wire Line
	8850 1875 8850 2075
$Comp
L Device:LED D28
U 1 1 5F7AC55C
P 8575 5100
AR Path="/5F2104BF/5F7AC55C" Ref="D28"  Part="1" 
AR Path="/5F7AC55C" Ref="D?"  Part="1" 
AR Path="/5F5F0002/5F7AC55C" Ref="D?"  Part="1" 
AR Path="/5F496ED4/5F7AC55C" Ref="D?"  Part="1" 
AR Path="/5F5772D0/5F7AC55C" Ref="D?"  Part="1" 
F 0 "D28" V 8606 4982 39  0000 R CNN
F 1 "IN-S126ATB " V 8531 4982 39  0001 R CNN
F 2 "LED_SMD:LED_1206_3216Metric_Castellated" H 8575 5100 50  0001 C CNN
F 3 "http://inolux-corp.com/datasheet/SMDLED/Mono%20Color%20Top%20View/IN-S126AT%20Series_V1.0.pdf" H 8575 5100 50  0001 C CNN
	1    8575 5100
	0    1    -1   0   
$EndComp
$Comp
L Device:Q_NMOS_GSD Q1
U 1 1 5F7CC35A
P 3200 4700
AR Path="/5F2104BF/5F7CC35A" Ref="Q1"  Part="1" 
AR Path="/5F7CC35A" Ref="Q?"  Part="1" 
AR Path="/5F5F0002/5F7CC35A" Ref="Q?"  Part="1" 
AR Path="/5F496ED4/5F7CC35A" Ref="Q?"  Part="1" 
AR Path="/5F5772D0/5F7CC35A" Ref="Q?"  Part="1" 
F 0 "Q1" V 3405 4738 39  0000 L CNN
F 1 "Si2302CDS" V 3475 4700 39  0000 L CNN
F 2 "Package_TO_SOT_SMD:SOT-23" H 3400 4800 50  0001 C CNN
F 3 "https://eu.mouser.com/datasheet/2/427/si2302cds-1764899.pdf" H 3200 4700 50  0001 C CNN
	1    3200 4700
	0    1    1    0   
$EndComp
$Comp
L Device:R_Small R13
U 1 1 5F7D5FD8
P 3475 4650
AR Path="/5F2104BF/5F7D5FD8" Ref="R13"  Part="1" 
AR Path="/5F7D5FD8" Ref="R?"  Part="1" 
AR Path="/5F5F0002/5F7D5FD8" Ref="R?"  Part="1" 
AR Path="/5F5772D0/5F7D5FD8" Ref="R?"  Part="1" 
F 0 "R13" H 3534 4688 39  0000 L CNN
F 1 "10k" H 3534 4613 39  0000 L CNN
F 2 "Resistor_SMD:R_0603_1608Metric" H 3475 4650 50  0001 C CNN
F 3 "~" H 3475 4650 50  0001 C CNN
F 4 "" H 3475 4650 50  0001 C CNN "Mfr"
	1    3475 4650
	1    0    0    -1  
$EndComp
Wire Wire Line
	3475 4750 3475 4800
Connection ~ 3475 4800
Wire Wire Line
	3475 4800 3400 4800
$Comp
L power:+3.3V #PWR?
U 1 1 5F7D94C9
P 3200 4500
AR Path="/5F7D94C9" Ref="#PWR?"  Part="1" 
AR Path="/5F2104BF/5F7D94C9" Ref="#PWR040"  Part="1" 
AR Path="/5F5772D0/5F7D94C9" Ref="#PWR?"  Part="1" 
F 0 "#PWR040" H 3200 4350 50  0001 C CNN
F 1 "+3.3V" H 3215 4673 39  0000 C CNN
F 2 "" H 3200 4500 50  0001 C CNN
F 3 "" H 3200 4500 50  0001 C CNN
	1    3200 4500
	1    0    0    -1  
$EndComp
Connection ~ 2800 4800
Wire Wire Line
	2800 4800 3000 4800
Wire Wire Line
	2575 4800 2800 4800
$Comp
L power:+5V #PWR?
U 1 1 5F7ED2A3
P 3475 4500
AR Path="/5F102375/5F7ED2A3" Ref="#PWR?"  Part="1" 
AR Path="/5F2104BF/5F7ED2A3" Ref="#PWR041"  Part="1" 
AR Path="/5F5772D0/5F7ED2A3" Ref="#PWR?"  Part="1" 
F 0 "#PWR041" H 3475 4350 50  0001 C CNN
F 1 "+5V" H 3475 4675 39  0000 C CNN
F 2 "" H 3475 4500 50  0001 C CNN
F 3 "" H 3475 4500 50  0001 C CNN
	1    3475 4500
	1    0    0    -1  
$EndComp
Wire Wire Line
	3475 4500 3475 4550
$Comp
L power:+5V #PWR?
U 1 1 5F7F2C13
P 4000 4500
AR Path="/5F102375/5F7F2C13" Ref="#PWR?"  Part="1" 
AR Path="/5F2104BF/5F7F2C13" Ref="#PWR042"  Part="1" 
AR Path="/5F5772D0/5F7F2C13" Ref="#PWR?"  Part="1" 
F 0 "#PWR042" H 4000 4350 50  0001 C CNN
F 1 "+5V" H 4000 4675 39  0000 C CNN
F 2 "" H 4000 4500 50  0001 C CNN
F 3 "" H 4000 4500 50  0001 C CNN
	1    4000 4500
	1    0    0    -1  
$EndComp
Wire Wire Line
	4000 4500 4000 4600
Wire Wire Line
	3475 4800 3700 4800
$Comp
L power:GND #PWR043
U 1 1 5F8082D7
P 4000 5650
AR Path="/5F2104BF/5F8082D7" Ref="#PWR043"  Part="1" 
AR Path="/5F8082D7" Ref="#PWR?"  Part="1" 
AR Path="/5F5F0002/5F8082D7" Ref="#PWR?"  Part="1" 
AR Path="/5F5772D0/5F8082D7" Ref="#PWR?"  Part="1" 
F 0 "#PWR043" H 4000 5400 50  0001 C CNN
F 1 "GND" H 4005 5485 39  0000 C CNN
F 2 "" H 4000 5650 50  0001 C CNN
F 3 "" H 4000 5650 50  0001 C CNN
	1    4000 5650
	1    0    0    -1  
$EndComp
Wire Wire Line
	4000 5000 4000 5050
Wire Wire Line
	4000 5200 4000 5250
Text Label 4000 5050 0    39   ~ 0
GRID
Text Label 4000 5200 0    39   ~ 0
GAS
Wire Wire Line
	8575 4950 8575 4800
Wire Wire Line
	8925 4950 8925 4800
$Comp
L Device:R_Small R42
U 1 1 5F81CE33
P 8925 5500
AR Path="/5F2104BF/5F81CE33" Ref="R42"  Part="1" 
AR Path="/5F81CE33" Ref="R?"  Part="1" 
AR Path="/5F5F0002/5F81CE33" Ref="R?"  Part="1" 
AR Path="/5F5772D0/5F81CE33" Ref="R?"  Part="1" 
F 0 "R42" H 8984 5538 39  0000 L CNN
F 1 "180" H 8984 5463 39  0000 L CNN
F 2 "Resistor_SMD:R_0603_1608Metric" H 8925 5500 50  0001 C CNN
F 3 "~" H 8925 5500 50  0001 C CNN
F 4 "" H 8925 5500 50  0001 C CNN "Mfr"
	1    8925 5500
	1    0    0    -1  
$EndComp
$Comp
L power:GND #PWR072
U 1 1 5F81E8C7
P 8925 5750
AR Path="/5F2104BF/5F81E8C7" Ref="#PWR072"  Part="1" 
AR Path="/5F81E8C7" Ref="#PWR?"  Part="1" 
AR Path="/5F5F0002/5F81E8C7" Ref="#PWR?"  Part="1" 
AR Path="/5F5772D0/5F81E8C7" Ref="#PWR?"  Part="1" 
F 0 "#PWR072" H 8925 5500 50  0001 C CNN
F 1 "GND" H 8930 5585 39  0000 C CNN
F 2 "" H 8925 5750 50  0001 C CNN
F 3 "" H 8925 5750 50  0001 C CNN
	1    8925 5750
	1    0    0    -1  
$EndComp
Text Label 8925 4800 1    39   ~ 0
GRID
$Comp
L Device:R_Small R41
U 1 1 5F830756
P 8575 5500
AR Path="/5F2104BF/5F830756" Ref="R41"  Part="1" 
AR Path="/5F830756" Ref="R?"  Part="1" 
AR Path="/5F5F0002/5F830756" Ref="R?"  Part="1" 
AR Path="/5F5772D0/5F830756" Ref="R?"  Part="1" 
F 0 "R41" H 8634 5538 39  0000 L CNN
F 1 "180" H 8634 5463 39  0000 L CNN
F 2 "Resistor_SMD:R_0603_1608Metric" H 8575 5500 50  0001 C CNN
F 3 "~" H 8575 5500 50  0001 C CNN
F 4 "" H 8575 5500 50  0001 C CNN "Mfr"
	1    8575 5500
	1    0    0    -1  
$EndComp
Wire Wire Line
	8925 5750 8925 5600
Wire Wire Line
	8575 5750 8575 5600
$Comp
L power:+5V #PWR?
U 1 1 5F83573F
P 8575 4800
AR Path="/5F102375/5F83573F" Ref="#PWR?"  Part="1" 
AR Path="/5F2104BF/5F83573F" Ref="#PWR071"  Part="1" 
AR Path="/5F5772D0/5F83573F" Ref="#PWR?"  Part="1" 
F 0 "#PWR071" H 8575 4650 50  0001 C CNN
F 1 "+5V" H 8575 4975 39  0000 C CNN
F 2 "" H 8575 4800 50  0001 C CNN
F 3 "" H 8575 4800 50  0001 C CNN
	1    8575 4800
	1    0    0    -1  
$EndComp
Text Label 8575 5750 3    39   ~ 0
GAS
Wire Wire Line
	7875 5400 7875 5250
Wire Wire Line
	8225 5400 8225 5250
$Comp
L Device:LED D26
U 1 1 5F83FB75
P 8225 5100
AR Path="/5F2104BF/5F83FB75" Ref="D26"  Part="1" 
AR Path="/5F83FB75" Ref="D?"  Part="1" 
AR Path="/5F5F0002/5F83FB75" Ref="D?"  Part="1" 
AR Path="/5F496ED4/5F83FB75" Ref="D?"  Part="1" 
AR Path="/5F5772D0/5F83FB75" Ref="D?"  Part="1" 
F 0 "D26" V 8256 4982 39  0000 R CNN
F 1 "IN-S126AT5UW" V 8181 4982 39  0001 R CNN
F 2 "LED_SMD:LED_1206_3216Metric_Castellated" H 8225 5100 50  0001 C CNN
F 3 "http://inolux-corp.com/datasheet/SMDLED/Mono%20Color%20Top%20View/IN-S126AT%20Series_V1.0.pdf" H 8225 5100 50  0001 C CNN
	1    8225 5100
	0    1    -1   0   
$EndComp
$Comp
L Device:LED D24
U 1 1 5F83FB7B
P 7875 5100
AR Path="/5F2104BF/5F83FB7B" Ref="D24"  Part="1" 
AR Path="/5F83FB7B" Ref="D?"  Part="1" 
AR Path="/5F5F0002/5F83FB7B" Ref="D?"  Part="1" 
AR Path="/5F496ED4/5F83FB7B" Ref="D?"  Part="1" 
AR Path="/5F5772D0/5F83FB7B" Ref="D?"  Part="1" 
F 0 "D24" V 7906 4982 39  0000 R CNN
F 1 "IN-S126ATB " V 7831 4982 39  0001 R CNN
F 2 "LED_SMD:LED_1206_3216Metric_Castellated" H 7875 5100 50  0001 C CNN
F 3 "http://inolux-corp.com/datasheet/SMDLED/Mono%20Color%20Top%20View/IN-S126AT%20Series_V1.0.pdf" H 7875 5100 50  0001 C CNN
	1    7875 5100
	0    1    -1   0   
$EndComp
Wire Wire Line
	7875 4950 7875 4800
Wire Wire Line
	8225 4950 8225 4800
$Comp
L Device:R_Small R39
U 1 1 5F83FB84
P 8225 5500
AR Path="/5F2104BF/5F83FB84" Ref="R39"  Part="1" 
AR Path="/5F83FB84" Ref="R?"  Part="1" 
AR Path="/5F5F0002/5F83FB84" Ref="R?"  Part="1" 
AR Path="/5F5772D0/5F83FB84" Ref="R?"  Part="1" 
F 0 "R39" H 8284 5538 39  0000 L CNN
F 1 "180" H 8284 5463 39  0000 L CNN
F 2 "Resistor_SMD:R_0603_1608Metric" H 8225 5500 50  0001 C CNN
F 3 "~" H 8225 5500 50  0001 C CNN
F 4 "" H 8225 5500 50  0001 C CNN "Mfr"
	1    8225 5500
	1    0    0    -1  
$EndComp
$Comp
L power:GND #PWR069
U 1 1 5F83FB8A
P 8225 5750
AR Path="/5F2104BF/5F83FB8A" Ref="#PWR069"  Part="1" 
AR Path="/5F83FB8A" Ref="#PWR?"  Part="1" 
AR Path="/5F5F0002/5F83FB8A" Ref="#PWR?"  Part="1" 
AR Path="/5F5772D0/5F83FB8A" Ref="#PWR?"  Part="1" 
F 0 "#PWR069" H 8225 5500 50  0001 C CNN
F 1 "GND" H 8230 5585 39  0000 C CNN
F 2 "" H 8225 5750 50  0001 C CNN
F 3 "" H 8225 5750 50  0001 C CNN
	1    8225 5750
	1    0    0    -1  
$EndComp
Text Label 8225 4800 1    39   ~ 0
GRID
$Comp
L Device:R_Small R37
U 1 1 5F83FB92
P 7875 5500
AR Path="/5F2104BF/5F83FB92" Ref="R37"  Part="1" 
AR Path="/5F83FB92" Ref="R?"  Part="1" 
AR Path="/5F5F0002/5F83FB92" Ref="R?"  Part="1" 
AR Path="/5F5772D0/5F83FB92" Ref="R?"  Part="1" 
F 0 "R37" H 7934 5538 39  0000 L CNN
F 1 "180" H 7934 5463 39  0000 L CNN
F 2 "Resistor_SMD:R_0603_1608Metric" H 7875 5500 50  0001 C CNN
F 3 "~" H 7875 5500 50  0001 C CNN
F 4 "" H 7875 5500 50  0001 C CNN "Mfr"
	1    7875 5500
	1    0    0    -1  
$EndComp
Wire Wire Line
	8225 5750 8225 5600
Wire Wire Line
	7875 5750 7875 5600
$Comp
L power:+5V #PWR?
U 1 1 5F83FB9A
P 7875 4800
AR Path="/5F102375/5F83FB9A" Ref="#PWR?"  Part="1" 
AR Path="/5F2104BF/5F83FB9A" Ref="#PWR067"  Part="1" 
AR Path="/5F5772D0/5F83FB9A" Ref="#PWR?"  Part="1" 
F 0 "#PWR067" H 7875 4650 50  0001 C CNN
F 1 "+5V" H 7875 4975 39  0000 C CNN
F 2 "" H 7875 4800 50  0001 C CNN
F 3 "" H 7875 4800 50  0001 C CNN
	1    7875 4800
	1    0    0    -1  
$EndComp
Text Label 7875 5750 3    39   ~ 0
GAS
Wire Wire Line
	7175 5400 7175 5250
Wire Wire Line
	7525 5400 7525 5250
$Comp
L Device:LED D22
U 1 1 5F84AB01
P 7525 5100
AR Path="/5F2104BF/5F84AB01" Ref="D22"  Part="1" 
AR Path="/5F84AB01" Ref="D?"  Part="1" 
AR Path="/5F5F0002/5F84AB01" Ref="D?"  Part="1" 
AR Path="/5F496ED4/5F84AB01" Ref="D?"  Part="1" 
AR Path="/5F5772D0/5F84AB01" Ref="D?"  Part="1" 
F 0 "D22" V 7556 4982 39  0000 R CNN
F 1 "IN-S126AT5UW" V 7481 4982 39  0001 R CNN
F 2 "LED_SMD:LED_1206_3216Metric_Castellated" H 7525 5100 50  0001 C CNN
F 3 "http://inolux-corp.com/datasheet/SMDLED/Mono%20Color%20Top%20View/IN-S126AT%20Series_V1.0.pdf" H 7525 5100 50  0001 C CNN
	1    7525 5100
	0    1    -1   0   
$EndComp
$Comp
L Device:LED D20
U 1 1 5F84AB07
P 7175 5100
AR Path="/5F2104BF/5F84AB07" Ref="D20"  Part="1" 
AR Path="/5F84AB07" Ref="D?"  Part="1" 
AR Path="/5F5F0002/5F84AB07" Ref="D?"  Part="1" 
AR Path="/5F496ED4/5F84AB07" Ref="D?"  Part="1" 
AR Path="/5F5772D0/5F84AB07" Ref="D?"  Part="1" 
F 0 "D20" V 7206 4982 39  0000 R CNN
F 1 "IN-S126ATB " V 7131 4982 39  0001 R CNN
F 2 "LED_SMD:LED_1206_3216Metric_Castellated" H 7175 5100 50  0001 C CNN
F 3 "http://inolux-corp.com/datasheet/SMDLED/Mono%20Color%20Top%20View/IN-S126AT%20Series_V1.0.pdf" H 7175 5100 50  0001 C CNN
	1    7175 5100
	0    1    -1   0   
$EndComp
Wire Wire Line
	7175 4950 7175 4800
Wire Wire Line
	7525 4950 7525 4800
$Comp
L Device:R_Small R35
U 1 1 5F84AB10
P 7525 5500
AR Path="/5F2104BF/5F84AB10" Ref="R35"  Part="1" 
AR Path="/5F84AB10" Ref="R?"  Part="1" 
AR Path="/5F5F0002/5F84AB10" Ref="R?"  Part="1" 
AR Path="/5F5772D0/5F84AB10" Ref="R?"  Part="1" 
F 0 "R35" H 7584 5538 39  0000 L CNN
F 1 "180" H 7584 5463 39  0000 L CNN
F 2 "Resistor_SMD:R_0603_1608Metric" H 7525 5500 50  0001 C CNN
F 3 "~" H 7525 5500 50  0001 C CNN
F 4 "" H 7525 5500 50  0001 C CNN "Mfr"
	1    7525 5500
	1    0    0    -1  
$EndComp
$Comp
L power:GND #PWR065
U 1 1 5F84AB16
P 7525 5750
AR Path="/5F2104BF/5F84AB16" Ref="#PWR065"  Part="1" 
AR Path="/5F84AB16" Ref="#PWR?"  Part="1" 
AR Path="/5F5F0002/5F84AB16" Ref="#PWR?"  Part="1" 
AR Path="/5F5772D0/5F84AB16" Ref="#PWR?"  Part="1" 
F 0 "#PWR065" H 7525 5500 50  0001 C CNN
F 1 "GND" H 7530 5585 39  0000 C CNN
F 2 "" H 7525 5750 50  0001 C CNN
F 3 "" H 7525 5750 50  0001 C CNN
	1    7525 5750
	1    0    0    -1  
$EndComp
Text Label 7525 4800 1    39   ~ 0
GRID
$Comp
L Device:R_Small R33
U 1 1 5F84AB1E
P 7175 5500
AR Path="/5F2104BF/5F84AB1E" Ref="R33"  Part="1" 
AR Path="/5F84AB1E" Ref="R?"  Part="1" 
AR Path="/5F5F0002/5F84AB1E" Ref="R?"  Part="1" 
AR Path="/5F5772D0/5F84AB1E" Ref="R?"  Part="1" 
F 0 "R33" H 7234 5538 39  0000 L CNN
F 1 "180" H 7234 5463 39  0000 L CNN
F 2 "Resistor_SMD:R_0603_1608Metric" H 7175 5500 50  0001 C CNN
F 3 "~" H 7175 5500 50  0001 C CNN
F 4 "" H 7175 5500 50  0001 C CNN "Mfr"
	1    7175 5500
	1    0    0    -1  
$EndComp
Wire Wire Line
	7525 5750 7525 5600
Wire Wire Line
	7175 5750 7175 5600
$Comp
L power:+5V #PWR?
U 1 1 5F84AB26
P 7175 4800
AR Path="/5F102375/5F84AB26" Ref="#PWR?"  Part="1" 
AR Path="/5F2104BF/5F84AB26" Ref="#PWR063"  Part="1" 
AR Path="/5F5772D0/5F84AB26" Ref="#PWR?"  Part="1" 
F 0 "#PWR063" H 7175 4650 50  0001 C CNN
F 1 "+5V" H 7175 4975 39  0000 C CNN
F 2 "" H 7175 4800 50  0001 C CNN
F 3 "" H 7175 4800 50  0001 C CNN
	1    7175 4800
	1    0    0    -1  
$EndComp
Text Label 7175 5750 3    39   ~ 0
GAS
Wire Wire Line
	6475 5400 6475 5250
Wire Wire Line
	6825 5400 6825 5250
$Comp
L Device:LED D18
U 1 1 5F84AB2F
P 6825 5100
AR Path="/5F2104BF/5F84AB2F" Ref="D18"  Part="1" 
AR Path="/5F84AB2F" Ref="D?"  Part="1" 
AR Path="/5F5F0002/5F84AB2F" Ref="D?"  Part="1" 
AR Path="/5F496ED4/5F84AB2F" Ref="D?"  Part="1" 
AR Path="/5F5772D0/5F84AB2F" Ref="D?"  Part="1" 
F 0 "D18" V 6856 4982 39  0000 R CNN
F 1 "IN-S126AT5UW" V 6781 4982 39  0001 R CNN
F 2 "LED_SMD:LED_1206_3216Metric_Castellated" H 6825 5100 50  0001 C CNN
F 3 "http://inolux-corp.com/datasheet/SMDLED/Mono%20Color%20Top%20View/IN-S126AT%20Series_V1.0.pdf" H 6825 5100 50  0001 C CNN
	1    6825 5100
	0    1    -1   0   
$EndComp
$Comp
L Device:LED D16
U 1 1 5F84AB35
P 6475 5100
AR Path="/5F2104BF/5F84AB35" Ref="D16"  Part="1" 
AR Path="/5F84AB35" Ref="D?"  Part="1" 
AR Path="/5F5F0002/5F84AB35" Ref="D?"  Part="1" 
AR Path="/5F496ED4/5F84AB35" Ref="D?"  Part="1" 
AR Path="/5F5772D0/5F84AB35" Ref="D?"  Part="1" 
F 0 "D16" V 6506 4982 39  0000 R CNN
F 1 "IN-S126ATB " V 6431 4982 39  0001 R CNN
F 2 "LED_SMD:LED_1206_3216Metric_Castellated" H 6475 5100 50  0001 C CNN
F 3 "http://inolux-corp.com/datasheet/SMDLED/Mono%20Color%20Top%20View/IN-S126AT%20Series_V1.0.pdf" H 6475 5100 50  0001 C CNN
	1    6475 5100
	0    1    -1   0   
$EndComp
Wire Wire Line
	6475 4950 6475 4800
Wire Wire Line
	6825 4950 6825 4800
$Comp
L Device:R_Small R31
U 1 1 5F84AB3E
P 6825 5500
AR Path="/5F2104BF/5F84AB3E" Ref="R31"  Part="1" 
AR Path="/5F84AB3E" Ref="R?"  Part="1" 
AR Path="/5F5F0002/5F84AB3E" Ref="R?"  Part="1" 
AR Path="/5F5772D0/5F84AB3E" Ref="R?"  Part="1" 
F 0 "R31" H 6884 5538 39  0000 L CNN
F 1 "180" H 6884 5463 39  0000 L CNN
F 2 "Resistor_SMD:R_0603_1608Metric" H 6825 5500 50  0001 C CNN
F 3 "~" H 6825 5500 50  0001 C CNN
F 4 "" H 6825 5500 50  0001 C CNN "Mfr"
	1    6825 5500
	1    0    0    -1  
$EndComp
$Comp
L power:GND #PWR061
U 1 1 5F84AB44
P 6825 5750
AR Path="/5F2104BF/5F84AB44" Ref="#PWR061"  Part="1" 
AR Path="/5F84AB44" Ref="#PWR?"  Part="1" 
AR Path="/5F5F0002/5F84AB44" Ref="#PWR?"  Part="1" 
AR Path="/5F5772D0/5F84AB44" Ref="#PWR?"  Part="1" 
F 0 "#PWR061" H 6825 5500 50  0001 C CNN
F 1 "GND" H 6830 5585 39  0000 C CNN
F 2 "" H 6825 5750 50  0001 C CNN
F 3 "" H 6825 5750 50  0001 C CNN
	1    6825 5750
	1    0    0    -1  
$EndComp
Text Label 6825 4800 1    39   ~ 0
GRID
$Comp
L Device:R_Small R29
U 1 1 5F84AB4C
P 6475 5500
AR Path="/5F2104BF/5F84AB4C" Ref="R29"  Part="1" 
AR Path="/5F84AB4C" Ref="R?"  Part="1" 
AR Path="/5F5F0002/5F84AB4C" Ref="R?"  Part="1" 
AR Path="/5F5772D0/5F84AB4C" Ref="R?"  Part="1" 
F 0 "R29" H 6534 5538 39  0000 L CNN
F 1 "180" H 6534 5463 39  0000 L CNN
F 2 "Resistor_SMD:R_0603_1608Metric" H 6475 5500 50  0001 C CNN
F 3 "~" H 6475 5500 50  0001 C CNN
F 4 "" H 6475 5500 50  0001 C CNN "Mfr"
	1    6475 5500
	1    0    0    -1  
$EndComp
Wire Wire Line
	6825 5750 6825 5600
Wire Wire Line
	6475 5750 6475 5600
$Comp
L power:+5V #PWR?
U 1 1 5F84AB54
P 6475 4800
AR Path="/5F102375/5F84AB54" Ref="#PWR?"  Part="1" 
AR Path="/5F2104BF/5F84AB54" Ref="#PWR059"  Part="1" 
AR Path="/5F5772D0/5F84AB54" Ref="#PWR?"  Part="1" 
F 0 "#PWR059" H 6475 4650 50  0001 C CNN
F 1 "+5V" H 6475 4975 39  0000 C CNN
F 2 "" H 6475 4800 50  0001 C CNN
F 3 "" H 6475 4800 50  0001 C CNN
	1    6475 4800
	1    0    0    -1  
$EndComp
Text Label 6475 5750 3    39   ~ 0
GAS
Wire Wire Line
	5400 4425 5400 4275
$Comp
L Device:LED D9
U 1 1 5F89A972
P 5400 4125
AR Path="/5F2104BF/5F89A972" Ref="D9"  Part="1" 
AR Path="/5F89A972" Ref="D?"  Part="1" 
AR Path="/5F5F0002/5F89A972" Ref="D?"  Part="1" 
AR Path="/5F496ED4/5F89A972" Ref="D?"  Part="1" 
AR Path="/5F5772D0/5F89A972" Ref="D?"  Part="1" 
F 0 "D9" V 5431 4007 39  0000 R CNN
F 1 "IN-S126ATB " V 5356 4007 39  0001 R CNN
F 2 "LED_SMD:LED_1206_3216Metric_Castellated" H 5400 4125 50  0001 C CNN
F 3 "http://inolux-corp.com/datasheet/SMDLED/Mono%20Color%20Top%20View/IN-S126AT%20Series_V1.0.pdf" H 5400 4125 50  0001 C CNN
	1    5400 4125
	0    1    -1   0   
$EndComp
Wire Wire Line
	5400 3975 5400 3825
$Comp
L Device:R_Small R22
U 1 1 5F89A97A
P 5400 4525
AR Path="/5F2104BF/5F89A97A" Ref="R22"  Part="1" 
AR Path="/5F89A97A" Ref="R?"  Part="1" 
AR Path="/5F5F0002/5F89A97A" Ref="R?"  Part="1" 
AR Path="/5F5772D0/5F89A97A" Ref="R?"  Part="1" 
F 0 "R22" H 5459 4563 39  0000 L CNN
F 1 "180" H 5459 4488 39  0000 L CNN
F 2 "Resistor_SMD:R_0603_1608Metric" H 5400 4525 50  0001 C CNN
F 3 "~" H 5400 4525 50  0001 C CNN
F 4 "" H 5400 4525 50  0001 C CNN "Mfr"
	1    5400 4525
	1    0    0    -1  
$EndComp
Wire Wire Line
	5400 4775 5400 4625
$Comp
L power:+5V #PWR?
U 1 1 5F89A981
P 5400 3825
AR Path="/5F102375/5F89A981" Ref="#PWR?"  Part="1" 
AR Path="/5F2104BF/5F89A981" Ref="#PWR052"  Part="1" 
AR Path="/5F5772D0/5F89A981" Ref="#PWR?"  Part="1" 
F 0 "#PWR052" H 5400 3675 50  0001 C CNN
F 1 "+5V" H 5400 4000 39  0000 C CNN
F 2 "" H 5400 3825 50  0001 C CNN
F 3 "" H 5400 3825 50  0001 C CNN
	1    5400 3825
	1    0    0    -1  
$EndComp
Text Label 5400 4775 3    39   ~ 0
GAS
Wire Wire Line
	5400 5675 5400 5525
$Comp
L Device:LED D10
U 1 1 5F89A989
P 5400 5375
AR Path="/5F2104BF/5F89A989" Ref="D10"  Part="1" 
AR Path="/5F89A989" Ref="D?"  Part="1" 
AR Path="/5F5F0002/5F89A989" Ref="D?"  Part="1" 
AR Path="/5F496ED4/5F89A989" Ref="D?"  Part="1" 
AR Path="/5F5772D0/5F89A989" Ref="D?"  Part="1" 
F 0 "D10" V 5431 5257 39  0000 R CNN
F 1 "IN-S126AT5UW" V 5356 5257 39  0001 R CNN
F 2 "LED_SMD:LED_1206_3216Metric_Castellated" H 5400 5375 50  0001 C CNN
F 3 "http://inolux-corp.com/datasheet/SMDLED/Mono%20Color%20Top%20View/IN-S126AT%20Series_V1.0.pdf" H 5400 5375 50  0001 C CNN
	1    5400 5375
	0    1    -1   0   
$EndComp
Wire Wire Line
	5400 5225 5400 5075
$Comp
L Device:R_Small R23
U 1 1 5F89A991
P 5400 5775
AR Path="/5F2104BF/5F89A991" Ref="R23"  Part="1" 
AR Path="/5F89A991" Ref="R?"  Part="1" 
AR Path="/5F5F0002/5F89A991" Ref="R?"  Part="1" 
AR Path="/5F5772D0/5F89A991" Ref="R?"  Part="1" 
F 0 "R23" H 5459 5813 39  0000 L CNN
F 1 "180" H 5459 5738 39  0000 L CNN
F 2 "Resistor_SMD:R_0603_1608Metric" H 5400 5775 50  0001 C CNN
F 3 "~" H 5400 5775 50  0001 C CNN
F 4 "" H 5400 5775 50  0001 C CNN "Mfr"
	1    5400 5775
	1    0    0    -1  
$EndComp
$Comp
L power:GND #PWR053
U 1 1 5F89A997
P 5400 6025
AR Path="/5F2104BF/5F89A997" Ref="#PWR053"  Part="1" 
AR Path="/5F89A997" Ref="#PWR?"  Part="1" 
AR Path="/5F5F0002/5F89A997" Ref="#PWR?"  Part="1" 
AR Path="/5F5772D0/5F89A997" Ref="#PWR?"  Part="1" 
F 0 "#PWR053" H 5400 5775 50  0001 C CNN
F 1 "GND" H 5405 5860 39  0000 C CNN
F 2 "" H 5400 6025 50  0001 C CNN
F 3 "" H 5400 6025 50  0001 C CNN
	1    5400 6025
	1    0    0    -1  
$EndComp
Text Label 5400 5075 1    39   ~ 0
GRID
Wire Wire Line
	5400 6025 5400 5875
Wire Wire Line
	5050 4425 5050 4275
$Comp
L Device:LED D6
U 1 1 5F8A4FF1
P 5050 4125
AR Path="/5F2104BF/5F8A4FF1" Ref="D6"  Part="1" 
AR Path="/5F8A4FF1" Ref="D?"  Part="1" 
AR Path="/5F5F0002/5F8A4FF1" Ref="D?"  Part="1" 
AR Path="/5F496ED4/5F8A4FF1" Ref="D?"  Part="1" 
AR Path="/5F5772D0/5F8A4FF1" Ref="D?"  Part="1" 
F 0 "D6" V 5081 4007 39  0000 R CNN
F 1 "IN-S126ATB " V 5006 4007 39  0001 R CNN
F 2 "LED_SMD:LED_1206_3216Metric_Castellated" H 5050 4125 50  0001 C CNN
F 3 "http://inolux-corp.com/datasheet/SMDLED/Mono%20Color%20Top%20View/IN-S126AT%20Series_V1.0.pdf" H 5050 4125 50  0001 C CNN
	1    5050 4125
	0    1    -1   0   
$EndComp
Wire Wire Line
	5050 3975 5050 3825
$Comp
L Device:R_Small R19
U 1 1 5F8A4FF9
P 5050 4525
AR Path="/5F2104BF/5F8A4FF9" Ref="R19"  Part="1" 
AR Path="/5F8A4FF9" Ref="R?"  Part="1" 
AR Path="/5F5F0002/5F8A4FF9" Ref="R?"  Part="1" 
AR Path="/5F5772D0/5F8A4FF9" Ref="R?"  Part="1" 
F 0 "R19" H 5109 4563 39  0000 L CNN
F 1 "180" H 5109 4488 39  0000 L CNN
F 2 "Resistor_SMD:R_0603_1608Metric" H 5050 4525 50  0001 C CNN
F 3 "~" H 5050 4525 50  0001 C CNN
F 4 "" H 5050 4525 50  0001 C CNN "Mfr"
	1    5050 4525
	1    0    0    -1  
$EndComp
Wire Wire Line
	5050 4775 5050 4625
$Comp
L power:+5V #PWR?
U 1 1 5F8A5000
P 5050 3825
AR Path="/5F102375/5F8A5000" Ref="#PWR?"  Part="1" 
AR Path="/5F2104BF/5F8A5000" Ref="#PWR049"  Part="1" 
AR Path="/5F5772D0/5F8A5000" Ref="#PWR?"  Part="1" 
F 0 "#PWR049" H 5050 3675 50  0001 C CNN
F 1 "+5V" H 5050 4000 39  0000 C CNN
F 2 "" H 5050 3825 50  0001 C CNN
F 3 "" H 5050 3825 50  0001 C CNN
	1    5050 3825
	1    0    0    -1  
$EndComp
Text Label 5050 4775 3    39   ~ 0
GAS
Wire Wire Line
	5050 5675 5050 5525
$Comp
L Device:LED D7
U 1 1 5F8A5008
P 5050 5375
AR Path="/5F2104BF/5F8A5008" Ref="D7"  Part="1" 
AR Path="/5F8A5008" Ref="D?"  Part="1" 
AR Path="/5F5F0002/5F8A5008" Ref="D?"  Part="1" 
AR Path="/5F496ED4/5F8A5008" Ref="D?"  Part="1" 
AR Path="/5F5772D0/5F8A5008" Ref="D?"  Part="1" 
F 0 "D7" V 5081 5257 39  0000 R CNN
F 1 "IN-S126AT5UW" V 5006 5257 39  0001 R CNN
F 2 "LED_SMD:LED_1206_3216Metric_Castellated" H 5050 5375 50  0001 C CNN
F 3 "http://inolux-corp.com/datasheet/SMDLED/Mono%20Color%20Top%20View/IN-S126AT%20Series_V1.0.pdf" H 5050 5375 50  0001 C CNN
	1    5050 5375
	0    1    -1   0   
$EndComp
Wire Wire Line
	5050 5225 5050 5075
$Comp
L Device:R_Small R20
U 1 1 5F8A5010
P 5050 5775
AR Path="/5F2104BF/5F8A5010" Ref="R20"  Part="1" 
AR Path="/5F8A5010" Ref="R?"  Part="1" 
AR Path="/5F5F0002/5F8A5010" Ref="R?"  Part="1" 
AR Path="/5F5772D0/5F8A5010" Ref="R?"  Part="1" 
F 0 "R20" H 5109 5813 39  0000 L CNN
F 1 "180" H 5109 5738 39  0000 L CNN
F 2 "Resistor_SMD:R_0603_1608Metric" H 5050 5775 50  0001 C CNN
F 3 "~" H 5050 5775 50  0001 C CNN
F 4 "" H 5050 5775 50  0001 C CNN "Mfr"
	1    5050 5775
	1    0    0    -1  
$EndComp
$Comp
L power:GND #PWR050
U 1 1 5F8A5016
P 5050 6025
AR Path="/5F2104BF/5F8A5016" Ref="#PWR050"  Part="1" 
AR Path="/5F8A5016" Ref="#PWR?"  Part="1" 
AR Path="/5F5F0002/5F8A5016" Ref="#PWR?"  Part="1" 
AR Path="/5F5772D0/5F8A5016" Ref="#PWR?"  Part="1" 
F 0 "#PWR050" H 5050 5775 50  0001 C CNN
F 1 "GND" H 5055 5860 39  0000 C CNN
F 2 "" H 5050 6025 50  0001 C CNN
F 3 "" H 5050 6025 50  0001 C CNN
	1    5050 6025
	1    0    0    -1  
$EndComp
Text Label 5050 5075 1    39   ~ 0
GRID
Wire Wire Line
	5050 6025 5050 5875
$Comp
L Device:LED D29
U 1 1 5F738C21
P 8925 5100
AR Path="/5F2104BF/5F738C21" Ref="D29"  Part="1" 
AR Path="/5F738C21" Ref="D?"  Part="1" 
AR Path="/5F5F0002/5F738C21" Ref="D?"  Part="1" 
AR Path="/5F496ED4/5F738C21" Ref="D?"  Part="1" 
AR Path="/5F5772D0/5F738C21" Ref="D?"  Part="1" 
F 0 "D29" V 8956 4982 39  0000 R CNN
F 1 "IN-S126AT5UW" V 8825 5650 39  0001 R CNN
F 2 "LED_SMD:LED_1206_3216Metric_Castellated" H 8925 5100 50  0001 C CNN
F 3 "http://inolux-corp.com/datasheet/SMDLED/Mono%20Color%20Top%20View/IN-S126AT%20Series_V1.0.pdf" H 8925 5100 50  0001 C CNN
	1    8925 5100
	0    1    -1   0   
$EndComp
Text Label 5750 4775 3    39   ~ 0
GAS
$Comp
L power:+5V #PWR?
U 1 1 5F867BF2
P 5750 3825
AR Path="/5F102375/5F867BF2" Ref="#PWR?"  Part="1" 
AR Path="/5F2104BF/5F867BF2" Ref="#PWR055"  Part="1" 
AR Path="/5F5772D0/5F867BF2" Ref="#PWR?"  Part="1" 
F 0 "#PWR055" H 5750 3675 50  0001 C CNN
F 1 "+5V" H 5750 4000 39  0000 C CNN
F 2 "" H 5750 3825 50  0001 C CNN
F 3 "" H 5750 3825 50  0001 C CNN
	1    5750 3825
	1    0    0    -1  
$EndComp
Wire Wire Line
	5750 4775 5750 4625
$Comp
L Device:R_Small R25
U 1 1 5F867BEB
P 5750 4525
AR Path="/5F2104BF/5F867BEB" Ref="R25"  Part="1" 
AR Path="/5F867BEB" Ref="R?"  Part="1" 
AR Path="/5F5F0002/5F867BEB" Ref="R?"  Part="1" 
AR Path="/5F5772D0/5F867BEB" Ref="R?"  Part="1" 
F 0 "R25" H 5809 4563 39  0000 L CNN
F 1 "180" H 5809 4488 39  0000 L CNN
F 2 "Resistor_SMD:R_0603_1608Metric" H 5750 4525 50  0001 C CNN
F 3 "~" H 5750 4525 50  0001 C CNN
F 4 "" H 5750 4525 50  0001 C CNN "Mfr"
	1    5750 4525
	1    0    0    -1  
$EndComp
Wire Wire Line
	5750 3975 5750 3825
$Comp
L Device:LED D12
U 1 1 5F867BE3
P 5750 4125
AR Path="/5F2104BF/5F867BE3" Ref="D12"  Part="1" 
AR Path="/5F867BE3" Ref="D?"  Part="1" 
AR Path="/5F5F0002/5F867BE3" Ref="D?"  Part="1" 
AR Path="/5F496ED4/5F867BE3" Ref="D?"  Part="1" 
AR Path="/5F5772D0/5F867BE3" Ref="D?"  Part="1" 
F 0 "D12" V 5781 4007 39  0000 R CNN
F 1 "IN-S126ATB " V 5675 4600 39  0000 R CNN
F 2 "LED_SMD:LED_1206_3216Metric_Castellated" H 5750 4125 50  0001 C CNN
F 3 "http://inolux-corp.com/datasheet/SMDLED/Mono%20Color%20Top%20View/IN-S126AT%20Series_V1.0.pdf" H 5750 4125 50  0001 C CNN
	1    5750 4125
	0    1    -1   0   
$EndComp
Wire Wire Line
	5750 4425 5750 4275
Text Notes 5825 4175 0    39   ~ 0
Blue LED\nVf = 3.1 V @ If = 10 mA
Wire Wire Line
	9250 5400 9250 5250
Wire Wire Line
	9600 5400 9600 5250
$Comp
L Device:LED D41
U 1 1 5F6561FE
P 9250 5100
AR Path="/5F2104BF/5F6561FE" Ref="D41"  Part="1" 
AR Path="/5F6561FE" Ref="D?"  Part="1" 
AR Path="/5F5F0002/5F6561FE" Ref="D?"  Part="1" 
AR Path="/5F496ED4/5F6561FE" Ref="D?"  Part="1" 
AR Path="/5F5772D0/5F6561FE" Ref="D?"  Part="1" 
F 0 "D41" V 9281 4982 39  0000 R CNN
F 1 "IN-S126ATB " V 9206 4982 39  0001 R CNN
F 2 "LED_SMD:LED_1206_3216Metric_Castellated" H 9250 5100 50  0001 C CNN
F 3 "http://inolux-corp.com/datasheet/SMDLED/Mono%20Color%20Top%20View/IN-S126AT%20Series_V1.0.pdf" H 9250 5100 50  0001 C CNN
	1    9250 5100
	0    1    -1   0   
$EndComp
Wire Wire Line
	9250 4950 9250 4800
Wire Wire Line
	9600 4950 9600 4800
$Comp
L Device:R_Small R90
U 1 1 5F656207
P 9600 5500
AR Path="/5F2104BF/5F656207" Ref="R90"  Part="1" 
AR Path="/5F656207" Ref="R?"  Part="1" 
AR Path="/5F5F0002/5F656207" Ref="R?"  Part="1" 
AR Path="/5F5772D0/5F656207" Ref="R?"  Part="1" 
F 0 "R90" H 9659 5538 39  0000 L CNN
F 1 "180" H 9659 5463 39  0000 L CNN
F 2 "Resistor_SMD:R_0603_1608Metric" H 9600 5500 50  0001 C CNN
F 3 "~" H 9600 5500 50  0001 C CNN
F 4 "" H 9600 5500 50  0001 C CNN "Mfr"
	1    9600 5500
	1    0    0    -1  
$EndComp
$Comp
L power:GND #PWR0120
U 1 1 5F65620D
P 9600 5750
AR Path="/5F2104BF/5F65620D" Ref="#PWR0120"  Part="1" 
AR Path="/5F65620D" Ref="#PWR?"  Part="1" 
AR Path="/5F5F0002/5F65620D" Ref="#PWR?"  Part="1" 
AR Path="/5F5772D0/5F65620D" Ref="#PWR?"  Part="1" 
F 0 "#PWR0120" H 9600 5500 50  0001 C CNN
F 1 "GND" H 9605 5585 39  0000 C CNN
F 2 "" H 9600 5750 50  0001 C CNN
F 3 "" H 9600 5750 50  0001 C CNN
	1    9600 5750
	1    0    0    -1  
$EndComp
Text Label 9600 4800 1    39   ~ 0
GRID
$Comp
L Device:R_Small R89
U 1 1 5F656215
P 9250 5500
AR Path="/5F2104BF/5F656215" Ref="R89"  Part="1" 
AR Path="/5F656215" Ref="R?"  Part="1" 
AR Path="/5F5F0002/5F656215" Ref="R?"  Part="1" 
AR Path="/5F5772D0/5F656215" Ref="R?"  Part="1" 
F 0 "R89" H 9309 5538 39  0000 L CNN
F 1 "180" H 9309 5463 39  0000 L CNN
F 2 "Resistor_SMD:R_0603_1608Metric" H 9250 5500 50  0001 C CNN
F 3 "~" H 9250 5500 50  0001 C CNN
F 4 "" H 9250 5500 50  0001 C CNN "Mfr"
	1    9250 5500
	1    0    0    -1  
$EndComp
Wire Wire Line
	9600 5750 9600 5600
Wire Wire Line
	9250 5750 9250 5600
$Comp
L power:+5V #PWR?
U 1 1 5F65621D
P 9250 4800
AR Path="/5F102375/5F65621D" Ref="#PWR?"  Part="1" 
AR Path="/5F2104BF/5F65621D" Ref="#PWR0121"  Part="1" 
AR Path="/5F5772D0/5F65621D" Ref="#PWR?"  Part="1" 
F 0 "#PWR0121" H 9250 4650 50  0001 C CNN
F 1 "+5V" H 9250 4975 39  0000 C CNN
F 2 "" H 9250 4800 50  0001 C CNN
F 3 "" H 9250 4800 50  0001 C CNN
	1    9250 4800
	1    0    0    -1  
$EndComp
Text Label 9250 5750 3    39   ~ 0
GAS
$Comp
L Device:LED D42
U 1 1 5F656252
P 9600 5100
AR Path="/5F2104BF/5F656252" Ref="D42"  Part="1" 
AR Path="/5F656252" Ref="D?"  Part="1" 
AR Path="/5F5F0002/5F656252" Ref="D?"  Part="1" 
AR Path="/5F496ED4/5F656252" Ref="D?"  Part="1" 
AR Path="/5F5772D0/5F656252" Ref="D?"  Part="1" 
F 0 "D42" V 9631 4982 39  0000 R CNN
F 1 "IN-S126AT5UW" V 9500 5650 39  0000 R CNN
F 2 "LED_SMD:LED_1206_3216Metric_Castellated" H 9600 5100 50  0001 C CNN
F 3 "http://inolux-corp.com/datasheet/SMDLED/Mono%20Color%20Top%20View/IN-S126AT%20Series_V1.0.pdf" H 9600 5100 50  0001 C CNN
	1    9600 5100
	0    1    -1   0   
$EndComp
$EndSCHEMATC
