EESchema Schematic File Version 4
EELAYER 30 0
EELAYER END
$Descr A4 11693 8268
encoding utf-8
Sheet 2 6
Title "Sub Server LED"
Date "2020-07-02"
Rev "1.0"
Comp "EON ERC"
Comment1 "Designer: D. Wienands, S. Melcher, L. Jeske, D. Moll"
Comment2 "Supervisor: C. Guarnieri"
Comment3 ""
Comment4 ""
$EndDescr
Wire Wire Line
	3550 3600 3500 3600
$Comp
L power:GND #PWR?
U 1 1 5F19B2AE
P 3500 3950
AR Path="/5F133236/5F19B2AE" Ref="#PWR?"  Part="1" 
AR Path="/5F1207D0/5F19B2AE" Ref="#PWR?"  Part="1" 
F 0 "#PWR?" H 3500 3700 50  0001 C CNN
F 1 "GND" H 3505 3777 39  0000 C CNN
F 2 "" H 3500 3950 50  0001 C CNN
F 3 "" H 3500 3950 50  0001 C CNN
	1    3500 3950
	1    0    0    -1  
$EndComp
Wire Wire Line
	3500 3900 3500 3950
Wire Wire Line
	3850 3900 3500 3900
Connection ~ 3500 3900
Connection ~ 3500 3600
$Comp
L Device:LED D?
U 1 1 5F19B2B8
P 3500 3150
AR Path="/5F133236/5F19B2B8" Ref="D?"  Part="1" 
AR Path="/5F1207D0/5F19B2B8" Ref="D?"  Part="1" 
F 0 "D?" V 3539 3033 50  0000 R CNN
F 1 "BU" V 3448 3033 50  0000 R CNN
F 2 "" H 3500 3150 50  0001 C CNN
F 3 "~" H 3500 3150 50  0001 C CNN
	1    3500 3150
	0    -1   -1   0   
$EndComp
$Comp
L Device:LED D?
U 1 1 5F19B2BE
P 3850 3150
AR Path="/5F133236/5F19B2BE" Ref="D?"  Part="1" 
AR Path="/5F1207D0/5F19B2BE" Ref="D?"  Part="1" 
F 0 "D?" V 3889 3033 50  0000 R CNN
F 1 "BU" V 3798 3033 50  0000 R CNN
F 2 "" H 3850 3150 50  0001 C CNN
F 3 "~" H 3850 3150 50  0001 C CNN
	1    3850 3150
	0    -1   -1   0   
$EndComp
$Comp
L power:+5V #PWR?
U 1 1 5F19B2C4
P 3150 2700
AR Path="/5F19B2C4" Ref="#PWR?"  Part="1" 
AR Path="/5ECB7EC7/5F19B2C4" Ref="#PWR?"  Part="1" 
AR Path="/5EF6437F/5F19B2C4" Ref="#PWR?"  Part="1" 
AR Path="/5EF831DD/5F19B2C4" Ref="#PWR?"  Part="1" 
AR Path="/5F133236/5F19B2C4" Ref="#PWR?"  Part="1" 
AR Path="/5F1207D0/5F19B2C4" Ref="#PWR?"  Part="1" 
F 0 "#PWR?" H 3150 2550 50  0001 C CNN
F 1 "+5V" H 3165 2873 39  0000 C CNN
F 2 "" H 3150 2700 50  0001 C CNN
F 3 "" H 3150 2700 50  0001 C CNN
	1    3150 2700
	1    0    0    -1  
$EndComp
$Comp
L Device:R_Small R?
U 1 1 5F19B2CA
P 3150 2800
AR Path="/5F133236/5F19B2CA" Ref="R?"  Part="1" 
AR Path="/5F1207D0/5F19B2CA" Ref="R?"  Part="1" 
F 0 "R?" H 3209 2846 50  0000 L CNN
F 1 "R_Small" H 3209 2755 50  0000 L CNN
F 2 "Resistor_SMD:R_0603_1608Metric" H 3150 2800 50  0001 C CNN
F 3 "~" H 3150 2800 50  0001 C CNN
	1    3150 2800
	1    0    0    -1  
$EndComp
Wire Wire Line
	3150 2900 3150 2950
Wire Wire Line
	3500 3600 3500 3650
Wire Wire Line
	3500 3850 3500 3900
Wire Wire Line
	3850 3800 3850 3900
$Comp
L Device:R_Small R?
U 1 1 5F19B2D4
P 3500 3750
AR Path="/5F133236/5F19B2D4" Ref="R?"  Part="1" 
AR Path="/5F1207D0/5F19B2D4" Ref="R?"  Part="1" 
F 0 "R?" H 3559 3796 50  0000 L CNN
F 1 "10k" H 3559 3705 50  0000 L CNN
F 2 "Resistor_SMD:R_0603_1608Metric" H 3500 3750 50  0001 C CNN
F 3 "~" H 3500 3750 50  0001 C CNN
	1    3500 3750
	1    0    0    -1  
$EndComp
Wire Wire Line
	3850 3000 3850 2950
Wire Wire Line
	3850 2950 3500 2950
Connection ~ 3150 2950
Wire Wire Line
	3150 2950 3150 3000
Wire Wire Line
	3500 3000 3500 2950
Connection ~ 3500 2950
Wire Wire Line
	3500 2950 3150 2950
Wire Wire Line
	3150 3350 3500 3350
Wire Wire Line
	3850 3350 3850 3300
Wire Wire Line
	3500 3350 3500 3300
Connection ~ 3500 3350
Wire Wire Line
	3500 3350 3850 3350
Wire Wire Line
	3150 3350 3150 3300
Wire Wire Line
	3850 3400 3850 3350
Connection ~ 3850 3350
Text HLabel 3100 3600 0    39   Input ~ 0
LED_Server_front
Wire Wire Line
	3100 3600 3500 3600
$Comp
L Device:Q_NMOS_GSD Q?
U 1 1 5F19B2F1
P 3750 3600
AR Path="/5EF380A1/5F19B2F1" Ref="Q?"  Part="1" 
AR Path="/5F1207D0/5F19B2F1" Ref="Q?"  Part="1" 
AR Path="/5F133236/5F19B2F1" Ref="Q?"  Part="1" 
F 0 "Q?" H 3954 3646 39  0000 L CNN
F 1 "2N7002NXA" H 3954 3555 39  0000 L CNN
F 2 "Package_TO_SOT_SMD:SOT-23" H 3950 3700 50  0001 C CNN
F 3 "https://eu.mouser.com/datasheet/2/916/2N7002NXAK-1651343.pdf" H 3750 3600 50  0001 C CNN
	1    3750 3600
	1    0    0    -1  
$EndComp
$Comp
L Device:LED D?
U 1 1 5F19D2AE
P 5550 3150
AR Path="/5F133236/5F19D2AE" Ref="D?"  Part="1" 
AR Path="/5F1207D0/5F19D2AE" Ref="D?"  Part="1" 
F 0 "D?" V 5589 3033 50  0000 R CNN
F 1 "BU" V 5498 3033 50  0000 R CNN
F 2 "" H 5550 3150 50  0001 C CNN
F 3 "~" H 5550 3150 50  0001 C CNN
	1    5550 3150
	0    -1   -1   0   
$EndComp
Wire Wire Line
	5950 3600 5900 3600
$Comp
L power:GND #PWR?
U 1 1 5F19D2B5
P 5900 3950
AR Path="/5F133236/5F19D2B5" Ref="#PWR?"  Part="1" 
AR Path="/5F1207D0/5F19D2B5" Ref="#PWR?"  Part="1" 
F 0 "#PWR?" H 5900 3700 50  0001 C CNN
F 1 "GND" H 5905 3777 39  0000 C CNN
F 2 "" H 5900 3950 50  0001 C CNN
F 3 "" H 5900 3950 50  0001 C CNN
	1    5900 3950
	1    0    0    -1  
$EndComp
Wire Wire Line
	5900 3900 5900 3950
Wire Wire Line
	6250 3900 5900 3900
Connection ~ 5900 3900
Connection ~ 5900 3600
$Comp
L Device:LED D?
U 1 1 5F19D2BF
P 5900 3150
AR Path="/5F133236/5F19D2BF" Ref="D?"  Part="1" 
AR Path="/5F1207D0/5F19D2BF" Ref="D?"  Part="1" 
F 0 "D?" V 5939 3033 50  0000 R CNN
F 1 "BU" V 5848 3033 50  0000 R CNN
F 2 "" H 5900 3150 50  0001 C CNN
F 3 "~" H 5900 3150 50  0001 C CNN
	1    5900 3150
	0    -1   -1   0   
$EndComp
$Comp
L Device:LED D?
U 1 1 5F19D2C5
P 6250 3150
AR Path="/5F133236/5F19D2C5" Ref="D?"  Part="1" 
AR Path="/5F1207D0/5F19D2C5" Ref="D?"  Part="1" 
F 0 "D?" V 6289 3033 50  0000 R CNN
F 1 "BU" V 6198 3033 50  0000 R CNN
F 2 "" H 6250 3150 50  0001 C CNN
F 3 "~" H 6250 3150 50  0001 C CNN
	1    6250 3150
	0    -1   -1   0   
$EndComp
$Comp
L power:+5V #PWR?
U 1 1 5F19D2CB
P 5550 2700
AR Path="/5F19D2CB" Ref="#PWR?"  Part="1" 
AR Path="/5ECB7EC7/5F19D2CB" Ref="#PWR?"  Part="1" 
AR Path="/5EF6437F/5F19D2CB" Ref="#PWR?"  Part="1" 
AR Path="/5EF831DD/5F19D2CB" Ref="#PWR?"  Part="1" 
AR Path="/5F133236/5F19D2CB" Ref="#PWR?"  Part="1" 
AR Path="/5F1207D0/5F19D2CB" Ref="#PWR?"  Part="1" 
F 0 "#PWR?" H 5550 2550 50  0001 C CNN
F 1 "+5V" H 5565 2873 39  0000 C CNN
F 2 "" H 5550 2700 50  0001 C CNN
F 3 "" H 5550 2700 50  0001 C CNN
	1    5550 2700
	1    0    0    -1  
$EndComp
$Comp
L Device:R_Small R?
U 1 1 5F19D2D1
P 5550 2800
AR Path="/5F133236/5F19D2D1" Ref="R?"  Part="1" 
AR Path="/5F1207D0/5F19D2D1" Ref="R?"  Part="1" 
F 0 "R?" H 5609 2846 50  0000 L CNN
F 1 "R_Small" H 5609 2755 50  0000 L CNN
F 2 "Resistor_SMD:R_0603_1608Metric" H 5550 2800 50  0001 C CNN
F 3 "~" H 5550 2800 50  0001 C CNN
	1    5550 2800
	1    0    0    -1  
$EndComp
Wire Wire Line
	5550 2900 5550 2950
Wire Wire Line
	5900 3600 5900 3650
Wire Wire Line
	5900 3850 5900 3900
Wire Wire Line
	6250 3800 6250 3900
$Comp
L Device:R_Small R?
U 1 1 5F19D2DB
P 5900 3750
AR Path="/5F133236/5F19D2DB" Ref="R?"  Part="1" 
AR Path="/5F1207D0/5F19D2DB" Ref="R?"  Part="1" 
F 0 "R?" H 5959 3796 50  0000 L CNN
F 1 "10k" H 5959 3705 50  0000 L CNN
F 2 "Resistor_SMD:R_0603_1608Metric" H 5900 3750 50  0001 C CNN
F 3 "~" H 5900 3750 50  0001 C CNN
	1    5900 3750
	1    0    0    -1  
$EndComp
Wire Wire Line
	6250 3000 6250 2950
Wire Wire Line
	6250 2950 5900 2950
Connection ~ 5550 2950
Wire Wire Line
	5550 2950 5550 3000
Wire Wire Line
	5900 3000 5900 2950
Connection ~ 5900 2950
Wire Wire Line
	5900 2950 5550 2950
Wire Wire Line
	5550 3350 5900 3350
Wire Wire Line
	6250 3350 6250 3300
Wire Wire Line
	5900 3350 5900 3300
Connection ~ 5900 3350
Wire Wire Line
	5900 3350 6250 3350
Wire Wire Line
	5550 3350 5550 3300
Wire Wire Line
	6250 3400 6250 3350
Connection ~ 6250 3350
Text HLabel 5500 3600 0    39   Input ~ 0
LED_Server_back
Wire Wire Line
	5500 3600 5900 3600
$Comp
L Device:Q_NMOS_GSD Q?
U 1 1 5F19D2F8
P 6150 3600
AR Path="/5EF380A1/5F19D2F8" Ref="Q?"  Part="1" 
AR Path="/5F1207D0/5F19D2F8" Ref="Q?"  Part="1" 
AR Path="/5F133236/5F19D2F8" Ref="Q?"  Part="1" 
F 0 "Q?" H 6354 3646 39  0000 L CNN
F 1 "2N7002NXA" H 6354 3555 39  0000 L CNN
F 2 "Package_TO_SOT_SMD:SOT-23" H 6350 3700 50  0001 C CNN
F 3 "https://eu.mouser.com/datasheet/2/916/2N7002NXAK-1651343.pdf" H 6150 3600 50  0001 C CNN
	1    6150 3600
	1    0    0    -1  
$EndComp
$Comp
L Device:LED D?
U 1 1 5F19B2A7
P 3150 3150
AR Path="/5F133236/5F19B2A7" Ref="D?"  Part="1" 
AR Path="/5F1207D0/5F19B2A7" Ref="D?"  Part="1" 
F 0 "D?" V 3189 3033 50  0000 R CNN
F 1 "BU" V 3098 3033 50  0000 R CNN
F 2 "" H 3150 3150 50  0001 C CNN
F 3 "~" H 3150 3150 50  0001 C CNN
	1    3150 3150
	0    -1   -1   0   
$EndComp
$EndSCHEMATC
