EESchema Schematic File Version 4
EELAYER 30 0
EELAYER END
$Descr A4 11693 8268
encoding utf-8
Sheet 6 7
Title "Monitor"
Date "2020-10-08"
Rev "1.1"
Comp "Institute for Automation of Complex Power Systems - E.ON ERC - RWTH Aachen University"
Comment1 "Designer: D. Wienands, S. Melcher, L. Jeske, D. Moll"
Comment2 "Supervisor: C. Guarnieri Calò Carducci"
Comment3 ""
Comment4 ""
$EndDescr
Text HLabel 2750 2975 0    39   Input ~ 0
MON
Wire Wire Line
	2900 2225 3075 2225
Wire Wire Line
	2900 2975 2750 2975
Wire Wire Line
	2900 2225 2900 2975
Text Notes 3575 2625 0    39   ~ 0
Voltage to PWM\nConverter at 1khZ\n
Text Label 3900 2225 0    39   ~ 0
PWM
Wire Wire Line
	950  1700 950  1625
Wire Wire Line
	3025 2525 3025 2575
Wire Wire Line
	3475 2525 3475 2575
$Comp
L power:GND #PWR?
U 1 1 5F5A9C84
P 3475 2575
AR Path="/5F2104BF/5F5A9C84" Ref="#PWR?"  Part="1" 
AR Path="/5F5A9C84" Ref="#PWR?"  Part="1" 
AR Path="/5F5F0002/5F5A9C84" Ref="#PWR?"  Part="1" 
AR Path="/5F0586F7/5F5A9C84" Ref="#PWR?"  Part="1" 
AR Path="/5F51B236/5F5A9C84" Ref="#PWR050"  Part="1" 
F 0 "#PWR050" H 3475 2325 50  0001 C CNN
F 1 "GND" H 3480 2410 39  0000 C CNN
F 2 "" H 3475 2575 50  0001 C CNN
F 3 "" H 3475 2575 50  0001 C CNN
	1    3475 2575
	1    0    0    -1  
$EndComp
$Comp
L power:GND #PWR?
U 1 1 5F5A9C8A
P 3025 2575
AR Path="/5F2104BF/5F5A9C8A" Ref="#PWR?"  Part="1" 
AR Path="/5F5A9C8A" Ref="#PWR?"  Part="1" 
AR Path="/5F5F0002/5F5A9C8A" Ref="#PWR?"  Part="1" 
AR Path="/5F0586F7/5F5A9C8A" Ref="#PWR?"  Part="1" 
AR Path="/5F51B236/5F5A9C8A" Ref="#PWR047"  Part="1" 
F 0 "#PWR047" H 3025 2325 50  0001 C CNN
F 1 "GND" H 3030 2410 39  0000 C CNN
F 2 "" H 3025 2575 50  0001 C CNN
F 3 "" H 3025 2575 50  0001 C CNN
	1    3025 2575
	1    0    0    -1  
$EndComp
$Comp
L power:GND #PWR?
U 1 1 5F5A9C90
P 950 1625
AR Path="/5F2104BF/5F5A9C90" Ref="#PWR?"  Part="1" 
AR Path="/5F5A9C90" Ref="#PWR?"  Part="1" 
AR Path="/5F5F0002/5F5A9C90" Ref="#PWR?"  Part="1" 
AR Path="/5F0586F7/5F5A9C90" Ref="#PWR?"  Part="1" 
AR Path="/5F51B236/5F5A9C90" Ref="#PWR044"  Part="1" 
F 0 "#PWR044" H 950 1375 50  0001 C CNN
F 1 "GND" H 955 1460 39  0000 C CNN
F 2 "" H 950 1625 50  0001 C CNN
F 3 "" H 950 1625 50  0001 C CNN
	1    950  1625
	-1   0    0    1   
$EndComp
Wire Wire Line
	3475 1725 2775 1725
Wire Wire Line
	1200 1625 1200 1700
$Comp
L power:+5V #PWR?
U 1 1 5F5A9C9B
P 1200 1625
AR Path="/5F102375/5F5A9C9B" Ref="#PWR?"  Part="1" 
AR Path="/5F5F0002/5F5A9C9B" Ref="#PWR?"  Part="1" 
AR Path="/5F0586F7/5F5A9C9B" Ref="#PWR?"  Part="1" 
AR Path="/5F51B236/5F5A9C9B" Ref="#PWR043"  Part="1" 
F 0 "#PWR043" H 1200 1475 50  0001 C CNN
F 1 "+5V" H 1200 1775 39  0000 C CNN
F 2 "" H 1200 1625 50  0001 C CNN
F 3 "" H 1200 1625 50  0001 C CNN
	1    1200 1625
	1    0    0    -1  
$EndComp
Wire Wire Line
	1200 2025 1600 2025
Wire Wire Line
	950  2025 950  1900
Wire Wire Line
	1200 1900 1200 2025
$Comp
L Device:R_Small R?
U 1 1 5F5A9CA6
P 950 1800
AR Path="/5F2104BF/5F5A9CA6" Ref="R?"  Part="1" 
AR Path="/5F5A9CA6" Ref="R?"  Part="1" 
AR Path="/5F5F0002/5F5A9CA6" Ref="R?"  Part="1" 
AR Path="/5F0586F7/5F5A9CA6" Ref="R?"  Part="1" 
AR Path="/5F51B236/5F5A9CA6" Ref="R12"  Part="1" 
F 0 "R12" H 1009 1838 39  0000 L CNN
F 1 "392k" H 1009 1763 39  0000 L CNN
F 2 "Resistor_SMD:R_0603_1608Metric" H 950 1800 50  0001 C CNN
F 3 "~" H 950 1800 50  0001 C CNN
F 4 "" H 950 1800 50  0001 C CNN "Mfr"
	1    950  1800
	-1   0    0    1   
$EndComp
$Comp
L Device:R_Small R?
U 1 1 5F5A9CAD
P 1200 1800
AR Path="/5F2104BF/5F5A9CAD" Ref="R?"  Part="1" 
AR Path="/5F5A9CAD" Ref="R?"  Part="1" 
AR Path="/5F5F0002/5F5A9CAD" Ref="R?"  Part="1" 
AR Path="/5F0586F7/5F5A9CAD" Ref="R?"  Part="1" 
AR Path="/5F51B236/5F5A9CAD" Ref="R11"  Part="1" 
F 0 "R11" H 1259 1838 39  0000 L CNN
F 1 "1M" H 1259 1763 39  0000 L CNN
F 2 "Resistor_SMD:R_0603_1608Metric" H 1200 1800 50  0001 C CNN
F 3 "~" H 1200 1800 50  0001 C CNN
F 4 "" H 1200 1800 50  0001 C CNN "Mfr"
	1    1200 1800
	1    0    0    -1  
$EndComp
Wire Wire Line
	3075 2325 3025 2325
$Comp
L Device:R_Small R?
U 1 1 5F5A9CB5
P 3025 2425
AR Path="/5F2104BF/5F5A9CB5" Ref="R?"  Part="1" 
AR Path="/5F5A9CB5" Ref="R?"  Part="1" 
AR Path="/5F5F0002/5F5A9CB5" Ref="R?"  Part="1" 
AR Path="/5F0586F7/5F5A9CB5" Ref="R?"  Part="1" 
AR Path="/5F51B236/5F5A9CB5" Ref="R15"  Part="1" 
F 0 "R15" H 3084 2463 39  0000 L CNN
F 1 "196k" H 3084 2388 39  0000 L CNN
F 2 "Resistor_SMD:R_0603_1608Metric" H 3025 2425 50  0001 C CNN
F 3 "~" H 3025 2425 50  0001 C CNN
F 4 "" H 3025 2425 50  0001 C CNN "Mfr"
	1    3025 2425
	1    0    0    -1  
$EndComp
Wire Wire Line
	3475 1725 3475 1925
$Comp
L power:+5V #PWR?
U 1 1 5F5A9CC2
P 3475 1725
AR Path="/5F102375/5F5A9CC2" Ref="#PWR?"  Part="1" 
AR Path="/5F5F0002/5F5A9CC2" Ref="#PWR?"  Part="1" 
AR Path="/5F0586F7/5F5A9CC2" Ref="#PWR?"  Part="1" 
AR Path="/5F51B236/5F5A9CC2" Ref="#PWR049"  Part="1" 
F 0 "#PWR049" H 3475 1575 50  0001 C CNN
F 1 "+5V" H 3475 1875 39  0000 C CNN
F 2 "" H 3475 1725 50  0001 C CNN
F 3 "" H 3475 1725 50  0001 C CNN
	1    3475 1725
	1    0    0    -1  
$EndComp
$Comp
L LEGOS:LTC6992 U?
U 1 1 5F5A9CCE
P 3475 2225
AR Path="/5F0586F7/5F5A9CCE" Ref="U?"  Part="1" 
AR Path="/5F51B236/5F5A9CCE" Ref="U10"  Part="1" 
F 0 "U10" H 3625 2550 39  0000 L CNN
F 1 "LTC6992CS6-1" H 3625 2450 39  0000 L CNN
F 2 "Package_TO_SOT_SMD:TSOT-23-6" H 3475 1825 50  0001 C CNN
F 3 "https://www.mouser.de/datasheet/2/609/LTC6992-1-6992-2-6992-3-6992-4-1270033.pdf" H 3525 2325 50  0001 C CNN
	1    3475 2225
	1    0    0    -1  
$EndComp
Wire Wire Line
	4675 1925 4675 1975
$Comp
L power:GND #PWR?
U 1 1 5F5A9D14
P 4675 2575
AR Path="/5F5A9D14" Ref="#PWR?"  Part="1" 
AR Path="/5EFE1C3B/5F5A9D14" Ref="#PWR?"  Part="1" 
AR Path="/5F25F1E7/5F5A9D14" Ref="#PWR?"  Part="1" 
AR Path="/5F51B236/5F5A9D14" Ref="#PWR054"  Part="1" 
F 0 "#PWR054" H 4675 2325 50  0001 C CNN
F 1 "GND" H 4680 2402 39  0000 C CNN
F 2 "" H 4675 2575 50  0001 C CNN
F 3 "" H 4675 2575 50  0001 C CNN
	1    4675 2575
	1    0    0    -1  
$EndComp
Wire Wire Line
	4675 2425 4675 2575
Wire Wire Line
	2700 6075 3025 6075
Connection ~ 2700 6075
Wire Wire Line
	2700 6125 2700 6075
Wire Wire Line
	3025 6075 3350 6075
Connection ~ 3025 6075
Wire Wire Line
	3025 6125 3025 6075
Wire Wire Line
	3350 6075 3675 6075
Connection ~ 3350 6075
Wire Wire Line
	3350 6125 3350 6075
Wire Wire Line
	3675 6075 4000 6075
Connection ~ 3675 6075
Wire Wire Line
	3675 6125 3675 6075
Wire Wire Line
	2375 6075 2375 6125
Connection ~ 2375 6075
Wire Wire Line
	4000 6075 4000 6125
Wire Wire Line
	2375 6075 2700 6075
Wire Wire Line
	3675 6325 3675 6400
$Comp
L Device:R_Small R?
U 1 1 5F610A82
P 3675 6225
AR Path="/5F610A82" Ref="R?"  Part="1" 
AR Path="/5EFE1C3B/5F610A82" Ref="R?"  Part="1" 
AR Path="/5F25F1E7/5F610A82" Ref="R?"  Part="1" 
AR Path="/5F51B236/5F610A82" Ref="R26"  Part="1" 
F 0 "R26" H 3734 6271 39  0000 L CNN
F 1 "220" H 3734 6180 39  0000 L CNN
F 2 "Resistor_SMD:R_0603_1608Metric" H 3675 6225 50  0001 C CNN
F 3 "~" H 3675 6225 50  0001 C CNN
	1    3675 6225
	1    0    0    -1  
$EndComp
Wire Wire Line
	3350 6325 3350 6400
$Comp
L Device:R_Small R?
U 1 1 5F60DABA
P 3350 6225
AR Path="/5F60DABA" Ref="R?"  Part="1" 
AR Path="/5EFE1C3B/5F60DABA" Ref="R?"  Part="1" 
AR Path="/5F25F1E7/5F60DABA" Ref="R?"  Part="1" 
AR Path="/5F51B236/5F60DABA" Ref="R24"  Part="1" 
F 0 "R24" H 3409 6271 39  0000 L CNN
F 1 "220" H 3409 6180 39  0000 L CNN
F 2 "Resistor_SMD:R_0603_1608Metric" H 3350 6225 50  0001 C CNN
F 3 "~" H 3350 6225 50  0001 C CNN
	1    3350 6225
	1    0    0    -1  
$EndComp
Wire Wire Line
	3025 6325 3025 6400
Wire Wire Line
	2700 6325 2700 6400
$Comp
L Device:R_Small R?
U 1 1 5F606C66
P 2700 6225
AR Path="/5F606C66" Ref="R?"  Part="1" 
AR Path="/5EFE1C3B/5F606C66" Ref="R?"  Part="1" 
AR Path="/5F25F1E7/5F606C66" Ref="R?"  Part="1" 
AR Path="/5F51B236/5F606C66" Ref="R20"  Part="1" 
F 0 "R20" H 2759 6271 39  0000 L CNN
F 1 "220" H 2759 6180 39  0000 L CNN
F 2 "Resistor_SMD:R_0603_1608Metric" H 2700 6225 50  0001 C CNN
F 3 "~" H 2700 6225 50  0001 C CNN
	1    2700 6225
	1    0    0    -1  
$EndComp
Wire Wire Line
	4000 6325 4000 6400
$Comp
L Device:R_Small R?
U 1 1 5F602DBB
P 4000 6225
AR Path="/5F602DBB" Ref="R?"  Part="1" 
AR Path="/5EFE1C3B/5F602DBB" Ref="R?"  Part="1" 
AR Path="/5F25F1E7/5F602DBB" Ref="R?"  Part="1" 
AR Path="/5F51B236/5F602DBB" Ref="R28"  Part="1" 
F 0 "R28" H 4059 6271 39  0000 L CNN
F 1 "220" H 4059 6180 39  0000 L CNN
F 2 "Resistor_SMD:R_0603_1608Metric" H 4000 6225 50  0001 C CNN
F 3 "~" H 4000 6225 50  0001 C CNN
	1    4000 6225
	1    0    0    -1  
$EndComp
Wire Wire Line
	2375 6325 2375 6400
$Comp
L Device:R_Small R?
U 1 1 5F5A9CDD
P 2375 6225
AR Path="/5F5A9CDD" Ref="R?"  Part="1" 
AR Path="/5EFE1C3B/5F5A9CDD" Ref="R?"  Part="1" 
AR Path="/5F25F1E7/5F5A9CDD" Ref="R?"  Part="1" 
AR Path="/5F51B236/5F5A9CDD" Ref="R18"  Part="1" 
F 0 "R18" H 2434 6271 39  0000 L CNN
F 1 "220" H 2434 6180 39  0000 L CNN
F 2 "Resistor_SMD:R_0603_1608Metric" H 2375 6225 50  0001 C CNN
F 3 "~" H 2375 6225 50  0001 C CNN
	1    2375 6225
	1    0    0    -1  
$EndComp
Wire Wire Line
	2375 6025 2375 6075
$Comp
L Device:Q_PMOS_GSD Q2
U 1 1 5F265D0E
P 2275 5825
F 0 "Q2" H 2480 5787 39  0000 L CNN
F 1 "Si2301BDS" H 2480 5862 39  0000 L CNN
F 2 "Package_TO_SOT_SMD:SOT-23" H 2475 5925 50  0001 C CNN
F 3 "https://eu.mouser.com/datasheet/2/427/si2301bds-1765637.pdf" H 2275 5825 50  0001 C CNN
	1    2275 5825
	1    0    0    1   
$EndComp
Wire Wire Line
	2375 5475 2375 5625
$Comp
L power:+5V #PWR?
U 1 1 5F5A9CEA
P 2375 5475
AR Path="/5F112078/5F5A9CEA" Ref="#PWR?"  Part="1" 
AR Path="/5F5A9CEA" Ref="#PWR?"  Part="1" 
AR Path="/5F25F1E7/5F5A9CEA" Ref="#PWR?"  Part="1" 
AR Path="/5F51B236/5F5A9CEA" Ref="#PWR055"  Part="1" 
F 0 "#PWR055" H 2375 5325 50  0001 C CNN
F 1 "+5V" H 2375 5625 39  0000 C CNN
F 2 "" H 2375 5475 50  0001 C CNN
F 3 "" H 2375 5475 50  0001 C CNN
	1    2375 5475
	1    0    0    -1  
$EndComp
$Comp
L Device:R_Small R?
U 1 1 5F65DF0E
P 5975 1825
AR Path="/5F65DF0E" Ref="R?"  Part="1" 
AR Path="/5EFE1C3B/5F65DF0E" Ref="R?"  Part="1" 
AR Path="/5F25F1E7/5F65DF0E" Ref="R?"  Part="1" 
AR Path="/5F51B236/5F65DF0E" Ref="R25"  Part="1" 
F 0 "R25" H 6034 1871 39  0000 L CNN
F 1 "110" H 6034 1780 39  0000 L CNN
F 2 "Resistor_SMD:R_0603_1608Metric" H 5975 1825 50  0001 C CNN
F 3 "~" H 5975 1825 50  0001 C CNN
	1    5975 1825
	1    0    0    1   
$EndComp
$Comp
L Device:R_Small R?
U 1 1 5F65DF22
P 5650 1825
AR Path="/5F65DF22" Ref="R?"  Part="1" 
AR Path="/5EFE1C3B/5F65DF22" Ref="R?"  Part="1" 
AR Path="/5F25F1E7/5F65DF22" Ref="R?"  Part="1" 
AR Path="/5F51B236/5F65DF22" Ref="R23"  Part="1" 
F 0 "R23" H 5709 1871 39  0000 L CNN
F 1 "110" H 5709 1780 39  0000 L CNN
F 2 "Resistor_SMD:R_0603_1608Metric" H 5650 1825 50  0001 C CNN
F 3 "~" H 5650 1825 50  0001 C CNN
	1    5650 1825
	1    0    0    1   
$EndComp
$Comp
L Device:R_Small R?
U 1 1 5F65DF4A
P 5000 1825
AR Path="/5F65DF4A" Ref="R?"  Part="1" 
AR Path="/5EFE1C3B/5F65DF4A" Ref="R?"  Part="1" 
AR Path="/5F25F1E7/5F65DF4A" Ref="R?"  Part="1" 
AR Path="/5F51B236/5F65DF4A" Ref="R19"  Part="1" 
F 0 "R19" H 5059 1871 39  0000 L CNN
F 1 "110" H 5059 1780 39  0000 L CNN
F 2 "Resistor_SMD:R_0603_1608Metric" H 5000 1825 50  0001 C CNN
F 3 "~" H 5000 1825 50  0001 C CNN
	1    5000 1825
	1    0    0    1   
$EndComp
$Comp
L Device:R_Small R?
U 1 1 5F65DF5E
P 6300 1825
AR Path="/5F65DF5E" Ref="R?"  Part="1" 
AR Path="/5EFE1C3B/5F65DF5E" Ref="R?"  Part="1" 
AR Path="/5F25F1E7/5F65DF5E" Ref="R?"  Part="1" 
AR Path="/5F51B236/5F65DF5E" Ref="R27"  Part="1" 
F 0 "R27" H 6359 1871 39  0000 L CNN
F 1 "110" H 6359 1780 39  0000 L CNN
F 2 "Resistor_SMD:R_0603_1608Metric" H 6300 1825 50  0001 C CNN
F 3 "~" H 6300 1825 50  0001 C CNN
	1    6300 1825
	1    0    0    1   
$EndComp
$Comp
L Device:R_Small R?
U 1 1 5F65DF73
P 4675 1825
AR Path="/5F65DF73" Ref="R?"  Part="1" 
AR Path="/5EFE1C3B/5F65DF73" Ref="R?"  Part="1" 
AR Path="/5F25F1E7/5F65DF73" Ref="R?"  Part="1" 
AR Path="/5F51B236/5F65DF73" Ref="R17"  Part="1" 
F 0 "R17" H 4734 1871 39  0000 L CNN
F 1 "110" H 4734 1780 39  0000 L CNN
F 2 "Resistor_SMD:R_0603_1608Metric" H 4675 1825 50  0001 C CNN
F 3 "~" H 4675 1825 50  0001 C CNN
	1    4675 1825
	1    0    0    1   
$EndComp
Wire Wire Line
	4675 1975 5000 1975
Wire Wire Line
	6300 1975 6300 1925
Connection ~ 4675 1975
Wire Wire Line
	4675 1975 4675 2025
Wire Wire Line
	5975 1925 5975 1975
Connection ~ 5975 1975
Wire Wire Line
	5975 1975 6300 1975
Wire Wire Line
	5650 1925 5650 1975
Connection ~ 5650 1975
Wire Wire Line
	5650 1975 5975 1975
Wire Wire Line
	5325 1925 5325 1975
Connection ~ 5325 1975
Wire Wire Line
	5325 1975 5650 1975
Wire Wire Line
	5000 1925 5000 1975
Connection ~ 5000 1975
Wire Wire Line
	5000 1975 5325 1975
Wire Wire Line
	1875 5825 2025 5825
Text Notes 6425 1650 0    39   ~ 0
YELLOW\n
$Comp
L Device:LED D12
U 1 1 5F610A89
P 5975 1500
F 0 "D12" V 6006 1382 39  0000 R CNN
F 1 "IN-S126ATY" V 5931 1382 39  0001 R CNN
F 2 "LED_SMD:LED_1206_3216Metric_Castellated" H 5975 1500 50  0001 C CNN
F 3 "http://inolux-corp.com/datasheet/SMDLED/Mono%20Color%20Top%20View/IN-S126AT%20Series_V1.0.pdf" H 5975 1500 50  0001 C CNN
	1    5975 1500
	0    -1   -1   0   
$EndComp
$Comp
L Device:LED D10
U 1 1 5F60DAC1
P 5650 1500
F 0 "D10" V 5681 1382 39  0000 R CNN
F 1 "IN-S126ATY" V 5606 1382 39  0001 R CNN
F 2 "LED_SMD:LED_1206_3216Metric_Castellated" H 5650 1500 50  0001 C CNN
F 3 "http://inolux-corp.com/datasheet/SMDLED/Mono%20Color%20Top%20View/IN-S126AT%20Series_V1.0.pdf" H 5650 1500 50  0001 C CNN
	1    5650 1500
	0    -1   -1   0   
$EndComp
$Comp
L Device:LED D8
U 1 1 5F60DAAD
P 5325 1500
F 0 "D8" V 5356 1382 39  0000 R CNN
F 1 "IN-S126ATY" V 5281 1382 39  0001 R CNN
F 2 "LED_SMD:LED_1206_3216Metric_Castellated" H 5325 1500 50  0001 C CNN
F 3 "http://inolux-corp.com/datasheet/SMDLED/Mono%20Color%20Top%20View/IN-S126AT%20Series_V1.0.pdf" H 5325 1500 50  0001 C CNN
	1    5325 1500
	0    -1   -1   0   
$EndComp
$Comp
L Device:LED D5
U 1 1 5F606C6D
P 5000 1500
F 0 "D5" V 5031 1382 39  0000 R CNN
F 1 "IN-S126ATY" V 4956 1382 39  0001 R CNN
F 2 "LED_SMD:LED_1206_3216Metric_Castellated" H 5000 1500 50  0001 C CNN
F 3 "http://inolux-corp.com/datasheet/SMDLED/Mono%20Color%20Top%20View/IN-S126AT%20Series_V1.0.pdf" H 5000 1500 50  0001 C CNN
	1    5000 1500
	0    -1   -1   0   
$EndComp
$Comp
L Device:LED D14
U 1 1 5F602DC2
P 6300 1500
F 0 "D14" V 6331 1382 39  0000 R CNN
F 1 "IN-S126ATY" V 6256 1382 39  0000 R CNN
F 2 "LED_SMD:LED_1206_3216Metric_Castellated" H 6300 1500 50  0001 C CNN
F 3 "http://inolux-corp.com/datasheet/SMDLED/Mono%20Color%20Top%20View/IN-S126AT%20Series_V1.0.pdf" H 6300 1500 50  0001 C CNN
	1    6300 1500
	0    -1   -1   0   
$EndComp
$Comp
L Device:LED D3
U 1 1 5F5A9CD5
P 4675 1500
F 0 "D3" V 4706 1382 39  0000 R CNN
F 1 "IN-S126ATY" V 4631 1382 39  0001 R CNN
F 2 "LED_SMD:LED_1206_3216Metric_Castellated" H 4675 1500 50  0001 C CNN
F 3 "http://inolux-corp.com/datasheet/SMDLED/Mono%20Color%20Top%20View/IN-S126AT%20Series_V1.0.pdf" H 4675 1500 50  0001 C CNN
	1    4675 1500
	0    -1   -1   0   
$EndComp
$Comp
L power:+5V #PWR?
U 1 1 5F66EDCB
P 6300 1250
AR Path="/5F112078/5F66EDCB" Ref="#PWR?"  Part="1" 
AR Path="/5F66EDCB" Ref="#PWR?"  Part="1" 
AR Path="/5F25F1E7/5F66EDCB" Ref="#PWR?"  Part="1" 
AR Path="/5F51B236/5F66EDCB" Ref="#PWR067"  Part="1" 
F 0 "#PWR067" H 6300 1100 50  0001 C CNN
F 1 "+5V" H 6300 1400 39  0000 C CNN
F 2 "" H 6300 1250 50  0001 C CNN
F 3 "" H 6300 1250 50  0001 C CNN
	1    6300 1250
	1    0    0    -1  
$EndComp
$Comp
L power:+5V #PWR?
U 1 1 5F66E775
P 5975 1250
AR Path="/5F112078/5F66E775" Ref="#PWR?"  Part="1" 
AR Path="/5F66E775" Ref="#PWR?"  Part="1" 
AR Path="/5F25F1E7/5F66E775" Ref="#PWR?"  Part="1" 
AR Path="/5F51B236/5F66E775" Ref="#PWR065"  Part="1" 
F 0 "#PWR065" H 5975 1100 50  0001 C CNN
F 1 "+5V" H 5975 1400 39  0000 C CNN
F 2 "" H 5975 1250 50  0001 C CNN
F 3 "" H 5975 1250 50  0001 C CNN
	1    5975 1250
	1    0    0    -1  
$EndComp
$Comp
L power:+5V #PWR?
U 1 1 5F66E359
P 5650 1250
AR Path="/5F112078/5F66E359" Ref="#PWR?"  Part="1" 
AR Path="/5F66E359" Ref="#PWR?"  Part="1" 
AR Path="/5F25F1E7/5F66E359" Ref="#PWR?"  Part="1" 
AR Path="/5F51B236/5F66E359" Ref="#PWR063"  Part="1" 
F 0 "#PWR063" H 5650 1100 50  0001 C CNN
F 1 "+5V" H 5650 1400 39  0000 C CNN
F 2 "" H 5650 1250 50  0001 C CNN
F 3 "" H 5650 1250 50  0001 C CNN
	1    5650 1250
	1    0    0    -1  
$EndComp
$Comp
L power:+5V #PWR?
U 1 1 5F66DF9E
P 5325 1250
AR Path="/5F112078/5F66DF9E" Ref="#PWR?"  Part="1" 
AR Path="/5F66DF9E" Ref="#PWR?"  Part="1" 
AR Path="/5F25F1E7/5F66DF9E" Ref="#PWR?"  Part="1" 
AR Path="/5F51B236/5F66DF9E" Ref="#PWR061"  Part="1" 
F 0 "#PWR061" H 5325 1100 50  0001 C CNN
F 1 "+5V" H 5325 1400 39  0000 C CNN
F 2 "" H 5325 1250 50  0001 C CNN
F 3 "" H 5325 1250 50  0001 C CNN
	1    5325 1250
	1    0    0    -1  
$EndComp
$Comp
L power:+5V #PWR?
U 1 1 5F66DAC1
P 5000 1250
AR Path="/5F112078/5F66DAC1" Ref="#PWR?"  Part="1" 
AR Path="/5F66DAC1" Ref="#PWR?"  Part="1" 
AR Path="/5F25F1E7/5F66DAC1" Ref="#PWR?"  Part="1" 
AR Path="/5F51B236/5F66DAC1" Ref="#PWR059"  Part="1" 
F 0 "#PWR059" H 5000 1100 50  0001 C CNN
F 1 "+5V" H 5000 1400 39  0000 C CNN
F 2 "" H 5000 1250 50  0001 C CNN
F 3 "" H 5000 1250 50  0001 C CNN
	1    5000 1250
	1    0    0    -1  
$EndComp
$Comp
L power:+5V #PWR?
U 1 1 5F66BDF2
P 4675 1250
AR Path="/5F112078/5F66BDF2" Ref="#PWR?"  Part="1" 
AR Path="/5F66BDF2" Ref="#PWR?"  Part="1" 
AR Path="/5F25F1E7/5F66BDF2" Ref="#PWR?"  Part="1" 
AR Path="/5F51B236/5F66BDF2" Ref="#PWR053"  Part="1" 
F 0 "#PWR053" H 4675 1100 50  0001 C CNN
F 1 "+5V" H 4675 1400 39  0000 C CNN
F 2 "" H 4675 1250 50  0001 C CNN
F 3 "" H 4675 1250 50  0001 C CNN
	1    4675 1250
	1    0    0    -1  
$EndComp
Wire Wire Line
	4675 1350 4675 1250
Wire Wire Line
	6300 1350 6300 1250
Wire Wire Line
	5000 1350 5000 1250
Wire Wire Line
	5325 1350 5325 1250
Wire Wire Line
	5650 1350 5650 1250
Wire Wire Line
	5975 1350 5975 1250
Wire Wire Line
	4675 1725 4675 1650
$Comp
L Device:LED D2
U 1 1 5F65DF6C
P 2375 6550
F 0 "D2" V 2406 6432 39  0000 R CNN
F 1 "IN-S126ATR" V 2331 6432 39  0001 R CNN
F 2 "LED_SMD:LED_1206_3216Metric_Castellated" H 2375 6550 50  0001 C CNN
F 3 "http://inolux-corp.com/datasheet/SMDLED/Mono%20Color%20Top%20View/IN-S126AT%20Series_V1.0.pdf" H 2375 6550 50  0001 C CNN
	1    2375 6550
	0    -1   -1   0   
$EndComp
Text Notes 4125 6675 0    39   ~ 0
RED
Wire Wire Line
	6300 1725 6300 1650
$Comp
L Device:LED D13
U 1 1 5F65DF57
P 4000 6550
F 0 "D13" V 4031 6432 39  0000 R CNN
F 1 "IN-S126ATR" V 3956 6432 39  0000 R CNN
F 2 "LED_SMD:LED_1206_3216Metric_Castellated" H 4000 6550 50  0001 C CNN
F 3 "http://inolux-corp.com/datasheet/SMDLED/Mono%20Color%20Top%20View/IN-S126AT%20Series_V1.0.pdf" H 4000 6550 50  0001 C CNN
	1    4000 6550
	0    -1   -1   0   
$EndComp
Wire Wire Line
	5000 1725 5000 1650
$Comp
L Device:LED D4
U 1 1 5F65DF43
P 2700 6550
F 0 "D4" V 2731 6432 39  0000 R CNN
F 1 "IN-S126ATR" V 2656 6432 39  0001 R CNN
F 2 "LED_SMD:LED_1206_3216Metric_Castellated" H 2700 6550 50  0001 C CNN
F 3 "http://inolux-corp.com/datasheet/SMDLED/Mono%20Color%20Top%20View/IN-S126AT%20Series_V1.0.pdf" H 2700 6550 50  0001 C CNN
	1    2700 6550
	0    -1   -1   0   
$EndComp
Wire Wire Line
	5325 1725 5325 1650
$Comp
L Device:LED D7
U 1 1 5F65DF2F
P 3025 6550
F 0 "D7" V 3056 6432 39  0000 R CNN
F 1 "IN-S126ATR" V 2981 6432 39  0001 R CNN
F 2 "LED_SMD:LED_1206_3216Metric_Castellated" H 3025 6550 50  0001 C CNN
F 3 "http://inolux-corp.com/datasheet/SMDLED/Mono%20Color%20Top%20View/IN-S126AT%20Series_V1.0.pdf" H 3025 6550 50  0001 C CNN
	1    3025 6550
	0    -1   -1   0   
$EndComp
Wire Wire Line
	5650 1725 5650 1650
$Comp
L Device:LED D9
U 1 1 5F65DF1B
P 3350 6550
F 0 "D9" V 3381 6432 39  0000 R CNN
F 1 "IN-S126ATR" V 3306 6432 39  0001 R CNN
F 2 "LED_SMD:LED_1206_3216Metric_Castellated" H 3350 6550 50  0001 C CNN
F 3 "http://inolux-corp.com/datasheet/SMDLED/Mono%20Color%20Top%20View/IN-S126AT%20Series_V1.0.pdf" H 3350 6550 50  0001 C CNN
	1    3350 6550
	0    -1   -1   0   
$EndComp
Wire Wire Line
	5975 1725 5975 1650
$Comp
L Device:LED D11
U 1 1 5F65DF07
P 3675 6550
F 0 "D11" V 3706 6432 39  0000 R CNN
F 1 "IN-S126ATR" V 3631 6432 39  0001 R CNN
F 2 "LED_SMD:LED_1206_3216Metric_Castellated" H 3675 6550 50  0001 C CNN
F 3 "http://inolux-corp.com/datasheet/SMDLED/Mono%20Color%20Top%20View/IN-S126AT%20Series_V1.0.pdf" H 3675 6550 50  0001 C CNN
	1    3675 6550
	0    -1   -1   0   
$EndComp
Wire Wire Line
	3875 2225 4325 2225
Connection ~ 2375 6750
Wire Wire Line
	2375 6700 2375 6750
Wire Wire Line
	4000 6750 4000 6700
Wire Wire Line
	2375 6750 2700 6750
Wire Wire Line
	3675 6700 3675 6750
Connection ~ 3675 6750
Wire Wire Line
	3675 6750 4000 6750
Wire Wire Line
	3350 6700 3350 6750
Connection ~ 3350 6750
Wire Wire Line
	3350 6750 3675 6750
Wire Wire Line
	2700 6700 2700 6750
Connection ~ 2700 6750
Wire Wire Line
	2700 6750 3025 6750
Wire Wire Line
	3025 6700 3025 6750
Connection ~ 3025 6750
Wire Wire Line
	3025 6750 3350 6750
Text Label 1875 5825 0    39   ~ 0
PWM
Wire Wire Line
	4975 6075 5300 6075
Connection ~ 4975 6075
Wire Wire Line
	4975 6125 4975 6075
Wire Wire Line
	5300 6075 5625 6075
Connection ~ 5300 6075
Wire Wire Line
	5300 6125 5300 6075
Wire Wire Line
	5625 6075 5950 6075
Connection ~ 5625 6075
Wire Wire Line
	5625 6125 5625 6075
Wire Wire Line
	5950 6075 6275 6075
Connection ~ 5950 6075
Wire Wire Line
	5950 6125 5950 6075
Wire Wire Line
	4650 6075 4650 6125
Wire Wire Line
	6275 6075 6275 6125
Wire Wire Line
	4650 6075 4975 6075
Wire Wire Line
	5950 6325 5950 6400
Wire Wire Line
	5625 6325 5625 6400
Wire Wire Line
	5300 6325 5300 6400
Wire Wire Line
	4975 6325 4975 6400
Wire Wire Line
	6275 6325 6275 6400
Wire Wire Line
	4650 6325 4650 6400
$Comp
L Device:R_Small R?
U 1 1 5F97D5E6
P 4650 6225
AR Path="/5F97D5E6" Ref="R?"  Part="1" 
AR Path="/5EFE1C3B/5F97D5E6" Ref="R?"  Part="1" 
AR Path="/5F25F1E7/5F97D5E6" Ref="R?"  Part="1" 
AR Path="/5F51B236/5F97D5E6" Ref="R32"  Part="1" 
F 0 "R32" H 4709 6271 39  0000 L CNN
F 1 "140" H 4709 6180 39  0000 L CNN
F 2 "Resistor_SMD:R_0603_1608Metric" H 4650 6225 50  0001 C CNN
F 3 "~" H 4650 6225 50  0001 C CNN
	1    4650 6225
	1    0    0    -1  
$EndComp
Text Notes 6400 6675 0    39   ~ 0
GREEN
$Comp
L Device:LED D21
U 1 1 5F97D608
P 6275 6550
F 0 "D21" V 6306 6432 39  0000 R CNN
F 1 "IN-S126ATG" V 6231 6432 39  0000 R CNN
F 2 "LED_SMD:LED_1206_3216Metric_Castellated" H 6275 6550 50  0001 C CNN
F 3 "http://inolux-corp.com/datasheet/SMDLED/Mono%20Color%20Top%20View/IN-S126AT%20Series_V1.0.pdf" H 6275 6550 50  0001 C CNN
	1    6275 6550
	0    -1   -1   0   
$EndComp
Wire Wire Line
	4650 6700 4650 6750
Wire Wire Line
	6275 6750 6275 6700
Wire Wire Line
	4650 6750 4975 6750
Wire Wire Line
	5950 6700 5950 6750
Connection ~ 5950 6750
Wire Wire Line
	5950 6750 6275 6750
Wire Wire Line
	5625 6700 5625 6750
Connection ~ 5625 6750
Wire Wire Line
	5625 6750 5950 6750
Wire Wire Line
	4975 6700 4975 6750
Connection ~ 4975 6750
Wire Wire Line
	4975 6750 5300 6750
Wire Wire Line
	5300 6700 5300 6750
Connection ~ 5300 6750
Wire Wire Line
	5300 6750 5625 6750
Wire Wire Line
	2375 6750 2375 6800
Wire Wire Line
	1875 7000 2025 7000
Wire Wire Line
	2025 7000 2075 7000
Connection ~ 2025 7000
Wire Wire Line
	2025 7100 2025 7000
Wire Wire Line
	2025 7300 2025 7350
$Comp
L power:GND #PWR?
U 1 1 5F94DBEB
P 2025 7350
AR Path="/5F94DBEB" Ref="#PWR?"  Part="1" 
AR Path="/5EFE1C3B/5F94DBEB" Ref="#PWR?"  Part="1" 
AR Path="/5F25F1E7/5F94DBEB" Ref="#PWR?"  Part="1" 
AR Path="/5F51B236/5F94DBEB" Ref="#PWR0102"  Part="1" 
F 0 "#PWR0102" H 2025 7100 50  0001 C CNN
F 1 "GND" H 2030 7177 39  0000 C CNN
F 2 "" H 2025 7350 50  0001 C CNN
F 3 "" H 2025 7350 50  0001 C CNN
	1    2025 7350
	1    0    0    -1  
$EndComp
$Comp
L Device:R_Small R?
U 1 1 5F94DBE5
P 2025 7200
AR Path="/5F94DBE5" Ref="R?"  Part="1" 
AR Path="/5F51B236/5F94DBE5" Ref="R29"  Part="1" 
F 0 "R29" H 2075 7150 39  0000 L CNN
F 1 "10k" H 2075 7200 39  0000 L CNN
F 2 "Resistor_SMD:R_0603_1608Metric" H 2025 7200 50  0001 C CNN
F 3 "~" H 2025 7200 50  0001 C CNN
	1    2025 7200
	-1   0    0    1   
$EndComp
Wire Wire Line
	2375 7200 2375 7350
$Comp
L Device:Q_NMOS_GSD Q4
U 1 1 5F9102D7
P 2275 7000
F 0 "Q4" H 2475 6900 39  0000 L CNN
F 1 "Si2302CDS" H 2475 6825 39  0000 L CNN
F 2 "Package_TO_SOT_SMD:SOT-23" H 2475 7100 50  0001 C CNN
F 3 "https://eu.mouser.com/datasheet/2/427/si2302cds-1764899.pdf" H 2275 7000 50  0001 C CNN
	1    2275 7000
	1    0    0    -1  
$EndComp
$Comp
L power:GND #PWR?
U 1 1 5F8BD4AA
P 2375 7350
AR Path="/5F8BD4AA" Ref="#PWR?"  Part="1" 
AR Path="/5EFE1C3B/5F8BD4AA" Ref="#PWR?"  Part="1" 
AR Path="/5F25F1E7/5F8BD4AA" Ref="#PWR?"  Part="1" 
AR Path="/5F51B236/5F8BD4AA" Ref="#PWR072"  Part="1" 
F 0 "#PWR072" H 2375 7100 50  0001 C CNN
F 1 "GND" H 2380 7177 39  0000 C CNN
F 2 "" H 2375 7350 50  0001 C CNN
F 3 "" H 2375 7350 50  0001 C CNN
	1    2375 7350
	1    0    0    -1  
$EndComp
Wire Wire Line
	4150 7000 4300 7000
Wire Wire Line
	4300 7000 4350 7000
Connection ~ 4300 7000
Wire Wire Line
	4300 7100 4300 7000
Wire Wire Line
	4300 7300 4300 7350
$Comp
L power:GND #PWR?
U 1 1 5FAC859B
P 4300 7350
AR Path="/5FAC859B" Ref="#PWR?"  Part="1" 
AR Path="/5EFE1C3B/5FAC859B" Ref="#PWR?"  Part="1" 
AR Path="/5F25F1E7/5FAC859B" Ref="#PWR?"  Part="1" 
AR Path="/5F51B236/5FAC859B" Ref="#PWR0103"  Part="1" 
F 0 "#PWR0103" H 4300 7100 50  0001 C CNN
F 1 "GND" H 4305 7177 39  0000 C CNN
F 2 "" H 4300 7350 50  0001 C CNN
F 3 "" H 4300 7350 50  0001 C CNN
	1    4300 7350
	1    0    0    -1  
$EndComp
$Comp
L Device:R_Small R?
U 1 1 5FAC85A1
P 4300 7200
AR Path="/5FAC85A1" Ref="R?"  Part="1" 
AR Path="/5F51B236/5FAC85A1" Ref="R31"  Part="1" 
F 0 "R31" H 4350 7150 39  0000 L CNN
F 1 "10k" H 4350 7200 39  0000 L CNN
F 2 "Resistor_SMD:R_0603_1608Metric" H 4300 7200 50  0001 C CNN
F 3 "~" H 4300 7200 50  0001 C CNN
	1    4300 7200
	-1   0    0    1   
$EndComp
Wire Wire Line
	4650 7200 4650 7350
$Comp
L power:GND #PWR?
U 1 1 5FAC85AE
P 4650 7350
AR Path="/5FAC85AE" Ref="#PWR?"  Part="1" 
AR Path="/5EFE1C3B/5FAC85AE" Ref="#PWR?"  Part="1" 
AR Path="/5F25F1E7/5FAC85AE" Ref="#PWR?"  Part="1" 
AR Path="/5F51B236/5FAC85AE" Ref="#PWR0104"  Part="1" 
F 0 "#PWR0104" H 4650 7100 50  0001 C CNN
F 1 "GND" H 4655 7177 39  0000 C CNN
F 2 "" H 4650 7350 50  0001 C CNN
F 3 "" H 4650 7350 50  0001 C CNN
	1    4650 7350
	1    0    0    -1  
$EndComp
Wire Wire Line
	4650 6800 4650 6750
Connection ~ 4650 6750
$Comp
L Device:LED D15
U 1 1 5FBD1569
P 4650 6550
F 0 "D15" V 4681 6432 39  0000 R CNN
F 1 "IN-S126ATG" V 4606 6432 39  0001 R CNN
F 2 "LED_SMD:LED_1206_3216Metric_Castellated" H 4650 6550 50  0001 C CNN
F 3 "http://inolux-corp.com/datasheet/SMDLED/Mono%20Color%20Top%20View/IN-S126AT%20Series_V1.0.pdf" H 4650 6550 50  0001 C CNN
	1    4650 6550
	0    -1   -1   0   
$EndComp
$Comp
L Device:LED D17
U 1 1 5FBD1C70
P 4975 6550
F 0 "D17" V 5006 6432 39  0000 R CNN
F 1 "IN-S126ATG" V 4931 6432 39  0001 R CNN
F 2 "LED_SMD:LED_1206_3216Metric_Castellated" H 4975 6550 50  0001 C CNN
F 3 "http://inolux-corp.com/datasheet/SMDLED/Mono%20Color%20Top%20View/IN-S126AT%20Series_V1.0.pdf" H 4975 6550 50  0001 C CNN
	1    4975 6550
	0    -1   -1   0   
$EndComp
$Comp
L Device:LED D18
U 1 1 5FBD2112
P 5300 6550
F 0 "D18" V 5331 6432 39  0000 R CNN
F 1 "IN-S126ATG" V 5256 6432 39  0001 R CNN
F 2 "LED_SMD:LED_1206_3216Metric_Castellated" H 5300 6550 50  0001 C CNN
F 3 "http://inolux-corp.com/datasheet/SMDLED/Mono%20Color%20Top%20View/IN-S126AT%20Series_V1.0.pdf" H 5300 6550 50  0001 C CNN
	1    5300 6550
	0    -1   -1   0   
$EndComp
$Comp
L Device:LED D19
U 1 1 5FBD2533
P 5625 6550
F 0 "D19" V 5656 6432 39  0000 R CNN
F 1 "IN-S126ATG" V 5581 6432 39  0001 R CNN
F 2 "LED_SMD:LED_1206_3216Metric_Castellated" H 5625 6550 50  0001 C CNN
F 3 "http://inolux-corp.com/datasheet/SMDLED/Mono%20Color%20Top%20View/IN-S126AT%20Series_V1.0.pdf" H 5625 6550 50  0001 C CNN
	1    5625 6550
	0    -1   -1   0   
$EndComp
$Comp
L Device:LED D20
U 1 1 5FBD28D5
P 5950 6550
F 0 "D20" V 5981 6432 39  0000 R CNN
F 1 "IN-S126ATG" V 5906 6432 39  0001 R CNN
F 2 "LED_SMD:LED_1206_3216Metric_Castellated" H 5950 6550 50  0001 C CNN
F 3 "http://inolux-corp.com/datasheet/SMDLED/Mono%20Color%20Top%20View/IN-S126AT%20Series_V1.0.pdf" H 5950 6550 50  0001 C CNN
	1    5950 6550
	0    -1   -1   0   
$EndComp
$Comp
L Device:R_Small R?
U 1 1 5FBD3365
P 4975 6225
AR Path="/5FBD3365" Ref="R?"  Part="1" 
AR Path="/5EFE1C3B/5FBD3365" Ref="R?"  Part="1" 
AR Path="/5F25F1E7/5FBD3365" Ref="R?"  Part="1" 
AR Path="/5F51B236/5FBD3365" Ref="R34"  Part="1" 
F 0 "R34" H 5034 6271 39  0000 L CNN
F 1 "140" H 5034 6180 39  0000 L CNN
F 2 "Resistor_SMD:R_0603_1608Metric" H 4975 6225 50  0001 C CNN
F 3 "~" H 4975 6225 50  0001 C CNN
	1    4975 6225
	1    0    0    -1  
$EndComp
$Comp
L Device:R_Small R?
U 1 1 5FBD36DF
P 5300 6225
AR Path="/5FBD36DF" Ref="R?"  Part="1" 
AR Path="/5EFE1C3B/5FBD36DF" Ref="R?"  Part="1" 
AR Path="/5F25F1E7/5FBD36DF" Ref="R?"  Part="1" 
AR Path="/5F51B236/5FBD36DF" Ref="R36"  Part="1" 
F 0 "R36" H 5359 6271 39  0000 L CNN
F 1 "140" H 5359 6180 39  0000 L CNN
F 2 "Resistor_SMD:R_0603_1608Metric" H 5300 6225 50  0001 C CNN
F 3 "~" H 5300 6225 50  0001 C CNN
	1    5300 6225
	1    0    0    -1  
$EndComp
$Comp
L Device:R_Small R?
U 1 1 5FBD3A6E
P 5625 6225
AR Path="/5FBD3A6E" Ref="R?"  Part="1" 
AR Path="/5EFE1C3B/5FBD3A6E" Ref="R?"  Part="1" 
AR Path="/5F25F1E7/5FBD3A6E" Ref="R?"  Part="1" 
AR Path="/5F51B236/5FBD3A6E" Ref="R37"  Part="1" 
F 0 "R37" H 5684 6271 39  0000 L CNN
F 1 "140" H 5684 6180 39  0000 L CNN
F 2 "Resistor_SMD:R_0603_1608Metric" H 5625 6225 50  0001 C CNN
F 3 "~" H 5625 6225 50  0001 C CNN
	1    5625 6225
	1    0    0    -1  
$EndComp
$Comp
L Device:R_Small R?
U 1 1 5FBD3D82
P 5950 6225
AR Path="/5FBD3D82" Ref="R?"  Part="1" 
AR Path="/5EFE1C3B/5FBD3D82" Ref="R?"  Part="1" 
AR Path="/5F25F1E7/5FBD3D82" Ref="R?"  Part="1" 
AR Path="/5F51B236/5FBD3D82" Ref="R38"  Part="1" 
F 0 "R38" H 6009 6271 39  0000 L CNN
F 1 "140" H 6009 6180 39  0000 L CNN
F 2 "Resistor_SMD:R_0603_1608Metric" H 5950 6225 50  0001 C CNN
F 3 "~" H 5950 6225 50  0001 C CNN
	1    5950 6225
	1    0    0    -1  
$EndComp
$Comp
L Device:R_Small R?
U 1 1 5FBD4088
P 6275 6225
AR Path="/5FBD4088" Ref="R?"  Part="1" 
AR Path="/5EFE1C3B/5FBD4088" Ref="R?"  Part="1" 
AR Path="/5F25F1E7/5FBD4088" Ref="R?"  Part="1" 
AR Path="/5F51B236/5FBD4088" Ref="R39"  Part="1" 
F 0 "R39" H 6334 6271 39  0000 L CNN
F 1 "140" H 6334 6180 39  0000 L CNN
F 2 "Resistor_SMD:R_0603_1608Metric" H 6275 6225 50  0001 C CNN
F 3 "~" H 6275 6225 50  0001 C CNN
	1    6275 6225
	1    0    0    -1  
$EndComp
Text Label 4150 7000 0    39   ~ 0
LOW
Text Label 1875 7000 0    39   ~ 0
HIGH
Text HLabel 6550 4950 0    39   Input ~ 0
TEMP
Wire Wire Line
	6700 4200 6875 4200
Wire Wire Line
	6700 4950 6550 4950
Wire Wire Line
	6700 4200 6700 4950
Text Notes 7625 4400 0    39   ~ 0
Voltage to PWM\nConverter at 1khZ\n
Text Label 7725 4200 0    39   ~ 0
FAN
Wire Wire Line
	6475 4450 6475 4550
Wire Wire Line
	6825 4500 6825 4550
Wire Wire Line
	7275 4500 7275 4550
$Comp
L power:GND #PWR?
U 1 1 5F717D40
P 7275 4550
AR Path="/5F2104BF/5F717D40" Ref="#PWR?"  Part="1" 
AR Path="/5F717D40" Ref="#PWR?"  Part="1" 
AR Path="/5F5F0002/5F717D40" Ref="#PWR?"  Part="1" 
AR Path="/5F0586F7/5F717D40" Ref="#PWR?"  Part="1" 
AR Path="/5F51B236/5F717D40" Ref="#PWR052"  Part="1" 
F 0 "#PWR052" H 7275 4300 50  0001 C CNN
F 1 "GND" H 7280 4385 39  0000 C CNN
F 2 "" H 7275 4550 50  0001 C CNN
F 3 "" H 7275 4550 50  0001 C CNN
	1    7275 4550
	1    0    0    -1  
$EndComp
$Comp
L power:GND #PWR?
U 1 1 5F717D46
P 6825 4550
AR Path="/5F2104BF/5F717D46" Ref="#PWR?"  Part="1" 
AR Path="/5F717D46" Ref="#PWR?"  Part="1" 
AR Path="/5F5F0002/5F717D46" Ref="#PWR?"  Part="1" 
AR Path="/5F0586F7/5F717D46" Ref="#PWR?"  Part="1" 
AR Path="/5F51B236/5F717D46" Ref="#PWR048"  Part="1" 
F 0 "#PWR048" H 6825 4300 50  0001 C CNN
F 1 "GND" H 6830 4385 39  0000 C CNN
F 2 "" H 6825 4550 50  0001 C CNN
F 3 "" H 6825 4550 50  0001 C CNN
	1    6825 4550
	1    0    0    -1  
$EndComp
$Comp
L power:GND #PWR?
U 1 1 5F717D4C
P 6475 4550
AR Path="/5F2104BF/5F717D4C" Ref="#PWR?"  Part="1" 
AR Path="/5F717D4C" Ref="#PWR?"  Part="1" 
AR Path="/5F5F0002/5F717D4C" Ref="#PWR?"  Part="1" 
AR Path="/5F0586F7/5F717D4C" Ref="#PWR?"  Part="1" 
AR Path="/5F51B236/5F717D4C" Ref="#PWR046"  Part="1" 
F 0 "#PWR046" H 6475 4300 50  0001 C CNN
F 1 "GND" H 6480 4385 39  0000 C CNN
F 2 "" H 6475 4550 50  0001 C CNN
F 3 "" H 6475 4550 50  0001 C CNN
	1    6475 4550
	1    0    0    -1  
$EndComp
Wire Wire Line
	6075 3700 6075 3775
Wire Wire Line
	6475 3700 6075 3700
Wire Wire Line
	6075 3975 6075 4100
Wire Wire Line
	6475 3700 6475 3775
Connection ~ 6475 3700
$Comp
L power:+5V #PWR?
U 1 1 5F717D57
P 6475 3700
AR Path="/5F102375/5F717D57" Ref="#PWR?"  Part="1" 
AR Path="/5F5F0002/5F717D57" Ref="#PWR?"  Part="1" 
AR Path="/5F0586F7/5F717D57" Ref="#PWR?"  Part="1" 
AR Path="/5F51B236/5F717D57" Ref="#PWR045"  Part="1" 
F 0 "#PWR045" H 6475 3550 50  0001 C CNN
F 1 "+5V" H 6475 3850 39  0000 C CNN
F 2 "" H 6475 3700 50  0001 C CNN
F 3 "" H 6475 3700 50  0001 C CNN
	1    6475 3700
	1    0    0    -1  
$EndComp
Wire Wire Line
	6475 4100 6875 4100
Wire Wire Line
	6475 4100 6475 4250
Connection ~ 6475 4100
Wire Wire Line
	6475 3975 6475 4100
$Comp
L Device:R_Small R?
U 1 1 5F717D62
P 6475 4350
AR Path="/5F2104BF/5F717D62" Ref="R?"  Part="1" 
AR Path="/5F717D62" Ref="R?"  Part="1" 
AR Path="/5F5F0002/5F717D62" Ref="R?"  Part="1" 
AR Path="/5F0586F7/5F717D62" Ref="R?"  Part="1" 
AR Path="/5F51B236/5F717D62" Ref="R14"  Part="1" 
F 0 "R14" H 6534 4388 39  0000 L CNN
F 1 "392k" H 6534 4313 39  0000 L CNN
F 2 "Resistor_SMD:R_0603_1608Metric" H 6475 4350 50  0001 C CNN
F 3 "~" H 6475 4350 50  0001 C CNN
F 4 "" H 6475 4350 50  0001 C CNN "Mfr"
	1    6475 4350
	1    0    0    -1  
$EndComp
$Comp
L Device:R_Small R?
U 1 1 5F717D69
P 6475 3875
AR Path="/5F2104BF/5F717D69" Ref="R?"  Part="1" 
AR Path="/5F717D69" Ref="R?"  Part="1" 
AR Path="/5F5F0002/5F717D69" Ref="R?"  Part="1" 
AR Path="/5F0586F7/5F717D69" Ref="R?"  Part="1" 
AR Path="/5F51B236/5F717D69" Ref="R13"  Part="1" 
F 0 "R13" H 6534 3913 39  0000 L CNN
F 1 "1M" H 6534 3838 39  0000 L CNN
F 2 "Resistor_SMD:R_0603_1608Metric" H 6475 3875 50  0001 C CNN
F 3 "~" H 6475 3875 50  0001 C CNN
F 4 "" H 6475 3875 50  0001 C CNN "Mfr"
	1    6475 3875
	1    0    0    -1  
$EndComp
Wire Wire Line
	6875 4300 6825 4300
$Comp
L Device:R_Small R?
U 1 1 5F717D71
P 6825 4400
AR Path="/5F2104BF/5F717D71" Ref="R?"  Part="1" 
AR Path="/5F717D71" Ref="R?"  Part="1" 
AR Path="/5F5F0002/5F717D71" Ref="R?"  Part="1" 
AR Path="/5F0586F7/5F717D71" Ref="R?"  Part="1" 
AR Path="/5F51B236/5F717D71" Ref="R16"  Part="1" 
F 0 "R16" H 6884 4438 39  0000 L CNN
F 1 "196k" H 6884 4363 39  0000 L CNN
F 2 "Resistor_SMD:R_0603_1608Metric" H 6825 4400 50  0001 C CNN
F 3 "~" H 6825 4400 50  0001 C CNN
F 4 "" H 6825 4400 50  0001 C CNN "Mfr"
	1    6825 4400
	1    0    0    -1  
$EndComp
$Comp
L power:GND #PWR?
U 1 1 5F717D77
P 6075 4100
AR Path="/5F2104BF/5F717D77" Ref="#PWR?"  Part="1" 
AR Path="/5F717D77" Ref="#PWR?"  Part="1" 
AR Path="/5F5F0002/5F717D77" Ref="#PWR?"  Part="1" 
AR Path="/5F0586F7/5F717D77" Ref="#PWR?"  Part="1" 
AR Path="/5F51B236/5F717D77" Ref="#PWR042"  Part="1" 
F 0 "#PWR042" H 6075 3850 50  0001 C CNN
F 1 "GND" H 6080 3935 39  0000 C CNN
F 2 "" H 6075 4100 50  0001 C CNN
F 3 "" H 6075 4100 50  0001 C CNN
	1    6075 4100
	1    0    0    -1  
$EndComp
Wire Wire Line
	7275 3700 7275 3900
$Comp
L power:+5V #PWR?
U 1 1 5F717D7E
P 7275 3700
AR Path="/5F102375/5F717D7E" Ref="#PWR?"  Part="1" 
AR Path="/5F5F0002/5F717D7E" Ref="#PWR?"  Part="1" 
AR Path="/5F0586F7/5F717D7E" Ref="#PWR?"  Part="1" 
AR Path="/5F51B236/5F717D7E" Ref="#PWR051"  Part="1" 
F 0 "#PWR051" H 7275 3550 50  0001 C CNN
F 1 "+5V" H 7275 3850 39  0000 C CNN
F 2 "" H 7275 3700 50  0001 C CNN
F 3 "" H 7275 3700 50  0001 C CNN
	1    7275 3700
	1    0    0    -1  
$EndComp
$Comp
L Device:C_Small C?
U 1 1 5F717D84
P 6075 3875
AR Path="/5EF37CE1/5F717D84" Ref="C?"  Part="1" 
AR Path="/5F717D84" Ref="C?"  Part="1" 
AR Path="/5F5F0002/5F717D84" Ref="C?"  Part="1" 
AR Path="/5F0586F7/5F717D84" Ref="C?"  Part="1" 
AR Path="/5F51B236/5F717D84" Ref="C13"  Part="1" 
F 0 "C13" H 6025 3825 39  0000 R CNN
F 1 "100n" H 6025 3925 39  0000 R CNN
F 2 "Capacitor_SMD:C_0603_1608Metric" H 6075 3875 50  0001 C CNN
F 3 "~" H 6075 3875 50  0001 C CNN
	1    6075 3875
	-1   0    0    1   
$EndComp
$Comp
L LEGOS:LTC6992 U?
U 1 1 5F717D8A
P 7275 4200
AR Path="/5F0586F7/5F717D8A" Ref="U?"  Part="1" 
AR Path="/5F51B236/5F717D8A" Ref="U11"  Part="1" 
F 0 "U11" H 7425 4525 39  0000 L CNN
F 1 "LTC6992CS6-1" H 7425 4425 39  0000 L CNN
F 2 "Package_TO_SOT_SMD:TSOT-23-6" H 7275 3800 50  0001 C CNN
F 3 "https://www.mouser.de/datasheet/2/609/LTC6992-1-6992-2-6992-3-6992-4-1270033.pdf" H 7325 4300 50  0001 C CNN
	1    7275 4200
	1    0    0    -1  
$EndComp
$Comp
L Motor:Fan M1
U 1 1 5F717D97
P 8475 3625
F 0 "M1" H 8225 3725 39  0000 L CNN
F 1 "Fan_IN" H 8125 3625 39  0000 L CNN
F 2 "Connector_PinSocket_2.54mm:PinSocket_1x02_P2.54mm_Vertical" H 8475 3635 50  0001 C CNN
F 3 "https://www.sunon.com/eu/PROSEARCH_FILES/(D03037450G-00)-1.pdf" H 8475 3635 50  0001 C CNN
F 4 "MF35060V1-1000U-A99" H 8475 3625 50  0001 C CNN "Mfr"
	1    8475 3625
	1    0    0    -1  
$EndComp
Wire Wire Line
	8475 3275 8475 3325
Wire Wire Line
	8475 3275 8800 3275
Connection ~ 8475 3275
Wire Wire Line
	8475 3225 8475 3275
Wire Wire Line
	8475 3900 8475 4000
Wire Wire Line
	8800 3900 8800 3725
Wire Wire Line
	8475 3900 8800 3900
Wire Wire Line
	8800 3275 8800 3425
$Comp
L Diode:BAT60A D6
U 1 1 5F717DA5
P 8800 3575
F 0 "D6" V 8762 3655 39  0000 L CNN
F 1 "BAT60A" V 8837 3655 39  0000 L CNN
F 2 "Diode_SMD:D_SOD-323" H 8800 3400 50  0001 C CNN
F 3 "https://www.infineon.com/dgdl/Infineon-BAT60ASERIES-DS-v01_01-en.pdf?fileId=db3a304313d846880113def70c9304a9" H 8800 3575 50  0001 C CNN
	1    8800 3575
	0    1    1    0   
$EndComp
$Comp
L power:GND #PWR?
U 1 1 5F717DB1
P 8475 4550
AR Path="/5F717DB1" Ref="#PWR?"  Part="1" 
AR Path="/5EFE1C3B/5F717DB1" Ref="#PWR?"  Part="1" 
AR Path="/5F25F1E7/5F717DB1" Ref="#PWR?"  Part="1" 
AR Path="/5F51B236/5F717DB1" Ref="#PWR058"  Part="1" 
F 0 "#PWR058" H 8475 4300 50  0001 C CNN
F 1 "GND" H 8480 4377 39  0000 C CNN
F 2 "" H 8475 4550 50  0001 C CNN
F 3 "" H 8475 4550 50  0001 C CNN
	1    8475 4550
	1    0    0    -1  
$EndComp
Wire Wire Line
	8475 4400 8475 4550
Connection ~ 8475 3900
Wire Wire Line
	8475 3825 8475 3900
Wire Wire Line
	8175 4200 7675 4200
Text HLabel 9675 4200 0    39   Input ~ 0
ALTERNATOR
$Comp
L Motor:Motor_DC M2
U 1 1 5F9AD557
P 10075 3525
F 0 "M2" H 10350 3525 39  0000 R CNN
F 1 "ASR00016" H 10600 3450 39  0000 R CNN
F 2 "Connector_JST:JST_SH_BM02B-SRSS-TB_1x02-1MP_P1.00mm_Vertical" H 10075 3435 50  0001 C CNN
F 3 "https://tinycircuits.com/products/200-1-gear-reduction-motor" H 10075 3435 50  0001 C CNN
	1    10075 3525
	-1   0    0    -1  
$EndComp
Wire Wire Line
	10075 3275 10075 3325
Wire Wire Line
	10075 3275 10400 3275
Connection ~ 10075 3275
Wire Wire Line
	10075 3225 10075 3275
Wire Wire Line
	10075 3900 10075 4000
Wire Wire Line
	10400 3900 10400 3725
Wire Wire Line
	10075 3900 10400 3900
Wire Wire Line
	10400 3275 10400 3425
$Comp
L Diode:BAT60A D16
U 1 1 5F9C2FE8
P 10400 3575
F 0 "D16" V 10362 3655 39  0000 L CNN
F 1 "BAT60A" V 10437 3655 39  0000 L CNN
F 2 "Diode_SMD:D_SOD-323" H 10400 3400 50  0001 C CNN
F 3 "https://www.infineon.com/dgdl/Infineon-BAT60ASERIES-DS-v01_01-en.pdf?fileId=db3a304313d846880113def70c9304a9" H 10400 3575 50  0001 C CNN
	1    10400 3575
	0    1    1    0   
$EndComp
$Comp
L power:GND #PWR?
U 1 1 5F9C2FEE
P 10075 4550
AR Path="/5F9C2FEE" Ref="#PWR?"  Part="1" 
AR Path="/5EFE1C3B/5F9C2FEE" Ref="#PWR?"  Part="1" 
AR Path="/5F25F1E7/5F9C2FEE" Ref="#PWR?"  Part="1" 
AR Path="/5F51B236/5F9C2FEE" Ref="#PWR075"  Part="1" 
F 0 "#PWR075" H 10075 4300 50  0001 C CNN
F 1 "GND" H 10080 4377 39  0000 C CNN
F 2 "" H 10075 4550 50  0001 C CNN
F 3 "" H 10075 4550 50  0001 C CNN
	1    10075 4550
	1    0    0    -1  
$EndComp
Wire Wire Line
	10075 4400 10075 4550
Connection ~ 10075 3900
Wire Wire Line
	10075 3825 10075 3900
Wire Wire Line
	9675 4200 9725 4200
$Comp
L Device:R_Small R?
U 1 1 5F9EE224
P 9725 4400
AR Path="/5F9EE224" Ref="R?"  Part="1" 
AR Path="/5F51B236/5F9EE224" Ref="R30"  Part="1" 
F 0 "R30" H 9775 4350 39  0000 L CNN
F 1 "10k" H 9775 4400 39  0000 L CNN
F 2 "Resistor_SMD:R_0603_1608Metric" H 9725 4400 50  0001 C CNN
F 3 "~" H 9725 4400 50  0001 C CNN
	1    9725 4400
	-1   0    0    1   
$EndComp
$Comp
L power:GND #PWR?
U 1 1 5F9EE22A
P 9725 4550
AR Path="/5F9EE22A" Ref="#PWR?"  Part="1" 
AR Path="/5EFE1C3B/5F9EE22A" Ref="#PWR?"  Part="1" 
AR Path="/5F25F1E7/5F9EE22A" Ref="#PWR?"  Part="1" 
AR Path="/5F51B236/5F9EE22A" Ref="#PWR073"  Part="1" 
F 0 "#PWR073" H 9725 4300 50  0001 C CNN
F 1 "GND" H 9730 4377 39  0000 C CNN
F 2 "" H 9725 4550 50  0001 C CNN
F 3 "" H 9725 4550 50  0001 C CNN
	1    9725 4550
	1    0    0    -1  
$EndComp
Wire Wire Line
	9725 4500 9725 4550
Wire Wire Line
	9725 4300 9725 4200
Connection ~ 9725 4200
Wire Wire Line
	9725 4200 9775 4200
$Comp
L power:+5V #PWR?
U 1 1 5F9FCFBC
P 10075 3225
AR Path="/5F112078/5F9FCFBC" Ref="#PWR?"  Part="1" 
AR Path="/5F9FCFBC" Ref="#PWR?"  Part="1" 
AR Path="/5F25F1E7/5F9FCFBC" Ref="#PWR?"  Part="1" 
AR Path="/5F51B236/5F9FCFBC" Ref="#PWR074"  Part="1" 
F 0 "#PWR074" H 10075 3075 50  0001 C CNN
F 1 "+5V" H 10075 3375 39  0000 C CNN
F 2 "" H 10075 3225 50  0001 C CNN
F 3 "" H 10075 3225 50  0001 C CNN
	1    10075 3225
	1    0    0    -1  
$EndComp
$Comp
L power:+5V #PWR?
U 1 1 5F71CFEE
P 8475 3225
AR Path="/5F102375/5F71CFEE" Ref="#PWR?"  Part="1" 
AR Path="/5F5F0002/5F71CFEE" Ref="#PWR?"  Part="1" 
AR Path="/5F0586F7/5F71CFEE" Ref="#PWR?"  Part="1" 
AR Path="/5F51B236/5F71CFEE" Ref="#PWR0101"  Part="1" 
F 0 "#PWR0101" H 8475 3075 50  0001 C CNN
F 1 "+5V" H 8475 3375 39  0000 C CNN
F 2 "" H 8475 3225 50  0001 C CNN
F 3 "" H 8475 3225 50  0001 C CNN
	1    8475 3225
	1    0    0    -1  
$EndComp
Text Label 1925 6525 0    39   ~ 0
HIGH
Text Label 1925 6325 0    39   ~ 0
LOW
Wire Wire Line
	1925 6525 1850 6525
Wire Wire Line
	1925 6325 1850 6325
$Comp
L power:GND #PWR?
U 1 1 5FC1BB70
P 1250 6725
AR Path="/5FC1BB70" Ref="#PWR?"  Part="1" 
AR Path="/5EFE1C3B/5FC1BB70" Ref="#PWR?"  Part="1" 
AR Path="/5F25F1E7/5FC1BB70" Ref="#PWR?"  Part="1" 
AR Path="/5F51B236/5FC1BB70" Ref="#PWR0105"  Part="1" 
F 0 "#PWR0105" H 1250 6475 50  0001 C CNN
F 1 "GND" H 1255 6552 39  0000 C CNN
F 2 "" H 1250 6725 50  0001 C CNN
F 3 "" H 1250 6725 50  0001 C CNN
	1    1250 6725
	1    0    0    -1  
$EndComp
Wire Wire Line
	1000 6425 925  6425
$Comp
L LEGOS:TMUX1219 U12
U 1 1 5FC0728D
P 1400 6425
F 0 "U12" H 1400 6825 39  0000 C CNN
F 1 "TMUX1219DBVR" H 1550 6725 39  0000 C CNN
F 2 "Package_TO_SOT_SMD:SOT-23-6" H 1550 6225 50  0001 C CNN
F 3 "https://www.ti.com/lit/ds/symlink/tmux1219.pdf" H 1550 6525 50  0001 C CNN
	1    1400 6425
	1    0    0    -1  
$EndComp
Connection ~ 3475 1725
$Comp
L Device:C_Small C?
U 1 1 5F5A9CC8
P 2775 1825
AR Path="/5EF37CE1/5F5A9CC8" Ref="C?"  Part="1" 
AR Path="/5F5A9CC8" Ref="C?"  Part="1" 
AR Path="/5F5F0002/5F5A9CC8" Ref="C?"  Part="1" 
AR Path="/5F0586F7/5F5A9CC8" Ref="C?"  Part="1" 
AR Path="/5F51B236/5F5A9CC8" Ref="C12"  Part="1" 
F 0 "C12" H 2725 1775 39  0000 R CNN
F 1 "100n" H 2725 1875 39  0000 R CNN
F 2 "Capacitor_SMD:C_0603_1608Metric" H 2775 1825 50  0001 C CNN
F 3 "~" H 2775 1825 50  0001 C CNN
	1    2775 1825
	-1   0    0    1   
$EndComp
$Comp
L power:GND #PWR?
U 1 1 5F5A9CBB
P 2775 1925
AR Path="/5F2104BF/5F5A9CBB" Ref="#PWR?"  Part="1" 
AR Path="/5F5A9CBB" Ref="#PWR?"  Part="1" 
AR Path="/5F5F0002/5F5A9CBB" Ref="#PWR?"  Part="1" 
AR Path="/5F0586F7/5F5A9CBB" Ref="#PWR?"  Part="1" 
AR Path="/5F51B236/5F5A9CBB" Ref="#PWR041"  Part="1" 
F 0 "#PWR041" H 2775 1675 50  0001 C CNN
F 1 "GND" H 2780 1760 39  0000 C CNN
F 2 "" H 2775 1925 50  0001 C CNN
F 3 "" H 2775 1925 50  0001 C CNN
	1    2775 1925
	1    0    0    -1  
$EndComp
Wire Wire Line
	1200 2025 950  2025
Connection ~ 1200 2025
Wire Wire Line
	950  2550 950  2625
$Comp
L power:GND #PWR?
U 1 1 5FD9052C
P 950 2625
AR Path="/5F2104BF/5FD9052C" Ref="#PWR?"  Part="1" 
AR Path="/5FD9052C" Ref="#PWR?"  Part="1" 
AR Path="/5F5F0002/5FD9052C" Ref="#PWR?"  Part="1" 
AR Path="/5F0586F7/5FD9052C" Ref="#PWR?"  Part="1" 
AR Path="/5F51B236/5FD9052C" Ref="#PWR0106"  Part="1" 
F 0 "#PWR0106" H 950 2375 50  0001 C CNN
F 1 "GND" H 955 2460 39  0000 C CNN
F 2 "" H 950 2625 50  0001 C CNN
F 3 "" H 950 2625 50  0001 C CNN
	1    950  2625
	-1   0    0    -1  
$EndComp
Wire Wire Line
	1200 2625 1200 2550
$Comp
L power:+5V #PWR?
U 1 1 5FD90533
P 1200 2625
AR Path="/5F102375/5FD90533" Ref="#PWR?"  Part="1" 
AR Path="/5F5F0002/5FD90533" Ref="#PWR?"  Part="1" 
AR Path="/5F0586F7/5FD90533" Ref="#PWR?"  Part="1" 
AR Path="/5F51B236/5FD90533" Ref="#PWR0107"  Part="1" 
F 0 "#PWR0107" H 1200 2475 50  0001 C CNN
F 1 "+5V" H 1200 2775 39  0000 C CNN
F 2 "" H 1200 2625 50  0001 C CNN
F 3 "" H 1200 2625 50  0001 C CNN
	1    1200 2625
	1    0    0    1   
$EndComp
Wire Wire Line
	950  2225 950  2350
Wire Wire Line
	1200 2350 1200 2225
Wire Wire Line
	1200 2225 950  2225
$Comp
L Device:R_Small R?
U 1 1 5FD90543
P 950 2450
AR Path="/5F2104BF/5FD90543" Ref="R?"  Part="1" 
AR Path="/5FD90543" Ref="R?"  Part="1" 
AR Path="/5F5F0002/5FD90543" Ref="R?"  Part="1" 
AR Path="/5F0586F7/5FD90543" Ref="R?"  Part="1" 
AR Path="/5F51B236/5FD90543" Ref="R33"  Part="1" 
F 0 "R33" H 1009 2488 39  0000 L CNN
F 1 "1M" H 1009 2413 39  0000 L CNN
F 2 "Resistor_SMD:R_0603_1608Metric" H 950 2450 50  0001 C CNN
F 3 "~" H 950 2450 50  0001 C CNN
F 4 "" H 950 2450 50  0001 C CNN "Mfr"
	1    950  2450
	-1   0    0    1   
$EndComp
$Comp
L Device:R_Small R?
U 1 1 5FD9053C
P 1200 2450
AR Path="/5F2104BF/5FD9053C" Ref="R?"  Part="1" 
AR Path="/5FD9053C" Ref="R?"  Part="1" 
AR Path="/5F5F0002/5FD9053C" Ref="R?"  Part="1" 
AR Path="/5F0586F7/5FD9053C" Ref="R?"  Part="1" 
AR Path="/5F51B236/5FD9053C" Ref="R35"  Part="1" 
F 0 "R35" H 1259 2488 39  0000 L CNN
F 1 "392k" H 1259 2413 39  0000 L CNN
F 2 "Resistor_SMD:R_0603_1608Metric" H 1200 2450 50  0001 C CNN
F 3 "~" H 1200 2450 50  0001 C CNN
F 4 "" H 1200 2450 50  0001 C CNN "Mfr"
	1    1200 2450
	1    0    0    -1  
$EndComp
$Comp
L LEGOS:TMUX1219 U13
U 1 1 5FDD0DAD
P 2050 2125
F 0 "U13" H 2050 2525 39  0000 C CNN
F 1 "TMUX1219DBVR" H 2200 2425 39  0000 C CNN
F 2 "Package_TO_SOT_SMD:SOT-23-6" H 2200 1925 50  0001 C CNN
F 3 "https://www.ti.com/lit/ds/symlink/tmux1219.pdf" H 2200 2225 50  0001 C CNN
	1    2050 2125
	-1   0    0    -1  
$EndComp
Wire Wire Line
	1600 2225 1200 2225
Connection ~ 1200 2225
Wire Wire Line
	2450 2125 3075 2125
$Comp
L Device:C_Small C?
U 1 1 5FDF91F3
P 2575 1825
AR Path="/5EF37CE1/5FDF91F3" Ref="C?"  Part="1" 
AR Path="/5FDF91F3" Ref="C?"  Part="1" 
AR Path="/5F5F0002/5FDF91F3" Ref="C?"  Part="1" 
AR Path="/5F0586F7/5FDF91F3" Ref="C?"  Part="1" 
AR Path="/5F51B236/5FDF91F3" Ref="C15"  Part="1" 
F 0 "C15" H 2525 1775 39  0000 R CNN
F 1 "100n" H 2525 1875 39  0000 R CNN
F 2 "Capacitor_SMD:C_0603_1608Metric" H 2575 1825 50  0001 C CNN
F 3 "~" H 2575 1825 50  0001 C CNN
	1    2575 1825
	1    0    0    1   
$EndComp
$Comp
L power:GND #PWR?
U 1 1 5FDF91F9
P 2575 1925
AR Path="/5F2104BF/5FDF91F9" Ref="#PWR?"  Part="1" 
AR Path="/5FDF91F9" Ref="#PWR?"  Part="1" 
AR Path="/5F5F0002/5FDF91F9" Ref="#PWR?"  Part="1" 
AR Path="/5F0586F7/5FDF91F9" Ref="#PWR?"  Part="1" 
AR Path="/5F51B236/5FDF91F9" Ref="#PWR0108"  Part="1" 
F 0 "#PWR0108" H 2575 1675 50  0001 C CNN
F 1 "GND" H 2580 1760 39  0000 C CNN
F 2 "" H 2575 1925 50  0001 C CNN
F 3 "" H 2575 1925 50  0001 C CNN
	1    2575 1925
	-1   0    0    -1  
$EndComp
Wire Wire Line
	2200 1825 2200 1725
Wire Wire Line
	2200 1725 2575 1725
$Comp
L power:+5V #PWR?
U 1 1 5FE12183
P 2200 1725
AR Path="/5F102375/5FE12183" Ref="#PWR?"  Part="1" 
AR Path="/5F5F0002/5FE12183" Ref="#PWR?"  Part="1" 
AR Path="/5F0586F7/5FE12183" Ref="#PWR?"  Part="1" 
AR Path="/5F51B236/5FE12183" Ref="#PWR0109"  Part="1" 
F 0 "#PWR0109" H 2200 1575 50  0001 C CNN
F 1 "+5V" H 2200 1875 39  0000 C CNN
F 2 "" H 2200 1725 50  0001 C CNN
F 3 "" H 2200 1725 50  0001 C CNN
	1    2200 1725
	1    0    0    -1  
$EndComp
Connection ~ 2200 1725
$Comp
L power:GND #PWR?
U 1 1 5FE1309D
P 2200 2425
AR Path="/5FE1309D" Ref="#PWR?"  Part="1" 
AR Path="/5EFE1C3B/5FE1309D" Ref="#PWR?"  Part="1" 
AR Path="/5F25F1E7/5FE1309D" Ref="#PWR?"  Part="1" 
AR Path="/5F51B236/5FE1309D" Ref="#PWR0110"  Part="1" 
F 0 "#PWR0110" H 2200 2175 50  0001 C CNN
F 1 "GND" H 2205 2252 39  0000 C CNN
F 2 "" H 2200 2425 50  0001 C CNN
F 3 "" H 2200 2425 50  0001 C CNN
	1    2200 2425
	1    0    0    -1  
$EndComp
$Comp
L Device:C_Small C?
U 1 1 5FE2ADD4
P 625 6125
AR Path="/5EF37CE1/5FE2ADD4" Ref="C?"  Part="1" 
AR Path="/5FE2ADD4" Ref="C?"  Part="1" 
AR Path="/5F5F0002/5FE2ADD4" Ref="C?"  Part="1" 
AR Path="/5F0586F7/5FE2ADD4" Ref="C?"  Part="1" 
AR Path="/5F51B236/5FE2ADD4" Ref="C14"  Part="1" 
F 0 "C14" H 575 6075 39  0000 R CNN
F 1 "100n" H 575 6175 39  0000 R CNN
F 2 "Capacitor_SMD:C_0603_1608Metric" H 625 6125 50  0001 C CNN
F 3 "~" H 625 6125 50  0001 C CNN
	1    625  6125
	-1   0    0    1   
$EndComp
Wire Wire Line
	1250 6125 1250 6025
$Comp
L power:+5V #PWR?
U 1 1 5FE2ADDC
P 1250 6025
AR Path="/5F102375/5FE2ADDC" Ref="#PWR?"  Part="1" 
AR Path="/5F5F0002/5FE2ADDC" Ref="#PWR?"  Part="1" 
AR Path="/5F0586F7/5FE2ADDC" Ref="#PWR?"  Part="1" 
AR Path="/5F51B236/5FE2ADDC" Ref="#PWR0111"  Part="1" 
F 0 "#PWR0111" H 1250 5875 50  0001 C CNN
F 1 "+5V" H 1250 6175 39  0000 C CNN
F 2 "" H 1250 6025 50  0001 C CNN
F 3 "" H 1250 6025 50  0001 C CNN
	1    1250 6025
	-1   0    0    -1  
$EndComp
Connection ~ 1250 6025
$Comp
L power:GND #PWR?
U 1 1 5FE32A95
P 625 6225
AR Path="/5FE32A95" Ref="#PWR?"  Part="1" 
AR Path="/5EFE1C3B/5FE32A95" Ref="#PWR?"  Part="1" 
AR Path="/5F25F1E7/5FE32A95" Ref="#PWR?"  Part="1" 
AR Path="/5F51B236/5FE32A95" Ref="#PWR0112"  Part="1" 
F 0 "#PWR0112" H 625 5975 50  0001 C CNN
F 1 "GND" H 630 6052 39  0000 C CNN
F 2 "" H 625 6225 50  0001 C CNN
F 3 "" H 625 6225 50  0001 C CNN
	1    625  6225
	1    0    0    -1  
$EndComp
Wire Wire Line
	625  6025 925  6025
Wire Wire Line
	925  6425 925  6025
Connection ~ 925  6025
Wire Wire Line
	925  6025 1250 6025
Text Label 1600 2025 2    39   ~ 0
POL+
Text Label 1600 2225 2    39   ~ 0
POL-
Connection ~ 4650 6075
Connection ~ 4000 6075
$Comp
L Device:R_Small R?
U 1 1 5F60DAA6
P 3025 6225
AR Path="/5F60DAA6" Ref="R?"  Part="1" 
AR Path="/5EFE1C3B/5F60DAA6" Ref="R?"  Part="1" 
AR Path="/5F25F1E7/5F60DAA6" Ref="R?"  Part="1" 
AR Path="/5F51B236/5F60DAA6" Ref="R22"  Part="1" 
F 0 "R22" H 3084 6271 39  0000 L CNN
F 1 "220" H 3084 6180 39  0000 L CNN
F 2 "Resistor_SMD:R_0603_1608Metric" H 3025 6225 50  0001 C CNN
F 3 "~" H 3025 6225 50  0001 C CNN
	1    3025 6225
	1    0    0    -1  
$EndComp
$Comp
L Device:R_Small R?
U 1 1 5F65DF36
P 5325 1825
AR Path="/5F65DF36" Ref="R?"  Part="1" 
AR Path="/5EFE1C3B/5F65DF36" Ref="R?"  Part="1" 
AR Path="/5F25F1E7/5F65DF36" Ref="R?"  Part="1" 
AR Path="/5F51B236/5F65DF36" Ref="R21"  Part="1" 
F 0 "R21" H 5384 1871 39  0000 L CNN
F 1 "110" H 5384 1780 39  0000 L CNN
F 2 "Resistor_SMD:R_0603_1608Metric" H 5325 1825 50  0001 C CNN
F 3 "~" H 5325 1825 50  0001 C CNN
	1    5325 1825
	1    0    0    1   
$EndComp
Wire Wire Line
	2025 5725 2025 5825
Wire Wire Line
	2025 5525 2025 5475
$Comp
L Device:R_Small R?
U 1 1 5FF10789
P 2025 5625
AR Path="/5FF10789" Ref="R?"  Part="1" 
AR Path="/5F51B236/5FF10789" Ref="R40"  Part="1" 
F 0 "R40" H 2075 5575 39  0000 L CNN
F 1 "10k" H 2075 5625 39  0000 L CNN
F 2 "Resistor_SMD:R_0603_1608Metric" H 2025 5625 50  0001 C CNN
F 3 "~" H 2025 5625 50  0001 C CNN
	1    2025 5625
	1    0    0    -1  
$EndComp
$Comp
L power:+5V #PWR?
U 1 1 5FF188D4
P 2025 5475
AR Path="/5F112078/5FF188D4" Ref="#PWR?"  Part="1" 
AR Path="/5FF188D4" Ref="#PWR?"  Part="1" 
AR Path="/5F25F1E7/5FF188D4" Ref="#PWR?"  Part="1" 
AR Path="/5F51B236/5FF188D4" Ref="#PWR0113"  Part="1" 
F 0 "#PWR0113" H 2025 5325 50  0001 C CNN
F 1 "+5V" H 2025 5625 39  0000 C CNN
F 2 "" H 2025 5475 50  0001 C CNN
F 3 "" H 2025 5475 50  0001 C CNN
	1    2025 5475
	1    0    0    -1  
$EndComp
Connection ~ 2025 5825
Wire Wire Line
	2025 5825 2075 5825
Wire Wire Line
	4325 2325 4325 2225
Wire Wire Line
	4325 2525 4325 2575
$Comp
L power:GND #PWR?
U 1 1 5FF1F4AC
P 4325 2575
AR Path="/5FF1F4AC" Ref="#PWR?"  Part="1" 
AR Path="/5EFE1C3B/5FF1F4AC" Ref="#PWR?"  Part="1" 
AR Path="/5F25F1E7/5FF1F4AC" Ref="#PWR?"  Part="1" 
AR Path="/5F51B236/5FF1F4AC" Ref="#PWR0114"  Part="1" 
F 0 "#PWR0114" H 4325 2325 50  0001 C CNN
F 1 "GND" H 4330 2402 39  0000 C CNN
F 2 "" H 4325 2575 50  0001 C CNN
F 3 "" H 4325 2575 50  0001 C CNN
	1    4325 2575
	1    0    0    -1  
$EndComp
$Comp
L Device:R_Small R?
U 1 1 5FF1F4B2
P 4325 2425
AR Path="/5FF1F4B2" Ref="R?"  Part="1" 
AR Path="/5F51B236/5FF1F4B2" Ref="R41"  Part="1" 
F 0 "R41" H 4375 2375 39  0000 L CNN
F 1 "10k" H 4375 2425 39  0000 L CNN
F 2 "Resistor_SMD:R_0603_1608Metric" H 4325 2425 50  0001 C CNN
F 3 "~" H 4325 2425 50  0001 C CNN
	1    4325 2425
	-1   0    0    1   
$EndComp
Connection ~ 4325 2225
Wire Wire Line
	4325 2225 4375 2225
Wire Wire Line
	4650 6075 4000 6075
$Comp
L LEGOS:TLV4041R5 U14
U 1 1 5F8BD3F6
P 2700 3575
F 0 "U14" H 2875 3375 39  0000 L CNN
F 1 "TLV4041R5" H 2875 3275 39  0000 L CNN
F 2 "Package_TO_SOT_SMD:SOT-23-5" H 2700 3175 50  0001 C CNN
F 3 "https://www.ti.com/lit/ds/symlink/tlv4041.pdf" H 2850 3775 50  0001 C CNN
	1    2700 3575
	-1   0    0    -1  
$EndComp
Wire Wire Line
	2900 2975 2900 3575
$Comp
L power:+5V #PWR?
U 1 1 5F8C6E42
P 2700 3275
AR Path="/5F102375/5F8C6E42" Ref="#PWR?"  Part="1" 
AR Path="/5F5F0002/5F8C6E42" Ref="#PWR?"  Part="1" 
AR Path="/5F0586F7/5F8C6E42" Ref="#PWR?"  Part="1" 
AR Path="/5F51B236/5F8C6E42" Ref="#PWR0115"  Part="1" 
F 0 "#PWR0115" H 2700 3125 50  0001 C CNN
F 1 "+5V" H 2700 3425 39  0000 C CNN
F 2 "" H 2700 3275 50  0001 C CNN
F 3 "" H 2700 3275 50  0001 C CNN
	1    2700 3275
	-1   0    0    -1  
$EndComp
$Comp
L power:GND #PWR?
U 1 1 5F8C74B3
P 2700 3875
AR Path="/5F2104BF/5F8C74B3" Ref="#PWR?"  Part="1" 
AR Path="/5F8C74B3" Ref="#PWR?"  Part="1" 
AR Path="/5F5F0002/5F8C74B3" Ref="#PWR?"  Part="1" 
AR Path="/5F0586F7/5F8C74B3" Ref="#PWR?"  Part="1" 
AR Path="/5F51B236/5F8C74B3" Ref="#PWR0116"  Part="1" 
F 0 "#PWR0116" H 2700 3625 50  0001 C CNN
F 1 "GND" H 2705 3710 39  0000 C CNN
F 2 "" H 2700 3875 50  0001 C CNN
F 3 "" H 2700 3875 50  0001 C CNN
	1    2700 3875
	-1   0    0    -1  
$EndComp
$Comp
L Device:C_Small C?
U 1 1 5F8CD22B
P 3225 3575
AR Path="/5EF37CE1/5F8CD22B" Ref="C?"  Part="1" 
AR Path="/5F8CD22B" Ref="C?"  Part="1" 
AR Path="/5F5F0002/5F8CD22B" Ref="C?"  Part="1" 
AR Path="/5F0586F7/5F8CD22B" Ref="C?"  Part="1" 
AR Path="/5F51B236/5F8CD22B" Ref="C16"  Part="1" 
F 0 "C16" H 3175 3525 39  0000 R CNN
F 1 "100n" H 3175 3625 39  0000 R CNN
F 2 "Capacitor_SMD:C_0603_1608Metric" H 3225 3575 50  0001 C CNN
F 3 "~" H 3225 3575 50  0001 C CNN
	1    3225 3575
	1    0    0    1   
$EndComp
$Comp
L power:GND #PWR?
U 1 1 5F8CD231
P 3225 3675
AR Path="/5F2104BF/5F8CD231" Ref="#PWR?"  Part="1" 
AR Path="/5F8CD231" Ref="#PWR?"  Part="1" 
AR Path="/5F5F0002/5F8CD231" Ref="#PWR?"  Part="1" 
AR Path="/5F0586F7/5F8CD231" Ref="#PWR?"  Part="1" 
AR Path="/5F51B236/5F8CD231" Ref="#PWR0117"  Part="1" 
F 0 "#PWR0117" H 3225 3425 50  0001 C CNN
F 1 "GND" H 3230 3510 39  0000 C CNN
F 2 "" H 3225 3675 50  0001 C CNN
F 3 "" H 3225 3675 50  0001 C CNN
	1    3225 3675
	-1   0    0    -1  
$EndComp
Wire Wire Line
	2700 3275 3225 3275
Wire Wire Line
	3225 3275 3225 3475
Connection ~ 2700 3275
Text Label 1950 3575 0    39   ~ 0
LEVEL
Text Label 1550 6850 2    39   ~ 0
LEVEL
Wire Wire Line
	1550 6725 1550 6850
$Comp
L Device:Q_NMOS_GSD Q6
U 1 1 5F9E465C
P 4550 7000
F 0 "Q6" H 4750 6900 39  0000 L CNN
F 1 "Si2302CDS" H 4750 6825 39  0000 L CNN
F 2 "Package_TO_SOT_SMD:SOT-23" H 4750 7100 50  0001 C CNN
F 3 "https://eu.mouser.com/datasheet/2/427/si2302cds-1764899.pdf" H 4550 7000 50  0001 C CNN
	1    4550 7000
	1    0    0    -1  
$EndComp
$Comp
L Device:Q_NMOS_GSD Q3
U 1 1 5F9E67A7
P 8375 4200
F 0 "Q3" H 8575 4100 39  0000 L CNN
F 1 "Si2302CDS" H 8575 4025 39  0000 L CNN
F 2 "Package_TO_SOT_SMD:SOT-23" H 8575 4300 50  0001 C CNN
F 3 "https://eu.mouser.com/datasheet/2/427/si2302cds-1764899.pdf" H 8375 4200 50  0001 C CNN
	1    8375 4200
	1    0    0    -1  
$EndComp
$Comp
L Device:Q_NMOS_GSD Q5
U 1 1 5F9EBC6A
P 9975 4200
F 0 "Q5" H 10175 4100 39  0000 L CNN
F 1 "Si2302CDS" H 10175 4025 39  0000 L CNN
F 2 "Package_TO_SOT_SMD:SOT-23" H 10175 4300 50  0001 C CNN
F 3 "https://eu.mouser.com/datasheet/2/427/si2302cds-1764899.pdf" H 9975 4200 50  0001 C CNN
	1    9975 4200
	1    0    0    -1  
$EndComp
$Comp
L Device:Q_NMOS_GSD Q1
U 1 1 5F9EEB2A
P 4575 2225
F 0 "Q1" H 4775 2125 39  0000 L CNN
F 1 "Si2302CDS" H 4775 2050 39  0000 L CNN
F 2 "Package_TO_SOT_SMD:SOT-23" H 4775 2325 50  0001 C CNN
F 3 "https://eu.mouser.com/datasheet/2/427/si2302cds-1764899.pdf" H 4575 2225 50  0001 C CNN
	1    4575 2225
	1    0    0    -1  
$EndComp
Connection ~ 2900 2975
Wire Wire Line
	1900 3575 2200 3575
Wire Wire Line
	1900 2425 1900 3575
$EndSCHEMATC
