EESchema Schematic File Version 4
EELAYER 30 0
EELAYER END
$Descr A4 11693 8268
encoding utf-8
Sheet 1 1
Title "Node"
Date "2020-09-04"
Rev "1.2"
Comp "Institute for Automation of Complex Power Systems - E.ON ERC - RWTH Aachen University"
Comment1 "Designer: D. Wienands, S. Melcher, L. Jeske, D. Moll"
Comment2 "Supervisor: C. Guarnieri Calò Carducci"
Comment3 ""
Comment4 ""
$EndDescr
Wire Wire Line
	4450 2275 4400 2275
Wire Wire Line
	4400 2275 4400 2425
$Comp
L power:GND #PWR0108
U 1 1 5E91EEBA
P 4650 2525
F 0 "#PWR0108" H 4650 2275 50  0001 C CNN
F 1 "GND" H 4655 2352 50  0000 C CNN
F 2 "" H 4650 2525 50  0001 C CNN
F 3 "" H 4650 2525 50  0001 C CNN
	1    4650 2525
	1    0    0    -1  
$EndComp
Wire Wire Line
	4450 3775 4400 3775
Wire Wire Line
	4400 3775 4400 3925
$Comp
L power:GND #PWR0109
U 1 1 5E92085D
P 4650 4025
F 0 "#PWR0109" H 4650 3775 50  0001 C CNN
F 1 "GND" H 4655 3852 50  0000 C CNN
F 2 "" H 4650 4025 50  0001 C CNN
F 3 "" H 4650 4025 50  0001 C CNN
	1    4650 4025
	1    0    0    -1  
$EndComp
Wire Wire Line
	4450 5275 4400 5275
Wire Wire Line
	4400 5275 4400 5425
$Comp
L power:GND #PWR0110
U 1 1 5E920F21
P 4650 5525
F 0 "#PWR0110" H 4650 5275 50  0001 C CNN
F 1 "GND" H 4655 5352 50  0000 C CNN
F 2 "" H 4650 5525 50  0001 C CNN
F 3 "" H 4650 5525 50  0001 C CNN
	1    4650 5525
	1    0    0    -1  
$EndComp
Wire Wire Line
	8450 2275 8400 2275
Wire Wire Line
	8400 2275 8400 2425
$Comp
L power:GND #PWR0111
U 1 1 5E92197F
P 8650 2525
F 0 "#PWR0111" H 8650 2275 50  0001 C CNN
F 1 "GND" H 8655 2352 50  0000 C CNN
F 2 "" H 8650 2525 50  0001 C CNN
F 3 "" H 8650 2525 50  0001 C CNN
	1    8650 2525
	1    0    0    -1  
$EndComp
Wire Wire Line
	8450 3775 8400 3775
Wire Wire Line
	8400 3775 8400 3925
$Comp
L power:GND #PWR0112
U 1 1 5E9221CE
P 8650 4025
F 0 "#PWR0112" H 8650 3775 50  0001 C CNN
F 1 "GND" H 8655 3852 50  0000 C CNN
F 2 "" H 8650 4025 50  0001 C CNN
F 3 "" H 8650 4025 50  0001 C CNN
	1    8650 4025
	1    0    0    -1  
$EndComp
Wire Wire Line
	8450 5275 8400 5275
Wire Wire Line
	8400 5275 8400 5425
$Comp
L power:GND #PWR0113
U 1 1 5E922CB4
P 8650 5525
F 0 "#PWR0113" H 8650 5275 50  0001 C CNN
F 1 "GND" H 8655 5352 50  0000 C CNN
F 2 "" H 8650 5525 50  0001 C CNN
F 3 "" H 8650 5525 50  0001 C CNN
	1    8650 5525
	1    0    0    -1  
$EndComp
$Comp
L power:GND #PWR0114
U 1 1 5E92790C
P 6550 4175
F 0 "#PWR0114" H 6550 3925 50  0001 C CNN
F 1 "GND" H 6555 4002 50  0000 C CNN
F 2 "" H 6550 4175 50  0001 C CNN
F 3 "" H 6550 4175 50  0001 C CNN
	1    6550 4175
	1    0    0    -1  
$EndComp
Text Label 4150 2425 0    38   ~ 0
ID_1
$Comp
L LEGOS:DS28E07 IC1
U 1 1 5ECF6129
P 4650 2325
F 0 "IC1" H 4650 2470 50  0000 C CNN
F 1 "DS28E07" H 4780 2242 25  0000 L CNN
F 2 "Package_SO_J-Lead:TSOC-6_3.76x3.94mm_P1.27mm" H 5000 2625 50  0001 L CNN
F 3 "https://www.mouser.de/datasheet/2/256/DS28E07-952439.pdf" H 5000 2525 50  0001 L CNN
F 4 "1-Wire EEPROM" H 5000 2425 50  0001 L CNN "Description"
F 5 "700-DS28E07P+" H 5000 2225 50  0001 L CNN "Mouser Part Number"
F 6 "Maxim Integrated" H 5000 2025 50  0001 L CNN "Manufacturer_Name"
F 7 "DS28E05P+" H 5000 1925 50  0001 L CNN "Manufacturer_Part_Number"
	1    4650 2325
	1    0    0    -1  
$EndComp
$Comp
L LEGOS:DS28E07 IC2
U 1 1 5ECF6A11
P 4650 3825
F 0 "IC2" H 4650 3970 50  0000 C CNN
F 1 "DS28E07" H 4780 3742 25  0000 L CNN
F 2 "Package_SO_J-Lead:TSOC-6_3.76x3.94mm_P1.27mm" H 5000 4125 50  0001 L CNN
F 3 "https://www.mouser.de/datasheet/2/256/DS28E07-952439.pdf" H 5000 4025 50  0001 L CNN
F 4 "1-Wire EEPROM" H 5000 3925 50  0001 L CNN "Description"
F 5 "700-DS28E07P+" H 5000 3725 50  0001 L CNN "Mouser Part Number"
F 6 "Maxim Integrated" H 5000 3525 50  0001 L CNN "Manufacturer_Name"
F 7 "DS28E05P+" H 5000 3425 50  0001 L CNN "Manufacturer_Part_Number"
	1    4650 3825
	1    0    0    -1  
$EndComp
$Comp
L LEGOS:DS28E07 IC3
U 1 1 5ECF76B9
P 4650 5325
F 0 "IC3" H 4650 5470 50  0000 C CNN
F 1 "DS28E07" H 4780 5242 25  0000 L CNN
F 2 "Package_SO_J-Lead:TSOC-6_3.76x3.94mm_P1.27mm" H 5000 5625 50  0001 L CNN
F 3 "https://www.mouser.de/datasheet/2/256/DS28E07-952439.pdf" H 5000 5525 50  0001 L CNN
F 4 "1-Wire EEPROM" H 5000 5425 50  0001 L CNN "Description"
F 5 "700-DS28E07P+" H 5000 5225 50  0001 L CNN "Mouser Part Number"
F 6 "Maxim Integrated" H 5000 5025 50  0001 L CNN "Manufacturer_Name"
F 7 "DS28E05P+" H 5000 4925 50  0001 L CNN "Manufacturer_Part_Number"
	1    4650 5325
	1    0    0    -1  
$EndComp
$Comp
L LEGOS:DS28E07 IC6
U 1 1 5ECF81F4
P 8650 2325
F 0 "IC6" H 8650 2470 50  0000 C CNN
F 1 "DS28E07" H 8780 2242 25  0000 L CNN
F 2 "Package_SO_J-Lead:TSOC-6_3.76x3.94mm_P1.27mm" H 9000 2625 50  0001 L CNN
F 3 "https://www.mouser.de/datasheet/2/256/DS28E07-952439.pdf" H 9000 2525 50  0001 L CNN
F 4 "1-Wire EEPROM" H 9000 2425 50  0001 L CNN "Description"
F 5 "700-DS28E07P+" H 9000 2225 50  0001 L CNN "Mouser Part Number"
F 6 "Maxim Integrated" H 9000 2025 50  0001 L CNN "Manufacturer_Name"
F 7 "DS28E05P+" H 9000 1925 50  0001 L CNN "Manufacturer_Part_Number"
	1    8650 2325
	1    0    0    -1  
$EndComp
$Comp
L LEGOS:DS28E07 IC4
U 1 1 5ECF8D55
P 8650 5325
F 0 "IC4" H 8650 5475 50  0000 C CNN
F 1 "DS28E07" H 8780 5242 25  0000 L CNN
F 2 "Package_SO_J-Lead:TSOC-6_3.76x3.94mm_P1.27mm" H 9000 5625 50  0001 L CNN
F 3 "https://www.mouser.de/datasheet/2/256/DS28E07-952439.pdf" H 9000 5525 50  0001 L CNN
F 4 "1-Wire EEPROM" H 9000 5425 50  0001 L CNN "Description"
F 5 "700-DS28E07P+" H 9000 5225 50  0001 L CNN "Mouser Part Number"
F 6 "Maxim Integrated" H 9000 5025 50  0001 L CNN "Manufacturer_Name"
F 7 "DS28E05P+" H 9000 4925 50  0001 L CNN "Manufacturer_Part_Number"
	1    8650 5325
	1    0    0    -1  
$EndComp
$Comp
L power:GND #PWR0101
U 1 1 5F0ABE1F
P 3500 2125
F 0 "#PWR0101" H 3500 1875 50  0001 C CNN
F 1 "GND" V 3500 1925 39  0000 C CNN
F 2 "" H 3500 2125 50  0001 C CNN
F 3 "" H 3500 2125 50  0001 C CNN
	1    3500 2125
	0    1    1    0   
$EndComp
$Comp
L power:+5V #PWR0102
U 1 1 5F0AC387
P 3500 2225
F 0 "#PWR0102" H 3500 2075 50  0001 C CNN
F 1 "+5V" V 3500 2425 39  0000 C CNN
F 2 "" H 3500 2225 50  0001 C CNN
F 3 "" H 3500 2225 50  0001 C CNN
	1    3500 2225
	0    -1   -1   0   
$EndComp
$Comp
L power:+5V #PWR0103
U 1 1 5F0AD18E
P 3500 2525
F 0 "#PWR0103" H 3500 2375 50  0001 C CNN
F 1 "+5V" V 3500 2725 39  0000 C CNN
F 2 "" H 3500 2525 50  0001 C CNN
F 3 "" H 3500 2525 50  0001 C CNN
	1    3500 2525
	0    -1   -1   0   
$EndComp
$Comp
L power:GND #PWR0104
U 1 1 5F0AD3B6
P 3500 2625
F 0 "#PWR0104" H 3500 2375 50  0001 C CNN
F 1 "GND" V 3500 2425 39  0000 C CNN
F 2 "" H 3500 2625 50  0001 C CNN
F 3 "" H 3500 2625 50  0001 C CNN
	1    3500 2625
	0    1    1    0   
$EndComp
$Comp
L power:GND #PWR0105
U 1 1 5F0AD61F
P 4000 2625
F 0 "#PWR0105" H 4000 2375 50  0001 C CNN
F 1 "GND" V 4000 2425 39  0000 C CNN
F 2 "" H 4000 2625 50  0001 C CNN
F 3 "" H 4000 2625 50  0001 C CNN
	1    4000 2625
	0    -1   1    0   
$EndComp
$Comp
L power:GND #PWR0106
U 1 1 5F0ADE27
P 4000 2125
F 0 "#PWR0106" H 4000 1875 50  0001 C CNN
F 1 "GND" V 4000 1925 39  0000 C CNN
F 2 "" H 4000 2125 50  0001 C CNN
F 3 "" H 4000 2125 50  0001 C CNN
	1    4000 2125
	0    -1   1    0   
$EndComp
Wire Wire Line
	4150 2225 4000 2225
Text Label 4150 2225 0    38   ~ 0
~EN_1
$Comp
L LEGOS:VBUS #PWR0107
U 1 1 5F0B1289
P 3500 2325
F 0 "#PWR0107" H 3500 2175 50  0001 C CNN
F 1 "VBUS" V 3500 2475 39  0000 L CNN
F 2 "" H 3500 2325 50  0001 C CNN
F 3 "" H 3500 2325 50  0001 C CNN
	1    3500 2325
	0    -1   -1   0   
$EndComp
Wire Wire Line
	4000 2425 4400 2425
Text Label 4150 3925 0    38   ~ 0
ID_2
$Comp
L power:GND #PWR0117
U 1 1 5F0CFD4C
P 3500 3625
F 0 "#PWR0117" H 3500 3375 50  0001 C CNN
F 1 "GND" V 3500 3425 39  0000 C CNN
F 2 "" H 3500 3625 50  0001 C CNN
F 3 "" H 3500 3625 50  0001 C CNN
	1    3500 3625
	0    1    1    0   
$EndComp
$Comp
L power:+5V #PWR0118
U 1 1 5F0CFD52
P 3500 3725
F 0 "#PWR0118" H 3500 3575 50  0001 C CNN
F 1 "+5V" V 3500 3925 39  0000 C CNN
F 2 "" H 3500 3725 50  0001 C CNN
F 3 "" H 3500 3725 50  0001 C CNN
	1    3500 3725
	0    -1   -1   0   
$EndComp
$Comp
L power:+5V #PWR0119
U 1 1 5F0CFD58
P 3500 4025
F 0 "#PWR0119" H 3500 3875 50  0001 C CNN
F 1 "+5V" V 3500 4225 39  0000 C CNN
F 2 "" H 3500 4025 50  0001 C CNN
F 3 "" H 3500 4025 50  0001 C CNN
	1    3500 4025
	0    -1   -1   0   
$EndComp
$Comp
L power:GND #PWR0120
U 1 1 5F0CFD5E
P 3500 4125
F 0 "#PWR0120" H 3500 3875 50  0001 C CNN
F 1 "GND" V 3500 3925 39  0000 C CNN
F 2 "" H 3500 4125 50  0001 C CNN
F 3 "" H 3500 4125 50  0001 C CNN
	1    3500 4125
	0    1    1    0   
$EndComp
$Comp
L power:GND #PWR0122
U 1 1 5F0CFD64
P 4000 4125
F 0 "#PWR0122" H 4000 3875 50  0001 C CNN
F 1 "GND" V 4000 3925 39  0000 C CNN
F 2 "" H 4000 4125 50  0001 C CNN
F 3 "" H 4000 4125 50  0001 C CNN
	1    4000 4125
	0    -1   1    0   
$EndComp
$Comp
L power:GND #PWR0123
U 1 1 5F0CFD6A
P 4000 3625
F 0 "#PWR0123" H 4000 3375 50  0001 C CNN
F 1 "GND" V 4000 3425 39  0000 C CNN
F 2 "" H 4000 3625 50  0001 C CNN
F 3 "" H 4000 3625 50  0001 C CNN
	1    4000 3625
	0    -1   1    0   
$EndComp
Wire Wire Line
	4150 3725 4000 3725
Text Label 4150 3725 0    38   ~ 0
~EN_2
$Comp
L LEGOS:VBUS #PWR0124
U 1 1 5F0CFD72
P 3500 3825
F 0 "#PWR0124" H 3500 3675 50  0001 C CNN
F 1 "VBUS" V 3500 3975 39  0000 L CNN
F 2 "" H 3500 3825 50  0001 C CNN
F 3 "" H 3500 3825 50  0001 C CNN
	1    3500 3825
	0    -1   -1   0   
$EndComp
Wire Wire Line
	4000 3925 4400 3925
Text Label 4150 5425 0    38   ~ 0
ID_3
$Comp
L power:GND #PWR0126
U 1 1 5F0D3B2D
P 3500 5125
F 0 "#PWR0126" H 3500 4875 50  0001 C CNN
F 1 "GND" V 3500 4925 39  0000 C CNN
F 2 "" H 3500 5125 50  0001 C CNN
F 3 "" H 3500 5125 50  0001 C CNN
	1    3500 5125
	0    1    1    0   
$EndComp
$Comp
L power:+5V #PWR0127
U 1 1 5F0D3B33
P 3500 5225
F 0 "#PWR0127" H 3500 5075 50  0001 C CNN
F 1 "+5V" V 3500 5425 39  0000 C CNN
F 2 "" H 3500 5225 50  0001 C CNN
F 3 "" H 3500 5225 50  0001 C CNN
	1    3500 5225
	0    -1   -1   0   
$EndComp
$Comp
L power:+5V #PWR0128
U 1 1 5F0D3B39
P 3500 5525
F 0 "#PWR0128" H 3500 5375 50  0001 C CNN
F 1 "+5V" V 3500 5725 39  0000 C CNN
F 2 "" H 3500 5525 50  0001 C CNN
F 3 "" H 3500 5525 50  0001 C CNN
	1    3500 5525
	0    -1   -1   0   
$EndComp
$Comp
L power:GND #PWR0129
U 1 1 5F0D3B3F
P 3500 5625
F 0 "#PWR0129" H 3500 5375 50  0001 C CNN
F 1 "GND" V 3500 5425 39  0000 C CNN
F 2 "" H 3500 5625 50  0001 C CNN
F 3 "" H 3500 5625 50  0001 C CNN
	1    3500 5625
	0    1    1    0   
$EndComp
$Comp
L power:GND #PWR0130
U 1 1 5F0D3B45
P 4000 5625
F 0 "#PWR0130" H 4000 5375 50  0001 C CNN
F 1 "GND" V 4000 5425 39  0000 C CNN
F 2 "" H 4000 5625 50  0001 C CNN
F 3 "" H 4000 5625 50  0001 C CNN
	1    4000 5625
	0    -1   1    0   
$EndComp
$Comp
L power:GND #PWR0131
U 1 1 5F0D3B4B
P 4000 5125
F 0 "#PWR0131" H 4000 4875 50  0001 C CNN
F 1 "GND" V 4000 4925 39  0000 C CNN
F 2 "" H 4000 5125 50  0001 C CNN
F 3 "" H 4000 5125 50  0001 C CNN
	1    4000 5125
	0    -1   1    0   
$EndComp
Wire Wire Line
	4150 5225 4000 5225
Text Label 4150 5225 0    38   ~ 0
~EN_3
$Comp
L LEGOS:VBUS #PWR0132
U 1 1 5F0D3B53
P 3500 5325
F 0 "#PWR0132" H 3500 5175 50  0001 C CNN
F 1 "VBUS" V 3500 5475 39  0000 L CNN
F 2 "" H 3500 5325 50  0001 C CNN
F 3 "" H 3500 5325 50  0001 C CNN
	1    3500 5325
	0    -1   -1   0   
$EndComp
Wire Wire Line
	4000 5425 4400 5425
Text Label 8150 2425 0    38   ~ 0
ID_6
$Comp
L power:GND #PWR0134
U 1 1 5F0E72AE
P 7500 2125
F 0 "#PWR0134" H 7500 1875 50  0001 C CNN
F 1 "GND" V 7500 1925 39  0000 C CNN
F 2 "" H 7500 2125 50  0001 C CNN
F 3 "" H 7500 2125 50  0001 C CNN
	1    7500 2125
	0    1    1    0   
$EndComp
$Comp
L power:+5V #PWR0135
U 1 1 5F0E72B4
P 7500 2225
F 0 "#PWR0135" H 7500 2075 50  0001 C CNN
F 1 "+5V" V 7500 2425 39  0000 C CNN
F 2 "" H 7500 2225 50  0001 C CNN
F 3 "" H 7500 2225 50  0001 C CNN
	1    7500 2225
	0    -1   -1   0   
$EndComp
$Comp
L power:+5V #PWR0136
U 1 1 5F0E72BA
P 7500 2525
F 0 "#PWR0136" H 7500 2375 50  0001 C CNN
F 1 "+5V" V 7500 2725 39  0000 C CNN
F 2 "" H 7500 2525 50  0001 C CNN
F 3 "" H 7500 2525 50  0001 C CNN
	1    7500 2525
	0    -1   -1   0   
$EndComp
$Comp
L power:GND #PWR0137
U 1 1 5F0E72C0
P 7500 2625
F 0 "#PWR0137" H 7500 2375 50  0001 C CNN
F 1 "GND" V 7500 2425 39  0000 C CNN
F 2 "" H 7500 2625 50  0001 C CNN
F 3 "" H 7500 2625 50  0001 C CNN
	1    7500 2625
	0    1    1    0   
$EndComp
$Comp
L power:GND #PWR0138
U 1 1 5F0E72C6
P 8000 2625
F 0 "#PWR0138" H 8000 2375 50  0001 C CNN
F 1 "GND" V 8000 2425 39  0000 C CNN
F 2 "" H 8000 2625 50  0001 C CNN
F 3 "" H 8000 2625 50  0001 C CNN
	1    8000 2625
	0    -1   1    0   
$EndComp
$Comp
L power:GND #PWR0139
U 1 1 5F0E72CC
P 8000 2125
F 0 "#PWR0139" H 8000 1875 50  0001 C CNN
F 1 "GND" V 8000 1925 39  0000 C CNN
F 2 "" H 8000 2125 50  0001 C CNN
F 3 "" H 8000 2125 50  0001 C CNN
	1    8000 2125
	0    -1   1    0   
$EndComp
Wire Wire Line
	8150 2225 8000 2225
Text Label 8150 2225 0    38   ~ 0
~EN_6
$Comp
L LEGOS:VBUS #PWR0140
U 1 1 5F0E72D4
P 7500 2325
F 0 "#PWR0140" H 7500 2175 50  0001 C CNN
F 1 "VBUS" V 7500 2475 39  0000 L CNN
F 2 "" H 7500 2325 50  0001 C CNN
F 3 "" H 7500 2325 50  0001 C CNN
	1    7500 2325
	0    -1   -1   0   
$EndComp
Wire Wire Line
	8000 2425 8400 2425
Text Label 8150 3925 0    38   ~ 0
ID_5
$Comp
L power:GND #PWR0142
U 1 1 5F0EA7AF
P 7500 3625
F 0 "#PWR0142" H 7500 3375 50  0001 C CNN
F 1 "GND" V 7500 3425 39  0000 C CNN
F 2 "" H 7500 3625 50  0001 C CNN
F 3 "" H 7500 3625 50  0001 C CNN
	1    7500 3625
	0    1    1    0   
$EndComp
$Comp
L power:+5V #PWR0143
U 1 1 5F0EA7B5
P 7500 3725
F 0 "#PWR0143" H 7500 3575 50  0001 C CNN
F 1 "+5V" V 7500 3925 39  0000 C CNN
F 2 "" H 7500 3725 50  0001 C CNN
F 3 "" H 7500 3725 50  0001 C CNN
	1    7500 3725
	0    -1   -1   0   
$EndComp
$Comp
L power:+5V #PWR0144
U 1 1 5F0EA7BB
P 7500 4025
F 0 "#PWR0144" H 7500 3875 50  0001 C CNN
F 1 "+5V" V 7500 4225 39  0000 C CNN
F 2 "" H 7500 4025 50  0001 C CNN
F 3 "" H 7500 4025 50  0001 C CNN
	1    7500 4025
	0    -1   -1   0   
$EndComp
$Comp
L power:GND #PWR0145
U 1 1 5F0EA7C1
P 7500 4125
F 0 "#PWR0145" H 7500 3875 50  0001 C CNN
F 1 "GND" V 7500 3925 39  0000 C CNN
F 2 "" H 7500 4125 50  0001 C CNN
F 3 "" H 7500 4125 50  0001 C CNN
	1    7500 4125
	0    1    1    0   
$EndComp
$Comp
L power:GND #PWR0146
U 1 1 5F0EA7C7
P 8000 4125
F 0 "#PWR0146" H 8000 3875 50  0001 C CNN
F 1 "GND" V 8000 3925 39  0000 C CNN
F 2 "" H 8000 4125 50  0001 C CNN
F 3 "" H 8000 4125 50  0001 C CNN
	1    8000 4125
	0    -1   1    0   
$EndComp
$Comp
L power:GND #PWR0147
U 1 1 5F0EA7CD
P 8000 3625
F 0 "#PWR0147" H 8000 3375 50  0001 C CNN
F 1 "GND" V 8000 3425 39  0000 C CNN
F 2 "" H 8000 3625 50  0001 C CNN
F 3 "" H 8000 3625 50  0001 C CNN
	1    8000 3625
	0    -1   1    0   
$EndComp
Wire Wire Line
	8150 3725 8000 3725
Text Label 8150 3725 0    38   ~ 0
~EN_5
$Comp
L LEGOS:VBUS #PWR0148
U 1 1 5F0EA7D5
P 7500 3825
F 0 "#PWR0148" H 7500 3675 50  0001 C CNN
F 1 "VBUS" V 7500 3975 39  0000 L CNN
F 2 "" H 7500 3825 50  0001 C CNN
F 3 "" H 7500 3825 50  0001 C CNN
	1    7500 3825
	0    -1   -1   0   
$EndComp
Wire Wire Line
	8000 3925 8400 3925
$Comp
L power:GND #PWR0150
U 1 1 5F0ED432
P 7500 5125
F 0 "#PWR0150" H 7500 4875 50  0001 C CNN
F 1 "GND" V 7500 4925 39  0000 C CNN
F 2 "" H 7500 5125 50  0001 C CNN
F 3 "" H 7500 5125 50  0001 C CNN
	1    7500 5125
	0    1    1    0   
$EndComp
$Comp
L power:+5V #PWR0151
U 1 1 5F0ED438
P 7500 5225
F 0 "#PWR0151" H 7500 5075 50  0001 C CNN
F 1 "+5V" V 7500 5425 39  0000 C CNN
F 2 "" H 7500 5225 50  0001 C CNN
F 3 "" H 7500 5225 50  0001 C CNN
	1    7500 5225
	0    -1   -1   0   
$EndComp
$Comp
L power:+5V #PWR0152
U 1 1 5F0ED43E
P 7500 5525
F 0 "#PWR0152" H 7500 5375 50  0001 C CNN
F 1 "+5V" V 7500 5725 39  0000 C CNN
F 2 "" H 7500 5525 50  0001 C CNN
F 3 "" H 7500 5525 50  0001 C CNN
	1    7500 5525
	0    -1   -1   0   
$EndComp
$Comp
L power:GND #PWR0153
U 1 1 5F0ED444
P 7500 5625
F 0 "#PWR0153" H 7500 5375 50  0001 C CNN
F 1 "GND" V 7500 5425 39  0000 C CNN
F 2 "" H 7500 5625 50  0001 C CNN
F 3 "" H 7500 5625 50  0001 C CNN
	1    7500 5625
	0    1    1    0   
$EndComp
$Comp
L power:GND #PWR0154
U 1 1 5F0ED44A
P 8000 5625
F 0 "#PWR0154" H 8000 5375 50  0001 C CNN
F 1 "GND" V 8000 5425 39  0000 C CNN
F 2 "" H 8000 5625 50  0001 C CNN
F 3 "" H 8000 5625 50  0001 C CNN
	1    8000 5625
	0    -1   1    0   
$EndComp
$Comp
L power:GND #PWR0155
U 1 1 5F0ED450
P 8000 5125
F 0 "#PWR0155" H 8000 4875 50  0001 C CNN
F 1 "GND" V 8000 4925 39  0000 C CNN
F 2 "" H 8000 5125 50  0001 C CNN
F 3 "" H 8000 5125 50  0001 C CNN
	1    8000 5125
	0    -1   1    0   
$EndComp
Wire Wire Line
	8150 5225 8000 5225
Text Label 8150 5225 0    38   ~ 0
~EN_4
$Comp
L LEGOS:VBUS #PWR0156
U 1 1 5F0ED458
P 7500 5325
F 0 "#PWR0156" H 7500 5175 50  0001 C CNN
F 1 "VBUS" V 7500 5475 39  0000 L CNN
F 2 "" H 7500 5325 50  0001 C CNN
F 3 "" H 7500 5325 50  0001 C CNN
	1    7500 5325
	0    -1   -1   0   
$EndComp
Wire Wire Line
	8000 5425 8400 5425
Text Label 8150 5425 0    38   ~ 0
ID_4
$Comp
L LEGOS:DS28E07 IC5
U 1 1 5ECF8713
P 8650 3825
F 0 "IC5" H 8650 3970 50  0000 C CNN
F 1 "DS28E07" H 8780 3742 25  0000 L CNN
F 2 "Package_SO_J-Lead:TSOC-6_3.76x3.94mm_P1.27mm" H 9000 4125 50  0001 L CNN
F 3 "https://www.mouser.de/datasheet/2/256/DS28E07-952439.pdf" H 9000 4025 50  0001 L CNN
F 4 "1-Wire EEPROM" H 9000 3925 50  0001 L CNN "Description"
F 5 "700-DS28E07P+" H 9000 3725 50  0001 L CNN "Mouser Part Number"
F 6 "Maxim Integrated" H 9000 3525 50  0001 L CNN "Manufacturer_Name"
F 7 "DS28E05P+" H 9000 3425 50  0001 L CNN "Manufacturer_Part_Number"
	1    8650 3825
	1    0    0    -1  
$EndComp
$Comp
L LEGOS:PogoConn J7
U 1 1 5F27215A
P 5900 3625
F 0 "J7" H 5950 4142 50  0000 C CNN
F 1 "PogoConn" H 5950 4051 50  0000 C CNN
F 2 "LEGOS:PogoConn_Target" H 5900 3625 50  0001 C CNN
F 3 "~" H 5900 3625 50  0001 C CNN
	1    5900 3625
	-1   0    0    -1  
$EndComp
Wire Wire Line
	5450 3325 5600 3325
Text Label 5450 3325 2    38   ~ 0
~EN_1
Wire Wire Line
	5450 3425 5600 3425
Text Label 5450 3425 2    38   ~ 0
~EN_2
Wire Wire Line
	5450 3525 5600 3525
Text Label 5450 3525 2    38   ~ 0
~EN_3
Wire Wire Line
	5450 3625 5600 3625
Text Label 5450 3625 2    38   ~ 0
~EN_4
Wire Wire Line
	5450 3725 5600 3725
Text Label 5450 3725 2    38   ~ 0
~EN_5
Wire Wire Line
	5450 3825 5600 3825
Text Label 5450 3825 2    38   ~ 0
~EN_6
$Comp
L LEGOS:DS28E07 IC7
U 1 1 5ECF6E61
P 6550 3975
F 0 "IC7" H 6550 4125 50  0000 C CNN
F 1 "DS28E07" H 6680 3892 25  0000 L CNN
F 2 "Package_SO_J-Lead:TSOC-6_3.76x3.94mm_P1.27mm" H 6900 4275 50  0001 L CNN
F 3 "https://www.mouser.de/datasheet/2/256/DS28E07-952439.pdf" H 6900 4175 50  0001 L CNN
F 4 "1-Wire EEPROM" H 6900 4075 50  0001 L CNN "Description"
F 5 "700-DS28E07P+" H 6900 3875 50  0001 L CNN "Mouser Part Number"
F 6 "Maxim Integrated" H 6900 3675 50  0001 L CNN "Manufacturer_Name"
F 7 "DS28E05P+" H 6900 3575 50  0001 L CNN "Manufacturer_Part_Number"
	1    6550 3975
	1    0    0    -1  
$EndComp
$Comp
L LEGOS:VBUS #PWR0115
U 1 1 5F29541E
P 5600 3925
F 0 "#PWR0115" H 5600 3775 50  0001 C CNN
F 1 "VBUS" V 5600 4075 39  0000 L CNN
F 2 "" H 5600 3925 50  0001 C CNN
F 3 "" H 5600 3925 50  0001 C CNN
	1    5600 3925
	0    -1   1    0   
$EndComp
$Comp
L power:+5V #PWR0116
U 1 1 5F29B516
P 5600 4025
F 0 "#PWR0116" H 5600 3875 50  0001 C CNN
F 1 "+5V" V 5600 4225 39  0000 C CNN
F 2 "" H 5600 4025 50  0001 C CNN
F 3 "" H 5600 4025 50  0001 C CNN
	1    5600 4025
	0    -1   -1   0   
$EndComp
$Comp
L power:GND #PWR0121
U 1 1 5F29BDE1
P 6100 4025
F 0 "#PWR0121" H 6100 3775 50  0001 C CNN
F 1 "GND" V 6100 3825 39  0000 C CNN
F 2 "" H 6100 4025 50  0001 C CNN
F 3 "" H 6100 4025 50  0001 C CNN
	1    6100 4025
	0    -1   1    0   
$EndComp
$Comp
L Connector_Generic:Conn_02x06_Odd_Even J1
U 1 1 5F2FBE0C
P 3700 2325
F 0 "J1" H 3750 2742 50  0000 C CNN
F 1 "HLE-106-02-G-DV-TE" H 3750 2651 50  0000 C CNN
F 2 "LEGOS:HLE-106-02-G-DV-TE" H 3700 2325 50  0001 C CNN
F 3 "https://www.samtec.com/products/hle-106-02-g-dv-te" H 3700 2325 50  0001 C CNN
	1    3700 2325
	1    0    0    -1  
$EndComp
$Comp
L Connector_Generic:Conn_02x06_Odd_Even J2
U 1 1 5F305036
P 3700 3825
F 0 "J2" H 3750 4242 50  0000 C CNN
F 1 "HLE-106-02-G-DV-TE" H 3750 4151 50  0000 C CNN
F 2 "LEGOS:HLE-106-02-G-DV-TE" H 3700 3825 50  0001 C CNN
F 3 "https://www.samtec.com/products/hle-106-02-g-dv-te" H 3700 3825 50  0001 C CNN
	1    3700 3825
	1    0    0    -1  
$EndComp
$Comp
L Connector_Generic:Conn_02x06_Odd_Even J3
U 1 1 5F305CCA
P 3700 5325
F 0 "J3" H 3750 5742 50  0000 C CNN
F 1 "HLE-106-02-G-DV-TE" H 3750 5651 50  0000 C CNN
F 2 "LEGOS:HLE-106-02-G-DV-TE" H 3700 5325 50  0001 C CNN
F 3 "https://www.samtec.com/products/hle-106-02-g-dv-te" H 3700 5325 50  0001 C CNN
	1    3700 5325
	1    0    0    -1  
$EndComp
$Comp
L Connector_Generic:Conn_02x06_Odd_Even J4
U 1 1 5F3083C9
P 7700 5325
F 0 "J4" H 7750 5742 50  0000 C CNN
F 1 "HLE-106-02-G-DV-TE" H 7750 5651 50  0000 C CNN
F 2 "LEGOS:HLE-106-02-G-DV-TE" H 7700 5325 50  0001 C CNN
F 3 "https://www.samtec.com/products/hle-106-02-g-dv-te" H 7700 5325 50  0001 C CNN
	1    7700 5325
	1    0    0    -1  
$EndComp
$Comp
L Connector_Generic:Conn_02x06_Odd_Even J5
U 1 1 5F309B2E
P 7700 3825
F 0 "J5" H 7750 4242 50  0000 C CNN
F 1 "HLE-106-02-G-DV-TE" H 7750 4151 50  0000 C CNN
F 2 "LEGOS:HLE-106-02-G-DV-TE" H 7700 3825 50  0001 C CNN
F 3 "https://www.samtec.com/products/hle-106-02-g-dv-te" H 7700 3825 50  0001 C CNN
	1    7700 3825
	1    0    0    -1  
$EndComp
$Comp
L Connector_Generic:Conn_02x06_Odd_Even J6
U 1 1 5F30AE98
P 7700 2325
F 0 "J6" H 7750 2742 50  0000 C CNN
F 1 "HLE-106-02-G-DV-TE" H 7750 2651 50  0000 C CNN
F 2 "LEGOS:HLE-106-02-G-DV-TE" H 7700 2325 50  0001 C CNN
F 3 "https://www.samtec.com/products/hle-106-02-g-dv-te" H 7700 2325 50  0001 C CNN
	1    7700 2325
	1    0    0    -1  
$EndComp
$Comp
L LEGOS:VBUS #PWR0125
U 1 1 5F30FA91
P 3500 2425
F 0 "#PWR0125" H 3500 2275 50  0001 C CNN
F 1 "VBUS" V 3500 2575 39  0000 L CNN
F 2 "" H 3500 2425 50  0001 C CNN
F 3 "" H 3500 2425 50  0001 C CNN
	1    3500 2425
	0    -1   -1   0   
$EndComp
$Comp
L LEGOS:VBUS #PWR0133
U 1 1 5F311D3C
P 3500 3925
F 0 "#PWR0133" H 3500 3775 50  0001 C CNN
F 1 "VBUS" V 3500 4075 39  0000 L CNN
F 2 "" H 3500 3925 50  0001 C CNN
F 3 "" H 3500 3925 50  0001 C CNN
	1    3500 3925
	0    -1   -1   0   
$EndComp
$Comp
L LEGOS:VBUS #PWR0141
U 1 1 5F3138C0
P 3500 5425
F 0 "#PWR0141" H 3500 5275 50  0001 C CNN
F 1 "VBUS" V 3500 5575 39  0000 L CNN
F 2 "" H 3500 5425 50  0001 C CNN
F 3 "" H 3500 5425 50  0001 C CNN
	1    3500 5425
	0    -1   -1   0   
$EndComp
$Comp
L LEGOS:VBUS #PWR0149
U 1 1 5F3161B8
P 7500 2425
F 0 "#PWR0149" H 7500 2275 50  0001 C CNN
F 1 "VBUS" V 7500 2575 39  0000 L CNN
F 2 "" H 7500 2425 50  0001 C CNN
F 3 "" H 7500 2425 50  0001 C CNN
	1    7500 2425
	0    -1   -1   0   
$EndComp
$Comp
L LEGOS:VBUS #PWR0157
U 1 1 5F3188AC
P 7500 3925
F 0 "#PWR0157" H 7500 3775 50  0001 C CNN
F 1 "VBUS" V 7500 4075 39  0000 L CNN
F 2 "" H 7500 3925 50  0001 C CNN
F 3 "" H 7500 3925 50  0001 C CNN
	1    7500 3925
	0    -1   -1   0   
$EndComp
$Comp
L LEGOS:VBUS #PWR0158
U 1 1 5F31A6E3
P 7500 5425
F 0 "#PWR0158" H 7500 5275 50  0001 C CNN
F 1 "VBUS" V 7500 5575 39  0000 L CNN
F 2 "" H 7500 5425 50  0001 C CNN
F 3 "" H 7500 5425 50  0001 C CNN
	1    7500 5425
	0    -1   -1   0   
$EndComp
$Comp
L power:GND #PWR0159
U 1 1 5F31C181
P 4000 2325
F 0 "#PWR0159" H 4000 2075 50  0001 C CNN
F 1 "GND" V 4000 2125 39  0000 C CNN
F 2 "" H 4000 2325 50  0001 C CNN
F 3 "" H 4000 2325 50  0001 C CNN
	1    4000 2325
	0    -1   1    0   
$EndComp
Wire Wire Line
	4150 2525 4000 2525
Text Label 4150 2525 0    38   ~ 0
~IRQ_1
$Comp
L power:GND #PWR0160
U 1 1 5F3250BC
P 4000 3825
F 0 "#PWR0160" H 4000 3575 50  0001 C CNN
F 1 "GND" V 4000 3625 39  0000 C CNN
F 2 "" H 4000 3825 50  0001 C CNN
F 3 "" H 4000 3825 50  0001 C CNN
	1    4000 3825
	0    -1   1    0   
$EndComp
$Comp
L power:GND #PWR0161
U 1 1 5F325366
P 4000 5325
F 0 "#PWR0161" H 4000 5075 50  0001 C CNN
F 1 "GND" V 4000 5125 39  0000 C CNN
F 2 "" H 4000 5325 50  0001 C CNN
F 3 "" H 4000 5325 50  0001 C CNN
	1    4000 5325
	0    -1   1    0   
$EndComp
$Comp
L power:GND #PWR0162
U 1 1 5F326B2B
P 8000 5325
F 0 "#PWR0162" H 8000 5075 50  0001 C CNN
F 1 "GND" V 8000 5125 39  0000 C CNN
F 2 "" H 8000 5325 50  0001 C CNN
F 3 "" H 8000 5325 50  0001 C CNN
	1    8000 5325
	0    -1   1    0   
$EndComp
$Comp
L power:GND #PWR0163
U 1 1 5F32857F
P 8000 3825
F 0 "#PWR0163" H 8000 3575 50  0001 C CNN
F 1 "GND" V 8000 3625 39  0000 C CNN
F 2 "" H 8000 3825 50  0001 C CNN
F 3 "" H 8000 3825 50  0001 C CNN
	1    8000 3825
	0    -1   1    0   
$EndComp
$Comp
L power:GND #PWR0164
U 1 1 5F3292F7
P 8000 2325
F 0 "#PWR0164" H 8000 2075 50  0001 C CNN
F 1 "GND" V 8000 2125 39  0000 C CNN
F 2 "" H 8000 2325 50  0001 C CNN
F 3 "" H 8000 2325 50  0001 C CNN
	1    8000 2325
	0    -1   1    0   
$EndComp
Wire Wire Line
	4150 4025 4000 4025
Text Label 4150 4025 0    38   ~ 0
~IRQ_2
Wire Wire Line
	4150 5525 4000 5525
Text Label 4150 5525 0    38   ~ 0
~IRQ_3
Wire Wire Line
	8150 5525 8000 5525
Text Label 8150 5525 0    38   ~ 0
~IRQ_4
Wire Wire Line
	8150 4025 8000 4025
Text Label 8150 4025 0    38   ~ 0
~IRQ_5
Wire Wire Line
	8150 2525 8000 2525
Text Label 8150 2525 0    38   ~ 0
~IRQ_6
Wire Wire Line
	6250 3325 6100 3325
Text Label 6250 3325 0    38   ~ 0
~IRQ_1
Wire Wire Line
	6250 3425 6100 3425
Text Label 6250 3425 0    38   ~ 0
~IRQ_2
Wire Wire Line
	6250 3625 6100 3625
Text Label 6250 3625 0    38   ~ 0
~IRQ_4
Wire Wire Line
	6250 3525 6100 3525
Text Label 6250 3525 0    38   ~ 0
~IRQ_3
Wire Wire Line
	6250 3725 6100 3725
Text Label 6250 3725 0    38   ~ 0
~IRQ_5
Wire Wire Line
	6100 3925 6350 3925
Wire Wire Line
	6250 3825 6100 3825
Text Label 6250 3825 0    38   ~ 0
~IRQ_6
Text Label 6250 3925 0    38   ~ 0
ID_7
$EndSCHEMATC
