EESchema Schematic File Version 4
EELAYER 30 0
EELAYER END
$Descr A4 11693 8268
encoding utf-8
Sheet 1 1
Title "3 Digit 7 Segments LED Display "
Date "2020-08-28"
Rev "1.1"
Comp "Institute for Automation of Complex Power Systems - E.ON ERC - RWTH Aachen University"
Comment1 "Designer: D. Wienands, S. Melcher, L. Jeske, D. Moll"
Comment2 "Supervisor: C. Guarnieri Calò Carducci"
Comment3 ""
Comment4 ""
$EndDescr
$Comp
L Device:R_Small R?
U 1 1 5F527804
P 6000 2600
F 0 "R?" V 5950 2725 39  0000 C CNN
F 1 "330" V 5925 2600 39  0000 C CNN
F 2 "Resistor_SMD:R_0603_1608Metric" H 6000 2600 50  0001 C CNN
F 3 "~" H 6000 2600 50  0001 C CNN
	1    6000 2600
	0    1    1    0   
$EndComp
Wire Wire Line
	6100 2600 6200 2600
Wire Wire Line
	6100 2700 6200 2700
Wire Wire Line
	6100 2800 6200 2800
Wire Wire Line
	6100 2900 6200 2900
Wire Wire Line
	6100 3000 6200 3000
Wire Wire Line
	6100 3200 6200 3200
Wire Wire Line
	6100 3100 6200 3100
Wire Wire Line
	6100 3300 6200 3300
Wire Wire Line
	5800 2600 5900 2600
Wire Wire Line
	5800 2700 5900 2700
Wire Wire Line
	5800 2800 5900 2800
Wire Wire Line
	5800 2900 5900 2900
Wire Wire Line
	5800 3000 5900 3000
Wire Wire Line
	5800 3100 5900 3100
Wire Wire Line
	5800 3200 5900 3200
Wire Wire Line
	5800 3300 5900 3300
Text Label 5800 2600 0    39   ~ 0
A
Text Label 5800 2700 0    39   ~ 0
B
Text Label 5800 2800 0    39   ~ 0
C
Text Label 5800 2900 0    39   ~ 0
D
Text Label 5800 3000 0    39   ~ 0
E
Text Label 5800 3100 0    39   ~ 0
F
Text Label 5800 3200 0    39   ~ 0
G
$Comp
L power:+5V #PWR?
U 1 1 5F5338C0
P 5800 3300
AR Path="/5F102375/5F5338C0" Ref="#PWR?"  Part="1" 
AR Path="/5F3DC4D2/5F5338C0" Ref="#PWR?"  Part="1" 
AR Path="/5F5338C0" Ref="#PWR?"  Part="1" 
F 0 "#PWR?" H 5800 3150 50  0001 C CNN
F 1 "+5V" V 5800 3500 39  0000 C CNN
F 2 "" H 5800 3300 50  0001 C CNN
F 3 "" H 5800 3300 50  0001 C CNN
	1    5800 3300
	0    -1   -1   0   
$EndComp
Wire Wire Line
	7600 2600 7700 2600
Wire Wire Line
	7600 2700 7700 2700
Wire Wire Line
	7600 2800 7700 2800
Wire Wire Line
	7600 2900 7700 2900
Wire Wire Line
	7600 3000 7700 3000
Wire Wire Line
	7600 3200 7700 3200
Wire Wire Line
	7600 3100 7700 3100
Wire Wire Line
	7600 3300 7700 3300
Wire Wire Line
	7300 2600 7400 2600
Wire Wire Line
	7300 2700 7400 2700
Wire Wire Line
	7300 2800 7400 2800
Wire Wire Line
	7300 2900 7400 2900
Wire Wire Line
	7300 3000 7400 3000
Wire Wire Line
	7300 3100 7400 3100
Wire Wire Line
	7300 3200 7400 3200
Wire Wire Line
	7300 3300 7400 3300
Text Label 7300 2600 0    39   ~ 0
A
Text Label 7300 2700 0    39   ~ 0
B
Text Label 7300 2800 0    39   ~ 0
C
Text Label 7300 2900 0    39   ~ 0
D
Text Label 7300 3000 0    39   ~ 0
E
Text Label 7300 3100 0    39   ~ 0
F
Text Label 7300 3200 0    39   ~ 0
G
$Comp
L power:+5V #PWR?
U 1 1 5F54146E
P 7300 3300
AR Path="/5F102375/5F54146E" Ref="#PWR?"  Part="1" 
AR Path="/5F3DC4D2/5F54146E" Ref="#PWR?"  Part="1" 
AR Path="/5F54146E" Ref="#PWR?"  Part="1" 
F 0 "#PWR?" H 7300 3150 50  0001 C CNN
F 1 "+5V" V 7300 3500 39  0000 C CNN
F 2 "" H 7300 3300 50  0001 C CNN
F 3 "" H 7300 3300 50  0001 C CNN
	1    7300 3300
	0    -1   -1   0   
$EndComp
Wire Wire Line
	9100 2600 9200 2600
Wire Wire Line
	9100 2700 9200 2700
Wire Wire Line
	9100 2800 9200 2800
Wire Wire Line
	9100 2900 9200 2900
Wire Wire Line
	9100 3000 9200 3000
Wire Wire Line
	9100 3200 9200 3200
Wire Wire Line
	9100 3100 9200 3100
Wire Wire Line
	9100 3300 9200 3300
Wire Wire Line
	6100 3700 6200 3700
Wire Wire Line
	8800 2700 8900 2700
Wire Wire Line
	8800 2800 8900 2800
Wire Wire Line
	8800 2900 8900 2900
Wire Wire Line
	8800 3000 8900 3000
Wire Wire Line
	8800 3100 8900 3100
Wire Wire Line
	8800 3200 8900 3200
Wire Wire Line
	8800 3300 8900 3300
Text Label 8800 2700 0    39   ~ 0
B
Text Label 8800 2800 0    39   ~ 0
C
Text Label 8800 2900 0    39   ~ 0
D
Text Label 8800 3000 0    39   ~ 0
E
Text Label 8800 3100 0    39   ~ 0
F
Text Label 8800 3200 0    39   ~ 0
G
$Comp
L power:+5V #PWR?
U 1 1 5F551F72
P 8800 3300
AR Path="/5F102375/5F551F72" Ref="#PWR?"  Part="1" 
AR Path="/5F3DC4D2/5F551F72" Ref="#PWR?"  Part="1" 
AR Path="/5F551F72" Ref="#PWR?"  Part="1" 
F 0 "#PWR?" H 8800 3150 50  0001 C CNN
F 1 "+5V" V 8800 3500 39  0000 C CNN
F 2 "" H 8800 3300 50  0001 C CNN
F 3 "" H 8800 3300 50  0001 C CNN
	1    8800 3300
	0    -1   -1   0   
$EndComp
$Comp
L power:GND #PWR?
U 1 1 5F551F78
P 7600 4600
AR Path="/5EF37CE1/5F551F78" Ref="#PWR?"  Part="1" 
AR Path="/5F551F78" Ref="#PWR?"  Part="1" 
AR Path="/5F3DC4D2/5F551F78" Ref="#PWR?"  Part="1" 
F 0 "#PWR?" H 7600 4350 50  0001 C CNN
F 1 "GND" H 7600 4450 39  0000 C CNN
F 2 "" H 7600 4600 50  0001 C CNN
F 3 "" H 7600 4600 50  0001 C CNN
	1    7600 4600
	1    0    0    -1  
$EndComp
$Comp
L LEGOS:ACSC56 D?
U 1 1 5F558572
P 6500 2900
F 0 "D?" H 6730 2889 50  0000 L CNN
F 1 "ACSC56" H 6730 2798 50  0000 L CNN
F 2 "LEGOS:ACSC56" H 6500 2350 50  0001 C CNN
F 3 "https://www.mouser.de/datasheet/2/216/ACSC56-41SRWA-F01-63512.pdf" H 6100 3450 50  0001 C CNN
	1    6500 2900
	1    0    0    -1  
$EndComp
$Comp
L LEGOS:ACSC56 D?
U 1 1 5F559678
P 8000 2900
F 0 "D?" H 8230 2889 50  0000 L CNN
F 1 "ACSC56" H 8230 2798 50  0000 L CNN
F 2 "LEGOS:ACSC56" H 8000 2350 50  0001 C CNN
F 3 "https://www.mouser.de/datasheet/2/216/ACSC56-41SRWA-F01-63512.pdf" H 7600 3450 50  0001 C CNN
	1    8000 2900
	1    0    0    -1  
$EndComp
$Comp
L LEGOS:ACSC56 D?
U 1 1 5F55A0FB
P 9500 2900
F 0 "D?" H 9730 2889 50  0000 L CNN
F 1 "ACSC56" H 9730 2798 50  0000 L CNN
F 2 "LEGOS:ACSC56" H 9500 2350 50  0001 C CNN
F 3 "https://www.mouser.de/datasheet/2/216/ACSC56-41SRWA-F01-63512.pdf" H 9100 3450 50  0001 C CNN
	1    9500 2900
	1    0    0    -1  
$EndComp
$Comp
L Device:Q_NMOS_GSD Q?
U 1 1 5F55BCBF
P 6400 3700
F 0 "Q?" H 6605 3738 39  0000 L CNN
F 1 "Si2302CDS" H 6605 3663 39  0000 L CNN
F 2 "Package_TO_SOT_SMD:SOT-23" H 6600 3800 50  0001 C CNN
F 3 "https://eu.mouser.com/datasheet/2/427/si2302cds-1764899.pdf" H 6400 3700 50  0001 C CNN
	1    6400 3700
	1    0    0    -1  
$EndComp
$Comp
L Device:Q_NMOS_GSD Q?
U 1 1 5F567121
P 7900 3700
F 0 "Q?" H 8105 3738 39  0000 L CNN
F 1 "Si2302CDS" H 8105 3663 39  0000 L CNN
F 2 "Package_TO_SOT_SMD:SOT-23" H 8100 3800 50  0001 C CNN
F 3 "https://eu.mouser.com/datasheet/2/427/si2302cds-1764899.pdf" H 7900 3700 50  0001 C CNN
	1    7900 3700
	1    0    0    -1  
$EndComp
$Comp
L Device:Q_NMOS_GSD Q?
U 1 1 5F568C94
P 9400 3700
F 0 "Q?" H 9605 3738 39  0000 L CNN
F 1 "Si2302CDS" H 9605 3663 39  0000 L CNN
F 2 "Package_TO_SOT_SMD:SOT-23" H 9600 3800 50  0001 C CNN
F 3 "https://eu.mouser.com/datasheet/2/427/si2302cds-1764899.pdf" H 9400 3700 50  0001 C CNN
	1    9400 3700
	1    0    0    -1  
$EndComp
$Comp
L Device:Q_NMOS_GSD Q?
U 1 1 5F581978
P 7900 4300
F 0 "Q?" H 8105 4338 39  0000 L CNN
F 1 "Si2302CDS" H 8105 4263 39  0000 L CNN
F 2 "Package_TO_SOT_SMD:SOT-23" H 8100 4400 50  0001 C CNN
F 3 "https://eu.mouser.com/datasheet/2/427/si2302cds-1764899.pdf" H 7900 4300 50  0001 C CNN
	1    7900 4300
	1    0    0    -1  
$EndComp
Wire Wire Line
	6500 3900 6500 4000
Wire Wire Line
	6500 4000 8000 4000
Wire Wire Line
	9500 4000 9500 3900
Wire Wire Line
	8000 3900 8000 4000
Connection ~ 8000 4000
Wire Wire Line
	8000 4000 9500 4000
Wire Wire Line
	8000 4000 8000 4100
Wire Wire Line
	7600 3700 7700 3700
Wire Wire Line
	9100 3700 9200 3700
Wire Wire Line
	7600 4300 7700 4300
$Comp
L LEGOS:CD74HC4511PW U?
U 1 1 5F4BAE30
P 4500 2900
F 0 "U?" H 4800 3500 39  0000 C CNN
F 1 "CD74HC4511PW" H 4850 3400 39  0000 C CNN
F 2 "Package_SO:TSSOP-16_4.4x5mm_P0.65mm" H 4500 2900 50  0001 C CNN
F 3 "https://www.ti.com/lit/ds/symlink/cd74hc4511.pdf" H 4500 2900 50  0001 C CNN
	1    4500 2900
	1    0    0    -1  
$EndComp
Wire Wire Line
	5100 2600 5000 2600
Wire Wire Line
	5100 2700 5000 2700
Wire Wire Line
	5100 2800 5000 2800
Wire Wire Line
	5100 2900 5000 2900
Wire Wire Line
	5100 3000 5000 3000
Wire Wire Line
	5100 3100 5000 3100
Wire Wire Line
	5100 3200 5000 3200
Text Label 5100 2600 2    39   ~ 0
A
Text Label 5100 2700 2    39   ~ 0
B
Text Label 5100 2800 2    39   ~ 0
C
Text Label 5100 2900 2    39   ~ 0
D
Text Label 5100 3000 2    39   ~ 0
E
Text Label 5100 3100 2    39   ~ 0
F
Text Label 5100 3200 2    39   ~ 0
G
$Comp
L power:+5V #PWR?
U 1 1 5F4C1EE4
P 4500 2300
AR Path="/5F102375/5F4C1EE4" Ref="#PWR?"  Part="1" 
AR Path="/5F3DC4D2/5F4C1EE4" Ref="#PWR?"  Part="1" 
AR Path="/5F4C1EE4" Ref="#PWR?"  Part="1" 
F 0 "#PWR?" H 4500 2150 50  0001 C CNN
F 1 "+5V" H 4500 2450 39  0000 C CNN
F 2 "" H 4500 2300 50  0001 C CNN
F 3 "" H 4500 2300 50  0001 C CNN
	1    4500 2300
	1    0    0    -1  
$EndComp
$Comp
L power:GND #PWR?
U 1 1 5F4C2EF8
P 4500 3600
AR Path="/5EF37CE1/5F4C2EF8" Ref="#PWR?"  Part="1" 
AR Path="/5F4C2EF8" Ref="#PWR?"  Part="1" 
AR Path="/5F3DC4D2/5F4C2EF8" Ref="#PWR?"  Part="1" 
F 0 "#PWR?" H 4500 3350 50  0001 C CNN
F 1 "GND" H 4500 3450 39  0000 C CNN
F 2 "" H 4500 3600 50  0001 C CNN
F 3 "" H 4500 3600 50  0001 C CNN
	1    4500 3600
	1    0    0    -1  
$EndComp
$Comp
L Device:R_Small R?
U 1 1 5F4C823E
P 6000 2700
F 0 "R?" V 5950 2825 39  0000 C CNN
F 1 "330" V 5925 2700 39  0001 C CNN
F 2 "Resistor_SMD:R_0603_1608Metric" H 6000 2700 50  0001 C CNN
F 3 "~" H 6000 2700 50  0001 C CNN
	1    6000 2700
	0    1    1    0   
$EndComp
$Comp
L Device:R_Small R?
U 1 1 5F4C86B3
P 6000 2800
F 0 "R?" V 5950 2925 39  0000 C CNN
F 1 "330" V 5925 2800 39  0001 C CNN
F 2 "Resistor_SMD:R_0603_1608Metric" H 6000 2800 50  0001 C CNN
F 3 "~" H 6000 2800 50  0001 C CNN
	1    6000 2800
	0    1    1    0   
$EndComp
$Comp
L Device:R_Small R?
U 1 1 5F4C89C0
P 6000 2900
F 0 "R?" V 5950 3025 39  0000 C CNN
F 1 "330" V 5925 2900 39  0001 C CNN
F 2 "Resistor_SMD:R_0603_1608Metric" H 6000 2900 50  0001 C CNN
F 3 "~" H 6000 2900 50  0001 C CNN
	1    6000 2900
	0    1    1    0   
$EndComp
$Comp
L Device:R_Small R?
U 1 1 5F4C8C96
P 6000 3000
F 0 "R?" V 5950 3125 39  0000 C CNN
F 1 "330" V 5925 3000 39  0001 C CNN
F 2 "Resistor_SMD:R_0603_1608Metric" H 6000 3000 50  0001 C CNN
F 3 "~" H 6000 3000 50  0001 C CNN
	1    6000 3000
	0    1    1    0   
$EndComp
$Comp
L Device:R_Small R?
U 1 1 5F4C8FD7
P 6000 3100
F 0 "R?" V 5950 3225 39  0000 C CNN
F 1 "330" V 5925 3100 39  0001 C CNN
F 2 "Resistor_SMD:R_0603_1608Metric" H 6000 3100 50  0001 C CNN
F 3 "~" H 6000 3100 50  0001 C CNN
	1    6000 3100
	0    1    1    0   
$EndComp
$Comp
L Device:R_Small R?
U 1 1 5F4C9365
P 6000 3200
F 0 "R?" V 5950 3325 39  0000 C CNN
F 1 "330" V 5925 3200 39  0001 C CNN
F 2 "Resistor_SMD:R_0603_1608Metric" H 6000 3200 50  0001 C CNN
F 3 "~" H 6000 3200 50  0001 C CNN
	1    6000 3200
	0    1    1    0   
$EndComp
$Comp
L Device:R_Small R?
U 1 1 5F4CDE37
P 6000 3300
F 0 "R?" V 5950 3425 39  0000 C CNN
F 1 "100k" V 6075 3300 39  0000 C CNN
F 2 "Resistor_SMD:R_0603_1608Metric" H 6000 3300 50  0001 C CNN
F 3 "~" H 6000 3300 50  0001 C CNN
	1    6000 3300
	0    1    1    0   
$EndComp
$Comp
L Device:R_Small R?
U 1 1 5F4DEC72
P 7500 2600
F 0 "R?" V 7450 2725 39  0000 C CNN
F 1 "330" V 7425 2600 39  0000 C CNN
F 2 "Resistor_SMD:R_0603_1608Metric" H 7500 2600 50  0001 C CNN
F 3 "~" H 7500 2600 50  0001 C CNN
	1    7500 2600
	0    1    1    0   
$EndComp
$Comp
L Device:R_Small R?
U 1 1 5F4DEC78
P 7500 2700
F 0 "R?" V 7450 2825 39  0000 C CNN
F 1 "330" V 7425 2700 39  0001 C CNN
F 2 "Resistor_SMD:R_0603_1608Metric" H 7500 2700 50  0001 C CNN
F 3 "~" H 7500 2700 50  0001 C CNN
	1    7500 2700
	0    1    1    0   
$EndComp
$Comp
L Device:R_Small R?
U 1 1 5F4DEC7E
P 7500 2800
F 0 "R?" V 7450 2925 39  0000 C CNN
F 1 "330" V 7425 2800 39  0001 C CNN
F 2 "Resistor_SMD:R_0603_1608Metric" H 7500 2800 50  0001 C CNN
F 3 "~" H 7500 2800 50  0001 C CNN
	1    7500 2800
	0    1    1    0   
$EndComp
$Comp
L Device:R_Small R?
U 1 1 5F4DEC84
P 7500 2900
F 0 "R?" V 7450 3025 39  0000 C CNN
F 1 "330" V 7425 2900 39  0001 C CNN
F 2 "Resistor_SMD:R_0603_1608Metric" H 7500 2900 50  0001 C CNN
F 3 "~" H 7500 2900 50  0001 C CNN
	1    7500 2900
	0    1    1    0   
$EndComp
$Comp
L Device:R_Small R?
U 1 1 5F4DEC8A
P 7500 3000
F 0 "R?" V 7450 3125 39  0000 C CNN
F 1 "330" V 7425 3000 39  0001 C CNN
F 2 "Resistor_SMD:R_0603_1608Metric" H 7500 3000 50  0001 C CNN
F 3 "~" H 7500 3000 50  0001 C CNN
	1    7500 3000
	0    1    1    0   
$EndComp
$Comp
L Device:R_Small R?
U 1 1 5F4DEC90
P 7500 3100
F 0 "R?" V 7450 3225 39  0000 C CNN
F 1 "330" V 7425 3100 39  0001 C CNN
F 2 "Resistor_SMD:R_0603_1608Metric" H 7500 3100 50  0001 C CNN
F 3 "~" H 7500 3100 50  0001 C CNN
	1    7500 3100
	0    1    1    0   
$EndComp
$Comp
L Device:R_Small R?
U 1 1 5F4DEC96
P 7500 3200
F 0 "R?" V 7450 3325 39  0000 C CNN
F 1 "330" V 7425 3200 39  0001 C CNN
F 2 "Resistor_SMD:R_0603_1608Metric" H 7500 3200 50  0001 C CNN
F 3 "~" H 7500 3200 50  0001 C CNN
	1    7500 3200
	0    1    1    0   
$EndComp
$Comp
L Device:R_Small R?
U 1 1 5F4DEC9C
P 7500 3300
F 0 "R?" V 7450 3425 39  0000 C CNN
F 1 "330" V 7575 3300 39  0000 C CNN
F 2 "Resistor_SMD:R_0603_1608Metric" H 7500 3300 50  0001 C CNN
F 3 "~" H 7500 3300 50  0001 C CNN
	1    7500 3300
	0    1    1    0   
$EndComp
$Comp
L Device:R_Small R?
U 1 1 5F4E89B2
P 9000 2600
F 0 "R?" V 8950 2725 39  0000 C CNN
F 1 "330" V 8925 2600 39  0000 C CNN
F 2 "Resistor_SMD:R_0603_1608Metric" H 9000 2600 50  0001 C CNN
F 3 "~" H 9000 2600 50  0001 C CNN
	1    9000 2600
	0    1    1    0   
$EndComp
$Comp
L Device:R_Small R?
U 1 1 5F4E89B8
P 9000 2700
F 0 "R?" V 8950 2825 39  0000 C CNN
F 1 "330" V 8925 2700 39  0001 C CNN
F 2 "Resistor_SMD:R_0603_1608Metric" H 9000 2700 50  0001 C CNN
F 3 "~" H 9000 2700 50  0001 C CNN
	1    9000 2700
	0    1    1    0   
$EndComp
$Comp
L Device:R_Small R?
U 1 1 5F4E89BE
P 9000 2800
F 0 "R?" V 8950 2925 39  0000 C CNN
F 1 "330" V 8925 2800 39  0001 C CNN
F 2 "Resistor_SMD:R_0603_1608Metric" H 9000 2800 50  0001 C CNN
F 3 "~" H 9000 2800 50  0001 C CNN
	1    9000 2800
	0    1    1    0   
$EndComp
$Comp
L Device:R_Small R?
U 1 1 5F4E89C4
P 9000 2900
F 0 "R?" V 8950 3025 39  0000 C CNN
F 1 "330" V 8925 2900 39  0001 C CNN
F 2 "Resistor_SMD:R_0603_1608Metric" H 9000 2900 50  0001 C CNN
F 3 "~" H 9000 2900 50  0001 C CNN
	1    9000 2900
	0    1    1    0   
$EndComp
$Comp
L Device:R_Small R?
U 1 1 5F4E89CA
P 9000 3000
F 0 "R?" V 8950 3125 39  0000 C CNN
F 1 "330" V 8925 3000 39  0001 C CNN
F 2 "Resistor_SMD:R_0603_1608Metric" H 9000 3000 50  0001 C CNN
F 3 "~" H 9000 3000 50  0001 C CNN
	1    9000 3000
	0    1    1    0   
$EndComp
$Comp
L Device:R_Small R?
U 1 1 5F4E89D0
P 9000 3100
F 0 "R?" V 8950 3225 39  0000 C CNN
F 1 "330" V 8925 3100 39  0001 C CNN
F 2 "Resistor_SMD:R_0603_1608Metric" H 9000 3100 50  0001 C CNN
F 3 "~" H 9000 3100 50  0001 C CNN
	1    9000 3100
	0    1    1    0   
$EndComp
$Comp
L Device:R_Small R?
U 1 1 5F4E89D6
P 9000 3200
F 0 "R?" V 8950 3325 39  0000 C CNN
F 1 "330" V 8925 3200 39  0001 C CNN
F 2 "Resistor_SMD:R_0603_1608Metric" H 9000 3200 50  0001 C CNN
F 3 "~" H 9000 3200 50  0001 C CNN
	1    9000 3200
	0    1    1    0   
$EndComp
$Comp
L Device:R_Small R?
U 1 1 5F4E89DC
P 9000 3300
F 0 "R?" V 8950 3425 39  0000 C CNN
F 1 "100k" V 9075 3300 39  0000 C CNN
F 2 "Resistor_SMD:R_0603_1608Metric" H 9000 3300 50  0001 C CNN
F 3 "~" H 9000 3300 50  0001 C CNN
	1    9000 3300
	0    1    1    0   
$EndComp
Wire Wire Line
	8800 2600 8900 2600
Text Label 8800 2600 0    39   ~ 0
A
Text HLabel 6100 3700 0    39   Input ~ 0
D2
Text HLabel 7600 3700 0    39   Input ~ 0
D1
Text HLabel 9100 3700 0    39   Input ~ 0
D0
Text HLabel 7500 4300 0    39   Input ~ 0
BRIGHT
Text HLabel 1800 1850 0    39   Input ~ 0
BCD0
Text HLabel 1800 2450 0    39   Input ~ 0
BCD1
Text HLabel 1800 3050 0    39   Input ~ 0
BCD2
Text HLabel 1800 3650 0    39   Input ~ 0
BCD3
$Comp
L power:+5V #PWR?
U 1 1 5F4F9847
P 4000 3100
AR Path="/5F102375/5F4F9847" Ref="#PWR?"  Part="1" 
AR Path="/5F3DC4D2/5F4F9847" Ref="#PWR?"  Part="1" 
AR Path="/5F4F9847" Ref="#PWR?"  Part="1" 
F 0 "#PWR?" H 4000 2950 50  0001 C CNN
F 1 "+5V" V 4000 3300 39  0000 C CNN
F 2 "" H 4000 3100 50  0001 C CNN
F 3 "" H 4000 3100 50  0001 C CNN
	1    4000 3100
	0    -1   -1   0   
$EndComp
$Comp
L power:+5V #PWR?
U 1 1 5F4FA059
P 4000 3200
AR Path="/5F102375/5F4FA059" Ref="#PWR?"  Part="1" 
AR Path="/5F3DC4D2/5F4FA059" Ref="#PWR?"  Part="1" 
AR Path="/5F4FA059" Ref="#PWR?"  Part="1" 
F 0 "#PWR?" H 4000 3050 50  0001 C CNN
F 1 "+5V" V 4000 3400 39  0000 C CNN
F 2 "" H 4000 3200 50  0001 C CNN
F 3 "" H 4000 3200 50  0001 C CNN
	1    4000 3200
	0    -1   -1   0   
$EndComp
$Comp
L power:GND #PWR?
U 1 1 5F4FA475
P 4000 3300
AR Path="/5EF37CE1/5F4FA475" Ref="#PWR?"  Part="1" 
AR Path="/5F4FA475" Ref="#PWR?"  Part="1" 
AR Path="/5F3DC4D2/5F4FA475" Ref="#PWR?"  Part="1" 
F 0 "#PWR?" H 4000 3050 50  0001 C CNN
F 1 "GND" V 4000 3100 39  0000 C CNN
F 2 "" H 4000 3300 50  0001 C CNN
F 3 "" H 4000 3300 50  0001 C CNN
	1    4000 3300
	0    1    1    0   
$EndComp
$Comp
L Device:Q_NMOS_GSD Q?
U 1 1 5F4FE22D
P 2300 1750
F 0 "Q?" V 2200 1850 39  0000 L CNN
F 1 "Si2302CDS" V 2250 1850 39  0000 L CNN
F 2 "Package_TO_SOT_SMD:SOT-23" H 2500 1850 50  0001 C CNN
F 3 "https://eu.mouser.com/datasheet/2/427/si2302cds-1764899.pdf" H 2300 1750 50  0001 C CNN
	1    2300 1750
	0    1    1    0   
$EndComp
$Comp
L power:+5V #PWR?
U 1 1 5F5141C7
P 3050 2300
AR Path="/5F102375/5F5141C7" Ref="#PWR?"  Part="1" 
AR Path="/5F3DC4D2/5F5141C7" Ref="#PWR?"  Part="1" 
AR Path="/5F5141C7" Ref="#PWR?"  Part="1" 
F 0 "#PWR?" H 3050 2150 50  0001 C CNN
F 1 "+5V" H 3050 2450 39  0000 C CNN
F 2 "" H 3050 2300 50  0001 C CNN
F 3 "" H 3050 2300 50  0001 C CNN
	1    3050 2300
	1    0    0    -1  
$EndComp
$Comp
L power:+5V #PWR?
U 1 1 5F515997
P 3800 2300
AR Path="/5F102375/5F515997" Ref="#PWR?"  Part="1" 
AR Path="/5F3DC4D2/5F515997" Ref="#PWR?"  Part="1" 
AR Path="/5F515997" Ref="#PWR?"  Part="1" 
F 0 "#PWR?" H 3800 2150 50  0001 C CNN
F 1 "+5V" H 3800 2450 39  0000 C CNN
F 2 "" H 3800 2300 50  0001 C CNN
F 3 "" H 3800 2300 50  0001 C CNN
	1    3800 2300
	1    0    0    -1  
$EndComp
$Comp
L Device:R_Small R?
U 1 1 5F54082F
P 3050 2400
F 0 "R?" H 3109 2438 39  0000 L CNN
F 1 "10k" H 3109 2363 39  0000 L CNN
F 2 "" H 3050 2400 50  0001 C CNN
F 3 "~" H 3050 2400 50  0001 C CNN
	1    3050 2400
	1    0    0    -1  
$EndComp
$Comp
L Device:R_Small R?
U 1 1 5F5427CE
P 3300 2400
F 0 "R?" H 3359 2438 39  0000 L CNN
F 1 "10k" H 3359 2363 39  0000 L CNN
F 2 "" H 3300 2400 50  0001 C CNN
F 3 "~" H 3300 2400 50  0001 C CNN
	1    3300 2400
	1    0    0    -1  
$EndComp
$Comp
L Device:R_Small R?
U 1 1 5F5460E5
P 3550 2400
F 0 "R?" H 3609 2438 39  0000 L CNN
F 1 "10k" H 3609 2363 39  0000 L CNN
F 2 "" H 3550 2400 50  0001 C CNN
F 3 "~" H 3550 2400 50  0001 C CNN
	1    3550 2400
	1    0    0    -1  
$EndComp
$Comp
L Device:R_Small R?
U 1 1 5F5460EB
P 3800 2400
F 0 "R?" H 3859 2438 39  0000 L CNN
F 1 "10k" H 3859 2363 39  0000 L CNN
F 2 "" H 3800 2400 50  0001 C CNN
F 3 "~" H 3800 2400 50  0001 C CNN
	1    3800 2400
	1    0    0    -1  
$EndComp
Wire Wire Line
	4000 2600 3800 2600
Wire Wire Line
	4000 2700 3550 2700
Wire Wire Line
	4000 2800 3300 2800
Wire Wire Line
	4000 2900 3050 2900
Wire Wire Line
	3800 2500 3800 2600
Wire Wire Line
	3550 2500 3550 2700
Wire Wire Line
	3300 2500 3300 2800
Wire Wire Line
	3050 2500 3050 2900
Wire Wire Line
	3800 2600 2850 2600
Connection ~ 3800 2600
Connection ~ 3550 2700
Connection ~ 3300 2800
$Comp
L power:+5V #PWR?
U 1 1 5F56A456
P 3300 2300
AR Path="/5F102375/5F56A456" Ref="#PWR?"  Part="1" 
AR Path="/5F3DC4D2/5F56A456" Ref="#PWR?"  Part="1" 
AR Path="/5F56A456" Ref="#PWR?"  Part="1" 
F 0 "#PWR?" H 3300 2150 50  0001 C CNN
F 1 "+5V" H 3300 2450 39  0000 C CNN
F 2 "" H 3300 2300 50  0001 C CNN
F 3 "" H 3300 2300 50  0001 C CNN
	1    3300 2300
	1    0    0    -1  
$EndComp
$Comp
L power:+5V #PWR?
U 1 1 5F56A6C1
P 3550 2300
AR Path="/5F102375/5F56A6C1" Ref="#PWR?"  Part="1" 
AR Path="/5F3DC4D2/5F56A6C1" Ref="#PWR?"  Part="1" 
AR Path="/5F56A6C1" Ref="#PWR?"  Part="1" 
F 0 "#PWR?" H 3550 2150 50  0001 C CNN
F 1 "+5V" H 3550 2450 39  0000 C CNN
F 2 "" H 3550 2300 50  0001 C CNN
F 3 "" H 3550 2300 50  0001 C CNN
	1    3550 2300
	1    0    0    -1  
$EndComp
Wire Wire Line
	3050 2900 2850 2900
Connection ~ 3050 2900
$Comp
L power:+3.3V #PWR?
U 1 1 5F5A5BE5
P 2300 1550
AR Path="/5F5A5BE5" Ref="#PWR?"  Part="1" 
AR Path="/5F3DC4D2/5F5A5BE5" Ref="#PWR?"  Part="1" 
F 0 "#PWR?" H 2300 1400 50  0001 C CNN
F 1 "+3.3V" H 2315 1723 39  0000 C CNN
F 2 "" H 2300 1550 50  0001 C CNN
F 3 "" H 2300 1550 50  0001 C CNN
	1    2300 1550
	1    0    0    -1  
$EndComp
$Comp
L Device:R_Small R?
U 1 1 5F5EE708
P 7600 4450
F 0 "R?" H 7659 4488 39  0000 L CNN
F 1 "10k" H 7659 4413 39  0000 L CNN
F 2 "" H 7600 4450 50  0001 C CNN
F 3 "~" H 7600 4450 50  0001 C CNN
	1    7600 4450
	1    0    0    -1  
$EndComp
Wire Wire Line
	2500 2450 2650 2450
Wire Wire Line
	2650 2450 2650 2700
Wire Wire Line
	2650 2700 3550 2700
Wire Wire Line
	2500 3050 2650 3050
Wire Wire Line
	2650 3050 2650 2800
Wire Wire Line
	2650 2800 3300 2800
Wire Wire Line
	2850 2600 2850 1850
Wire Wire Line
	2850 1850 2500 1850
Wire Wire Line
	2500 3650 2850 3650
Wire Wire Line
	2850 3650 2850 2900
$Comp
L Device:Q_NMOS_GSD Q?
U 1 1 5F63B7A6
P 2300 2950
F 0 "Q?" V 2200 3050 39  0000 L CNN
F 1 "Si2302CDS" V 2250 3050 39  0000 L CNN
F 2 "Package_TO_SOT_SMD:SOT-23" H 2500 3050 50  0001 C CNN
F 3 "https://eu.mouser.com/datasheet/2/427/si2302cds-1764899.pdf" H 2300 2950 50  0001 C CNN
	1    2300 2950
	0    1    1    0   
$EndComp
$Comp
L Device:Q_NMOS_GSD Q?
U 1 1 5F63C08B
P 2300 3550
F 0 "Q?" V 2200 3650 39  0000 L CNN
F 1 "Si2302CDS" V 2250 3650 39  0000 L CNN
F 2 "Package_TO_SOT_SMD:SOT-23" H 2500 3650 50  0001 C CNN
F 3 "https://eu.mouser.com/datasheet/2/427/si2302cds-1764899.pdf" H 2300 3550 50  0001 C CNN
	1    2300 3550
	0    1    1    0   
$EndComp
$Comp
L power:+3.3V #PWR?
U 1 1 5F63EA36
P 2300 2150
AR Path="/5F63EA36" Ref="#PWR?"  Part="1" 
AR Path="/5F3DC4D2/5F63EA36" Ref="#PWR?"  Part="1" 
F 0 "#PWR?" H 2300 2000 50  0001 C CNN
F 1 "+3.3V" H 2315 2323 39  0000 C CNN
F 2 "" H 2300 2150 50  0001 C CNN
F 3 "" H 2300 2150 50  0001 C CNN
	1    2300 2150
	1    0    0    -1  
$EndComp
$Comp
L power:+3.3V #PWR?
U 1 1 5F63EED4
P 2300 2750
AR Path="/5F63EED4" Ref="#PWR?"  Part="1" 
AR Path="/5F3DC4D2/5F63EED4" Ref="#PWR?"  Part="1" 
F 0 "#PWR?" H 2300 2600 50  0001 C CNN
F 1 "+3.3V" H 2315 2923 39  0000 C CNN
F 2 "" H 2300 2750 50  0001 C CNN
F 3 "" H 2300 2750 50  0001 C CNN
	1    2300 2750
	1    0    0    -1  
$EndComp
$Comp
L power:+3.3V #PWR?
U 1 1 5F63FD57
P 2300 3350
AR Path="/5F63FD57" Ref="#PWR?"  Part="1" 
AR Path="/5F3DC4D2/5F63FD57" Ref="#PWR?"  Part="1" 
F 0 "#PWR?" H 2300 3200 50  0001 C CNN
F 1 "+3.3V" H 2315 3523 39  0000 C CNN
F 2 "" H 2300 3350 50  0001 C CNN
F 3 "" H 2300 3350 50  0001 C CNN
	1    2300 3350
	1    0    0    -1  
$EndComp
Wire Wire Line
	1800 3650 2100 3650
Wire Wire Line
	1800 3050 2100 3050
Wire Wire Line
	1800 1850 2100 1850
$Comp
L Device:Q_NMOS_GSD Q?
U 1 1 5F63AED9
P 2300 2350
F 0 "Q?" V 2200 2450 39  0000 L CNN
F 1 "Si2302CDS" V 2250 2450 39  0000 L CNN
F 2 "Package_TO_SOT_SMD:SOT-23" H 2500 2450 50  0001 C CNN
F 3 "https://eu.mouser.com/datasheet/2/427/si2302cds-1764899.pdf" H 2300 2350 50  0001 C CNN
	1    2300 2350
	0    1    1    0   
$EndComp
$Comp
L power:GND #PWR?
U 1 1 5F6F3B63
P 8000 4600
AR Path="/5EF37CE1/5F6F3B63" Ref="#PWR?"  Part="1" 
AR Path="/5F6F3B63" Ref="#PWR?"  Part="1" 
AR Path="/5F3DC4D2/5F6F3B63" Ref="#PWR?"  Part="1" 
F 0 "#PWR?" H 8000 4350 50  0001 C CNN
F 1 "GND" H 8000 4450 39  0000 C CNN
F 2 "" H 8000 4600 50  0001 C CNN
F 3 "" H 8000 4600 50  0001 C CNN
	1    8000 4600
	1    0    0    -1  
$EndComp
Wire Wire Line
	8000 4500 8000 4600
Wire Wire Line
	1800 2450 2100 2450
Wire Wire Line
	7600 4550 7600 4600
Wire Wire Line
	7600 4300 7600 4350
Wire Wire Line
	7600 4300 7500 4300
Connection ~ 7600 4300
$EndSCHEMATC
