EESchema Schematic File Version 4
EELAYER 30 0
EELAYER END
$Descr A4 11693 8268
encoding utf-8
Sheet 3 9
Title "Current/Voltage/Power Monitor"
Date "2020-08-20"
Rev "1.2"
Comp "Institute for Automation of Complex Power Systems - E.ON ERC - RWTH Aachen University"
Comment1 "Designer: D. Wienands, S. Melcher, L. Jeske, D. Moll"
Comment2 "Supervisor: C. Guarnieri Calò Carducci"
Comment3 ""
Comment4 ""
$EndDescr
Wire Wire Line
	6400 3150 6600 3150
Wire Wire Line
	6400 2950 6400 3150
$Comp
L power:+3.3V #PWR?
U 1 1 5EF551CA
P 6400 2950
AR Path="/5F011FA8/5F128218/5EF551CA" Ref="#PWR?"  Part="1" 
AR Path="/5F46DFE3/5EF551CA" Ref="#PWR?"  Part="1" 
AR Path="/5F011FA8/5F4BF641/5EF551CA" Ref="#PWR?"  Part="1" 
AR Path="/5F10521C/5EF551CA" Ref="#PWR020"  Part="1" 
AR Path="/5F4B756B/5F4BF641/5EF551CA" Ref="#PWR033"  Part="1" 
F 0 "#PWR033" H 6400 2800 50  0001 C CNN
F 1 "+3.3V" H 6415 3123 39  0000 C CNN
F 2 "" H 6400 2950 50  0001 C CNN
F 3 "" H 6400 2950 50  0001 C CNN
	1    6400 2950
	-1   0    0    -1  
$EndComp
$Comp
L Device:C_Small C?
U 1 1 5EF551D0
P 6600 3050
AR Path="/5F011FA8/5F128218/5EF551D0" Ref="C?"  Part="1" 
AR Path="/5F46DFE3/5EF551D0" Ref="C?"  Part="1" 
AR Path="/5F011FA8/5F4BF641/5EF551D0" Ref="C?"  Part="1" 
AR Path="/5F10521C/5EF551D0" Ref="C4"  Part="1" 
AR Path="/5F4B756B/5F4BF641/5EF551D0" Ref="C9"  Part="1" 
F 0 "C9" H 6692 3096 39  0000 L CNN
F 1 "100n" H 6692 3005 39  0000 L CNN
F 2 "Capacitor_SMD:C_0603_1608Metric" H 6600 3050 50  0001 C CNN
F 3 "~" H 6600 3050 50  0001 C CNN
	1    6600 3050
	1    0    0    -1  
$EndComp
$Comp
L Analog_ADC:INA233 U?
U 1 1 5EF551D6
P 6400 3650
AR Path="/5F011FA8/5F128218/5EF551D6" Ref="U?"  Part="1" 
AR Path="/5F46DFE3/5EF551D6" Ref="U?"  Part="1" 
AR Path="/5F011FA8/5F4BF641/5EF551D6" Ref="U?"  Part="1" 
AR Path="/5F10521C/5EF551D6" Ref="U3"  Part="1" 
AR Path="/5F4B756B/5F4BF641/5EF551D6" Ref="U6"  Part="1" 
F 0 "U6" H 6450 3650 50  0000 R BNN
F 1 "INA233" H 6250 3750 50  0000 L BNN
F 2 "Package_SO:VSSOP-10_3x3mm_P0.5mm" H 7200 3200 50  0001 C CNN
F 3 "https://www.ti.com/lit/ds/symlink/ina233.pdf" H 6750 3550 50  0001 C CNN
	1    6400 3650
	1    0    0    -1  
$EndComp
Connection ~ 6400 3150
$Comp
L power:GND #PWR?
U 1 1 5EF551DD
P 6600 2950
AR Path="/5F011FA8/5F128218/5EF551DD" Ref="#PWR?"  Part="1" 
AR Path="/5F46DFE3/5EF551DD" Ref="#PWR?"  Part="1" 
AR Path="/5F011FA8/5F4BF641/5EF551DD" Ref="#PWR?"  Part="1" 
AR Path="/5F10521C/5EF551DD" Ref="#PWR022"  Part="1" 
AR Path="/5F4B756B/5F4BF641/5EF551DD" Ref="#PWR035"  Part="1" 
F 0 "#PWR035" H 6600 2700 50  0001 C CNN
F 1 "GND" H 6605 2777 39  0000 C CNN
F 2 "" H 6600 2950 50  0001 C CNN
F 3 "" H 6600 2950 50  0001 C CNN
	1    6600 2950
	-1   0    0    1   
$EndComp
$Comp
L power:GND #PWR?
U 1 1 5EF551E8
P 6400 4150
AR Path="/5F011FA8/5F128218/5EF551E8" Ref="#PWR?"  Part="1" 
AR Path="/5F46DFE3/5EF551E8" Ref="#PWR?"  Part="1" 
AR Path="/5F011FA8/5F4BF641/5EF551E8" Ref="#PWR?"  Part="1" 
AR Path="/5F10521C/5EF551E8" Ref="#PWR021"  Part="1" 
AR Path="/5F4B756B/5F4BF641/5EF551E8" Ref="#PWR034"  Part="1" 
F 0 "#PWR034" H 6400 3900 50  0001 C CNN
F 1 "GND" H 6405 3977 39  0000 C CNN
F 2 "" H 6400 4150 50  0001 C CNN
F 3 "" H 6400 4150 50  0001 C CNN
	1    6400 4150
	1    0    0    -1  
$EndComp
Wire Wire Line
	5650 3700 5800 3700
Text HLabel 5650 3350 0    39   Input ~ 0
VCOM
Wire Wire Line
	6000 3350 5650 3350
Text HLabel 5650 3700 0    39   Input ~ 0
V+
Text HLabel 5650 3900 0    39   Input ~ 0
V-
$Comp
L Device:R_Small R?
U 1 1 5F0D1D51
P 7450 3450
AR Path="/5F011FA8/5F128218/5F0D1D51" Ref="R?"  Part="1" 
AR Path="/5F46DFE3/5F0D1D51" Ref="R?"  Part="1" 
AR Path="/5F011FA8/5F4BF641/5F0D1D51" Ref="R?"  Part="1" 
AR Path="/5F10521C/5F0D1D51" Ref="R4"  Part="1" 
AR Path="/5F4B756B/5F4BF641/5F0D1D51" Ref="R9"  Part="1" 
F 0 "R9" H 7509 3488 39  0000 L CNN
F 1 "4.7k" H 7509 3413 39  0000 L CNN
F 2 "Resistor_SMD:R_0603_1608Metric" H 7450 3450 50  0001 C CNN
F 3 "~" H 7450 3450 50  0001 C CNN
	1    7450 3450
	1    0    0    -1  
$EndComp
$Comp
L Device:R_Small R?
U 1 1 5F0D2A77
P 7750 3450
AR Path="/5F011FA8/5F128218/5F0D2A77" Ref="R?"  Part="1" 
AR Path="/5F46DFE3/5F0D2A77" Ref="R?"  Part="1" 
AR Path="/5F011FA8/5F4BF641/5F0D2A77" Ref="R?"  Part="1" 
AR Path="/5F10521C/5F0D2A77" Ref="R5"  Part="1" 
AR Path="/5F4B756B/5F4BF641/5F0D2A77" Ref="R10"  Part="1" 
F 0 "R10" H 7809 3488 39  0000 L CNN
F 1 "4.7k" H 7809 3413 39  0000 L CNN
F 2 "Resistor_SMD:R_0603_1608Metric" H 7750 3450 50  0001 C CNN
F 3 "~" H 7750 3450 50  0001 C CNN
	1    7750 3450
	1    0    0    -1  
$EndComp
$Comp
L Device:R_Small R?
U 1 1 5F0D2C5D
P 8050 3450
AR Path="/5F011FA8/5F128218/5F0D2C5D" Ref="R?"  Part="1" 
AR Path="/5F46DFE3/5F0D2C5D" Ref="R?"  Part="1" 
AR Path="/5F011FA8/5F4BF641/5F0D2C5D" Ref="R?"  Part="1" 
AR Path="/5F10521C/5F0D2C5D" Ref="R6"  Part="1" 
AR Path="/5F4B756B/5F4BF641/5F0D2C5D" Ref="R11"  Part="1" 
F 0 "R11" H 8109 3488 39  0000 L CNN
F 1 "4.7k" H 8109 3413 39  0000 L CNN
F 2 "Resistor_SMD:R_0603_1608Metric" H 8050 3450 50  0001 C CNN
F 3 "~" H 8050 3450 50  0001 C CNN
	1    8050 3450
	1    0    0    -1  
$EndComp
$Comp
L power:+3.3V #PWR?
U 1 1 5F0D2F61
P 7450 3350
AR Path="/5F011FA8/5F128218/5F0D2F61" Ref="#PWR?"  Part="1" 
AR Path="/5F46DFE3/5F0D2F61" Ref="#PWR?"  Part="1" 
AR Path="/5F011FA8/5F4BF641/5F0D2F61" Ref="#PWR?"  Part="1" 
AR Path="/5F10521C/5F0D2F61" Ref="#PWR023"  Part="1" 
AR Path="/5F4B756B/5F4BF641/5F0D2F61" Ref="#PWR036"  Part="1" 
F 0 "#PWR036" H 7450 3200 50  0001 C CNN
F 1 "+3.3V" H 7465 3523 39  0000 C CNN
F 2 "" H 7450 3350 50  0001 C CNN
F 3 "" H 7450 3350 50  0001 C CNN
	1    7450 3350
	-1   0    0    -1  
$EndComp
$Comp
L power:+3.3V #PWR?
U 1 1 5F0D3352
P 7750 3350
AR Path="/5F011FA8/5F128218/5F0D3352" Ref="#PWR?"  Part="1" 
AR Path="/5F46DFE3/5F0D3352" Ref="#PWR?"  Part="1" 
AR Path="/5F011FA8/5F4BF641/5F0D3352" Ref="#PWR?"  Part="1" 
AR Path="/5F10521C/5F0D3352" Ref="#PWR024"  Part="1" 
AR Path="/5F4B756B/5F4BF641/5F0D3352" Ref="#PWR037"  Part="1" 
F 0 "#PWR037" H 7750 3200 50  0001 C CNN
F 1 "+3.3V" H 7765 3523 39  0000 C CNN
F 2 "" H 7750 3350 50  0001 C CNN
F 3 "" H 7750 3350 50  0001 C CNN
	1    7750 3350
	-1   0    0    -1  
$EndComp
$Comp
L power:+3.3V #PWR?
U 1 1 5F0D3606
P 8050 3350
AR Path="/5F011FA8/5F128218/5F0D3606" Ref="#PWR?"  Part="1" 
AR Path="/5F46DFE3/5F0D3606" Ref="#PWR?"  Part="1" 
AR Path="/5F011FA8/5F4BF641/5F0D3606" Ref="#PWR?"  Part="1" 
AR Path="/5F10521C/5F0D3606" Ref="#PWR025"  Part="1" 
AR Path="/5F4B756B/5F4BF641/5F0D3606" Ref="#PWR038"  Part="1" 
F 0 "#PWR038" H 8050 3200 50  0001 C CNN
F 1 "+3.3V" H 8065 3523 39  0000 C CNN
F 2 "" H 8050 3350 50  0001 C CNN
F 3 "" H 8050 3350 50  0001 C CNN
	1    8050 3350
	-1   0    0    -1  
$EndComp
Wire Wire Line
	6800 3650 7450 3650
Wire Wire Line
	7450 3550 7450 3650
Connection ~ 7450 3650
Wire Wire Line
	7450 3650 8350 3650
Wire Wire Line
	6800 3750 7750 3750
Wire Wire Line
	7750 3550 7750 3750
Connection ~ 7750 3750
Wire Wire Line
	7750 3750 8350 3750
Wire Wire Line
	6800 3950 8050 3950
Wire Wire Line
	8050 3550 8050 3950
Connection ~ 8050 3950
Wire Wire Line
	8050 3950 8350 3950
Wire Wire Line
	5650 3900 5800 3900
Text GLabel 8350 3650 2    39   Input ~ 0
SDA
Text GLabel 8350 3750 2    39   Input ~ 0
SCL
Text HLabel 8350 3950 2    39   Output ~ 0
~IRQ
$Comp
L Device:R_Small R?
U 1 1 5F12603D
P 5800 3800
AR Path="/5F011FA8/5F128218/5F12603D" Ref="R?"  Part="1" 
AR Path="/5F46DFE3/5F12603D" Ref="R?"  Part="1" 
AR Path="/5F011FA8/5F4BF641/5F12603D" Ref="R?"  Part="1" 
AR Path="/5F10521C/5F12603D" Ref="R3"  Part="1" 
AR Path="/5F4B756B/5F4BF641/5F12603D" Ref="R8"  Part="1" 
F 0 "R8" H 5850 3750 39  0000 L CNN
F 1 "100m" H 5850 3800 39  0000 L CNN
F 2 "Resistor_SMD:R_1206_3216Metric" H 5800 3800 50  0001 C CNN
F 3 "https://www.ohmite.com/assets/docs/res_lvk.pdf" H 5800 3800 50  0001 C CNN
F 4 "KDV12DR100ET" V 5800 3800 50  0001 C CNN "Mfr"
	1    5800 3800
	1    0    0    1   
$EndComp
Text Notes 5625 3825 0    28   ~ 0
0.5%
Wire Wire Line
	6000 3700 6000 3750
Wire Wire Line
	6000 3850 6000 3900
Connection ~ 5800 3900
Wire Wire Line
	5800 3900 6000 3900
Connection ~ 5800 3700
Wire Wire Line
	5800 3700 6000 3700
Text HLabel 6900 3350 2    39   Input ~ 0
A1
Text HLabel 6900 3450 2    39   Input ~ 0
A0
Wire Wire Line
	6900 3350 6800 3350
Wire Wire Line
	6900 3450 6800 3450
Text Notes 5550 3650 0    39   ~ 0
Vmax = 82 mV
$EndSCHEMATC
