EESchema Schematic File Version 4
EELAYER 30 0
EELAYER END
$Descr A4 11693 8268
encoding utf-8
Sheet 1 8
Title "Stadium"
Date "2020-10-10"
Rev "1.4"
Comp "Institute for Automation of Complex Power Systems - E.ON ERC - RWTH Aachen University"
Comment1 "Designer: D. Wienands, S. Melcher, L. Jeske, D. Moll"
Comment2 "Supervisor: C. Guarnieri Calò Carducci"
Comment3 ""
Comment4 ""
$EndDescr
Text Label 8000 1650 2    39   ~ 0
PWM1
Text Label 8000 3650 2    39   ~ 0
PWM2
Wire Wire Line
	9950 1000 9900 1000
Wire Wire Line
	9950 1100 9900 1100
Wire Wire Line
	8500 2000 8500 1850
Wire Wire Line
	8100 2000 8100 1950
$Comp
L power:GND #PWR?
U 1 1 5F3922E8
P 8100 2000
AR Path="/5F1D940F/5F3922E8" Ref="#PWR?"  Part="1" 
AR Path="/5F1D49F5/5F3922E8" Ref="#PWR?"  Part="1" 
AR Path="/5F3922E8" Ref="#PWR013"  Part="1" 
AR Path="/5F202C6C/5F3922E8" Ref="#PWR?"  Part="1" 
F 0 "#PWR013" H 8100 1750 50  0001 C CNN
F 1 "GND" H 8105 1827 50  0000 C CNN
F 2 "" H 8100 2000 50  0001 C CNN
F 3 "" H 8100 2000 50  0001 C CNN
	1    8100 2000
	1    0    0    -1  
$EndComp
$Comp
L power:GND #PWR?
U 1 1 5F3922EE
P 8500 2000
AR Path="/5F1D940F/5F3922EE" Ref="#PWR?"  Part="1" 
AR Path="/5F1D49F5/5F3922EE" Ref="#PWR?"  Part="1" 
AR Path="/5F3922EE" Ref="#PWR017"  Part="1" 
AR Path="/5F202C6C/5F3922EE" Ref="#PWR?"  Part="1" 
F 0 "#PWR017" H 8500 1750 50  0001 C CNN
F 1 "GND" H 8505 1827 50  0000 C CNN
F 2 "" H 8500 2000 50  0001 C CNN
F 3 "" H 8500 2000 50  0001 C CNN
	1    8500 2000
	1    0    0    -1  
$EndComp
$Comp
L Device:R_Small R2
U 1 1 5F3922F4
P 8100 1850
AR Path="/5F3922F4" Ref="R2"  Part="1" 
AR Path="/5F1D940F/5F3922F4" Ref="R?"  Part="1" 
AR Path="/5F1D49F5/5F3922F4" Ref="R?"  Part="1" 
AR Path="/5F202C6C/5F3922F4" Ref="R?"  Part="1" 
F 0 "R2" H 8150 1800 39  0000 L CNN
F 1 "10k" H 8150 1850 39  0000 L CNN
F 2 "Resistor_SMD:R_0603_1608Metric" H 8100 1850 50  0001 C CNN
F 3 "~" H 8100 1850 50  0001 C CNN
	1    8100 1850
	-1   0    0    1   
$EndComp
$Comp
L Device:Q_NMOS_GSD Q?
U 1 1 5F3922FA
P 8400 1650
AR Path="/5F1D940F/5F3922FA" Ref="Q?"  Part="1" 
AR Path="/5F1D49F5/5F3922FA" Ref="Q?"  Part="1" 
AR Path="/5F3922FA" Ref="Q1"  Part="1" 
AR Path="/5F202C6C/5F3922FA" Ref="Q?"  Part="1" 
F 0 "Q1" H 8605 1696 39  0000 L CNN
F 1 "Si2302CDS" H 8605 1605 39  0000 L CNN
F 2 "Package_TO_SOT_SMD:SOT-23" H 8600 1750 50  0001 C CNN
F 3 "https://eu.mouser.com/datasheet/2/427/si2302cds-1764899.pdf" H 8400 1650 50  0001 C CNN
	1    8400 1650
	1    0    0    -1  
$EndComp
Wire Wire Line
	8500 1100 8500 1450
Wire Wire Line
	8100 1650 8100 1750
Wire Wire Line
	8100 1650 8200 1650
Wire Wire Line
	8100 1650 8000 1650
Connection ~ 8100 1650
$Comp
L power:+3.3V #PWR016
U 1 1 5F392310
P 8500 1000
AR Path="/5F392310" Ref="#PWR016"  Part="1" 
AR Path="/5F1D49F5/5F392310" Ref="#PWR?"  Part="1" 
AR Path="/5F202C6C/5F392310" Ref="#PWR?"  Part="1" 
AR Path="/5F1D940F/5F392310" Ref="#PWR?"  Part="1" 
F 0 "#PWR016" H 8500 850 50  0001 C CNN
F 1 "+3.3V" H 8515 1173 39  0000 C CNN
F 2 "" H 8500 1000 50  0001 C CNN
F 3 "" H 8500 1000 50  0001 C CNN
	1    8500 1000
	1    0    0    -1  
$EndComp
Wire Wire Line
	8700 1100 8500 1100
Wire Wire Line
	4700 3850 4800 3850
Text Label 4800 4850 0    39   ~ 0
BT2
$Sheet
S 6450 2250 550  400 
U 5F10C787
F0 "Telemetry" 39
F1 "sub_telemetry.sch" 39
F2 "V+" I L 6450 2450 39 
F3 "V-" I L 6450 2550 39 
F4 "VCOM" I L 6450 2350 39 
F5 "~IRQ" O R 7000 2550 39 
F6 "A1" I R 7000 2450 39 
F7 "A0" I R 7000 2350 39 
$EndSheet
$Sheet
S 6450 2900 550  600 
U 5F2CC29A
F0 "Connectors" 39
F1 "sub_connectors.sch" 39
F2 "EN" O L 6450 3000 39 
F3 "TXD" O L 6450 3100 39 
F4 "RXD" I L 6450 3200 39 
F5 "IO0" B L 6450 3300 39 
F6 "ID" B L 6450 3400 39 
$EndSheet
$Comp
L power:GND #PWR03
U 1 1 5F2F82D2
P 2450 3350
F 0 "#PWR03" H 2450 3100 50  0001 C CNN
F 1 "GND" H 2455 3177 39  0000 C CNN
F 2 "" H 2450 3350 50  0001 C CNN
F 3 "" H 2450 3350 50  0001 C CNN
	1    2450 3350
	1    0    0    -1  
$EndComp
Wire Wire Line
	2750 3250 2750 3350
$Comp
L Switch:SW_Push SW1
U 1 1 5F2CF8CC
P 2450 3150
F 0 "SW1" V 2600 3600 39  0000 R CNN
F 1 "PTS815" V 2500 3600 39  0000 R CNN
F 2 "LEGOS:PTS815" H 2450 3350 50  0001 C CNN
F 3 "https://eu.mouser.com/datasheet/2/60/pts815-1535658.pdf" H 2450 3350 50  0001 C CNN
	1    2450 3150
	0    -1   -1   0   
$EndComp
Wire Wire Line
	6400 5050 6500 5050
Wire Wire Line
	6400 4700 6500 4700
Wire Wire Line
	6500 5400 6400 5400
Wire Wire Line
	6350 4200 6450 4200
Text GLabel 4800 3950 2    39   Input ~ 0
CLK
Text GLabel 4800 4050 2    39   Input ~ 0
MOSI
Text GLabel 4800 3350 2    39   Input ~ 0
MISO
Text Label 4800 4450 0    39   ~ 0
PWM1
Wire Wire Line
	4700 4750 4800 4750
Text Label 6400 5400 2    39   ~ 0
BT2
Wire Wire Line
	4800 3650 4700 3650
Text Label 4800 3450 0    39   ~ 0
~CS
Wire Wire Line
	4800 3450 4700 3450
Wire Wire Line
	4800 4350 4700 4350
Text Label 6350 4200 2    39   ~ 0
~CS
Text Label 4800 3750 0    39   ~ 0
PWM2
Text Label 4800 3550 0    39   ~ 0
PWM0
Wire Wire Line
	4700 5050 4800 5050
Wire Wire Line
	4700 4950 4800 4950
Wire Wire Line
	4800 4250 4700 4250
Wire Wire Line
	4800 3350 4700 3350
Wire Wire Line
	4800 4450 4700 4450
Wire Wire Line
	4800 4650 4700 4650
Wire Wire Line
	4800 4850 4700 4850
Wire Wire Line
	4800 3750 4700 3750
Wire Wire Line
	4800 3550 4700 3550
Wire Wire Line
	4800 5150 4700 5150
Wire Wire Line
	4700 4150 4800 4150
Wire Wire Line
	4700 4050 4800 4050
Wire Wire Line
	6450 4100 6350 4100
Wire Wire Line
	6450 4000 6350 4000
Wire Wire Line
	6450 3900 6350 3900
Wire Wire Line
	6450 3800 6350 3800
Wire Wire Line
	6400 3300 6350 3300
Connection ~ 6400 3300
Wire Wire Line
	6400 3400 6400 3300
Wire Wire Line
	6450 3400 6400 3400
Wire Wire Line
	6450 3300 6400 3300
Wire Wire Line
	6450 3200 6350 3200
Wire Wire Line
	6450 3100 6350 3100
Wire Wire Line
	6450 3000 6350 3000
Connection ~ 6350 2350
Wire Wire Line
	6350 2450 6350 2350
Wire Wire Line
	6450 2450 6350 2450
Wire Wire Line
	6450 2350 6350 2350
Wire Wire Line
	6450 2550 6350 2550
Text Label 6350 3000 2    39   ~ 0
EN
Text Label 6350 3100 2    39   ~ 0
TXD
Text Label 6350 3200 2    39   ~ 0
RXD
Text Label 6350 3300 2    39   ~ 0
ID
$Comp
L power:+3.3V #PWR011
U 1 1 5F10F4A2
P 6350 2550
F 0 "#PWR011" H 6350 2400 50  0001 C CNN
F 1 "+3.3V" H 6365 2723 39  0000 C CNN
F 2 "" H 6350 2550 50  0001 C CNN
F 3 "" H 6350 2550 50  0001 C CNN
	1    6350 2550
	-1   0    0    1   
$EndComp
$Comp
L LEGOS:VBUS #PWR010
U 1 1 5F10EEF1
P 6350 2350
F 0 "#PWR010" H 6350 2200 50  0001 C CNN
F 1 "VBUS" H 6365 2523 39  0000 C CNN
F 2 "" H 6350 2350 50  0001 C CNN
F 3 "" H 6350 2350 50  0001 C CNN
	1    6350 2350
	1    0    0    -1  
$EndComp
Text Notes 2650 4700 0    39   ~ 0
Touch GPIO:\nT0 - IO4\nT1 - IO0\nT2 - IO2\nT3 - IO15\nT4 - IO13\nT5 - IO12\nT6 - IO14\nT7 - IO27\nT8 - IO33\nT9 - IO32
Text GLabel 4800 3850 2    39   Input ~ 0
SCL
Text Notes 5025 5150 0    28   ~ 0
only input
Text Notes 5025 5250 0    28   ~ 0
only input
Wire Wire Line
	3500 2750 3850 2750
Wire Wire Line
	3500 2450 3500 2750
$Comp
L power:+3.3V #PWR06
U 1 1 5F107BF5
P 3500 2450
F 0 "#PWR06" H 3500 2300 50  0001 C CNN
F 1 "+3.3V" H 3515 2623 39  0000 C CNN
F 2 "" H 3500 2450 50  0001 C CNN
F 3 "" H 3500 2450 50  0001 C CNN
	1    3500 2450
	1    0    0    -1  
$EndComp
$Comp
L power:+3.3V #PWR04
U 1 1 5F1059EC
P 2750 2450
F 0 "#PWR04" H 2750 2300 50  0001 C CNN
F 1 "+3.3V" H 2765 2623 39  0000 C CNN
F 2 "" H 2750 2450 50  0001 C CNN
F 3 "" H 2750 2450 50  0001 C CNN
	1    2750 2450
	1    0    0    -1  
$EndComp
Text Label 4800 4250 0    39   ~ 0
BCLK
Text Label 4800 4150 0    39   ~ 0
DIN
Text Label 4800 4350 0    39   ~ 0
LRC
Text Label 6350 4100 2    39   ~ 0
~SD
Text Label 6350 4000 2    39   ~ 0
BCLK
Text Label 6350 3900 2    39   ~ 0
DIN
Text Label 6350 3800 2    39   ~ 0
LRC
Text Label 4800 5050 0    39   ~ 0
BT0
Text Label 4800 4950 0    39   ~ 0
BT1
Text Label 6400 5050 2    39   ~ 0
BT1
Text Label 6400 4700 2    39   ~ 0
BT0
$Comp
L LEGOS:TouchButton BT3
U 1 1 5F050D8A
P 6695 4995
F 0 "BT3" H 6946 4636 39  0000 L CNN
F 1 "TouchButton" H 6946 4545 39  0000 L CNN
F 2 "LEGOS:Touch_Button" H 7250 4735 50  0001 C CNN
F 3 "" H 6695 4995 50  0001 C CNN
	1    6695 4995
	1    0    0    -1  
$EndComp
$Comp
L LEGOS:TouchButton BT2
U 1 1 5F050093
P 6695 4645
F 0 "BT2" H 6946 4286 39  0000 L CNN
F 1 "TouchButton" H 6946 4195 39  0000 L CNN
F 2 "LEGOS:Touch_Button" H 7250 4385 50  0001 C CNN
F 3 "" H 6695 4645 50  0001 C CNN
	1    6695 4645
	1    0    0    -1  
$EndComp
$Comp
L LEGOS:TouchButton BT1
U 1 1 5F04F146
P 6695 4295
F 0 "BT1" H 6946 3936 39  0000 L CNN
F 1 "TouchButton" H 6946 3845 39  0000 L CNN
F 2 "LEGOS:Touch_Button" H 7250 4035 50  0001 C CNN
F 3 "" H 6695 4295 50  0001 C CNN
	1    6695 4295
	1    0    0    -1  
$EndComp
Wire Wire Line
	3500 2950 2750 2950
Wire Wire Line
	2750 2600 2750 2450
Text Notes 4700 4750 0    28   ~ 0
DAC
Text Notes 4700 4650 0    28   ~ 0
DAC
Wire Wire Line
	2750 2800 2750 2950
NoConn ~ 3500 4650
NoConn ~ 3500 4550
NoConn ~ 3500 4450
NoConn ~ 3500 4350
NoConn ~ 3500 4250
NoConn ~ 3500 4150
NoConn ~ 3500 3150
NoConn ~ 3500 3250
Connection ~ 3850 2750
Connection ~ 4100 2750
Wire Wire Line
	4100 2750 3850 2750
$Comp
L RF_Module:ESP32-WROOM-32D U2
U 1 1 5F041A79
P 4100 4150
F 0 "U2" H 3550 4650 50  0000 C CNN
F 1 "ESP32-WROOM-32D" H 3200 4550 50  0000 C CNN
F 2 "RF_Module:ESP32-WROOM-32" H 4100 2650 50  0001 C CNN
F 3 "https://www.espressif.com/sites/default/files/documentation/esp32-wroom-32d_esp32-wroom-32u_datasheet_en.pdf" H 3800 4200 50  0001 C CNN
	1    4100 4150
	1    0    0    -1  
$EndComp
Text Label 4800 2950 0    39   ~ 0
ID
Text Label 3400 2950 2    50   ~ 0
EN
Text Label 4800 3050 0    39   ~ 0
TXD
Text Label 4800 3250 0    39   ~ 0
RXD
Text Notes 3450 3250 2    28   ~ 0
only input
Text Notes 3450 3150 2    28   ~ 0
only input
Wire Wire Line
	2750 2950 2750 3050
Text Notes 4700 2950 0    39   ~ 0
IO0
Wire Wire Line
	4700 2950 4800 2950
Text Notes 5050 3450 0    28   ~ 0
UP during boot
Text Notes 3450 4700 1    28   ~ 0
Internally connected to the flash
Text Notes 5050 3850 0    28   ~ 0
UP during boot for log
Text Notes 5050 3150 0    28   ~ 0
DOWN during prog
Wire Wire Line
	4700 3250 4800 3250
Wire Wire Line
	4700 3050 4800 3050
Text Notes 5050 3550 0    28   ~ 0
DOWN during boot
Text Notes 5050 2950 0    28   ~ 0
UP during boot
Wire Wire Line
	2750 2950 2450 2950
$Comp
L Device:R_Small R1
U 1 1 5F041A53
P 2750 2700
F 0 "R1" H 2800 2650 39  0000 L CNN
F 1 "10k" H 2800 2700 39  0000 L CNN
F 2 "Resistor_SMD:R_0603_1608Metric" H 2750 2700 50  0001 C CNN
F 3 "~" H 2750 2700 50  0001 C CNN
	1    2750 2700
	-1   0    0    1   
$EndComp
$Comp
L Device:C_Small C1
U 1 1 5F041A4D
P 2750 3150
F 0 "C1" H 2700 3100 39  0000 R CNN
F 1 "10u" H 2700 3200 39  0000 R CNN
F 2 "Capacitor_SMD:C_0603_1608Metric" H 2750 3150 50  0001 C CNN
F 3 "~" H 2750 3150 50  0001 C CNN
	1    2750 3150
	1    0    0    1   
$EndComp
Connection ~ 2750 2950
$Comp
L power:GND #PWR05
U 1 1 5F041A46
P 2750 3350
F 0 "#PWR05" H 2750 3100 50  0001 C CNN
F 1 "GND" H 2755 3177 39  0000 C CNN
F 2 "" H 2750 3350 50  0001 C CNN
F 3 "" H 2750 3350 50  0001 C CNN
	1    2750 3350
	1    0    0    -1  
$EndComp
$Comp
L power:GND #PWR08
U 1 1 5F041A40
P 4100 2450
F 0 "#PWR08" H 4100 2200 50  0001 C CNN
F 1 "GND" H 4105 2277 39  0000 C CNN
F 2 "" H 4100 2450 50  0001 C CNN
F 3 "" H 4100 2450 50  0001 C CNN
	1    4100 2450
	-1   0    0    1   
$EndComp
$Comp
L power:GND #PWR07
U 1 1 5F041A3A
P 3850 2450
F 0 "#PWR07" H 3850 2200 50  0001 C CNN
F 1 "GND" H 3855 2277 39  0000 C CNN
F 2 "" H 3850 2450 50  0001 C CNN
F 3 "" H 3850 2450 50  0001 C CNN
	1    3850 2450
	-1   0    0    1   
$EndComp
Wire Wire Line
	3850 2650 3850 2750
Wire Wire Line
	4100 2650 4100 2750
$Comp
L Device:C_Small C2
U 1 1 5F041A32
P 3850 2550
F 0 "C2" H 3800 2500 39  0000 R CNN
F 1 "100n" H 3850 2600 39  0000 R CNN
F 2 "Capacitor_SMD:C_0603_1608Metric" H 3850 2550 50  0001 C CNN
F 3 "~" H 3850 2550 50  0001 C CNN
	1    3850 2550
	1    0    0    1   
$EndComp
$Comp
L Device:CP_Small C3
U 1 1 5F041A2C
P 4100 2550
F 0 "C3" H 4250 2500 39  0000 R CNN
F 1 "10u" H 4250 2600 39  0000 R CNN
F 2 "Capacitor_SMD:C_0603_1608Metric" H 4100 2550 50  0001 C CNN
F 3 "~" H 4100 2550 50  0001 C CNN
	1    4100 2550
	-1   0    0    1   
$EndComp
$Comp
L power:GND #PWR09
U 1 1 5F041A26
P 4100 5550
F 0 "#PWR09" H 4100 5300 50  0001 C CNN
F 1 "GND" H 4105 5377 50  0000 C CNN
F 2 "" H 4100 5550 50  0001 C CNN
F 3 "" H 4100 5550 50  0001 C CNN
	1    4100 5550
	1    0    0    -1  
$EndComp
Wire Wire Line
	9950 3000 9900 3000
Wire Wire Line
	9950 3100 9900 3100
Wire Wire Line
	8500 4000 8500 3850
Wire Wire Line
	8100 4000 8100 3950
$Comp
L power:GND #PWR?
U 1 1 5F3C8C75
P 8100 4000
AR Path="/5F1D940F/5F3C8C75" Ref="#PWR?"  Part="1" 
AR Path="/5F1D49F5/5F3C8C75" Ref="#PWR?"  Part="1" 
AR Path="/5F3C8C75" Ref="#PWR014"  Part="1" 
AR Path="/5F202C6C/5F3C8C75" Ref="#PWR?"  Part="1" 
F 0 "#PWR014" H 8100 3750 50  0001 C CNN
F 1 "GND" H 8105 3827 50  0000 C CNN
F 2 "" H 8100 4000 50  0001 C CNN
F 3 "" H 8100 4000 50  0001 C CNN
	1    8100 4000
	1    0    0    -1  
$EndComp
$Comp
L power:GND #PWR?
U 1 1 5F3C8C7B
P 8500 4000
AR Path="/5F1D940F/5F3C8C7B" Ref="#PWR?"  Part="1" 
AR Path="/5F1D49F5/5F3C8C7B" Ref="#PWR?"  Part="1" 
AR Path="/5F3C8C7B" Ref="#PWR019"  Part="1" 
AR Path="/5F202C6C/5F3C8C7B" Ref="#PWR?"  Part="1" 
F 0 "#PWR019" H 8500 3750 50  0001 C CNN
F 1 "GND" H 8505 3827 50  0000 C CNN
F 2 "" H 8500 4000 50  0001 C CNN
F 3 "" H 8500 4000 50  0001 C CNN
	1    8500 4000
	1    0    0    -1  
$EndComp
$Comp
L Device:R_Small R3
U 1 1 5F3C8C81
P 8100 3850
AR Path="/5F3C8C81" Ref="R3"  Part="1" 
AR Path="/5F1D940F/5F3C8C81" Ref="R?"  Part="1" 
AR Path="/5F1D49F5/5F3C8C81" Ref="R?"  Part="1" 
AR Path="/5F202C6C/5F3C8C81" Ref="R?"  Part="1" 
F 0 "R3" H 8150 3800 39  0000 L CNN
F 1 "10k" H 8150 3850 39  0000 L CNN
F 2 "Resistor_SMD:R_0603_1608Metric" H 8100 3850 50  0001 C CNN
F 3 "~" H 8100 3850 50  0001 C CNN
	1    8100 3850
	-1   0    0    1   
$EndComp
$Comp
L Device:Q_NMOS_GSD Q?
U 1 1 5F3C8C87
P 8400 3650
AR Path="/5F1D940F/5F3C8C87" Ref="Q?"  Part="1" 
AR Path="/5F1D49F5/5F3C8C87" Ref="Q?"  Part="1" 
AR Path="/5F3C8C87" Ref="Q2"  Part="1" 
AR Path="/5F202C6C/5F3C8C87" Ref="Q?"  Part="1" 
F 0 "Q2" H 8605 3696 39  0000 L CNN
F 1 "Si2302CDS" H 8605 3605 39  0000 L CNN
F 2 "Package_TO_SOT_SMD:SOT-23" H 8600 3750 50  0001 C CNN
F 3 "https://eu.mouser.com/datasheet/2/427/si2302cds-1764899.pdf" H 8400 3650 50  0001 C CNN
	1    8400 3650
	1    0    0    -1  
$EndComp
Wire Wire Line
	8500 3100 8500 3450
Wire Wire Line
	8100 3650 8100 3750
Wire Wire Line
	8100 3650 8200 3650
Wire Wire Line
	8100 3650 8000 3650
Connection ~ 8100 3650
Wire Wire Line
	8700 3100 8500 3100
Text Label 8000 5650 2    39   ~ 0
PWM0
Wire Wire Line
	8500 6000 8500 5850
Wire Wire Line
	8100 6000 8100 5950
$Comp
L power:GND #PWR?
U 1 1 5F3F56E1
P 8100 6000
AR Path="/5F1D940F/5F3F56E1" Ref="#PWR?"  Part="1" 
AR Path="/5F1D49F5/5F3F56E1" Ref="#PWR?"  Part="1" 
AR Path="/5F3F56E1" Ref="#PWR015"  Part="1" 
AR Path="/5F202C6C/5F3F56E1" Ref="#PWR?"  Part="1" 
F 0 "#PWR015" H 8100 5750 50  0001 C CNN
F 1 "GND" H 8105 5827 50  0000 C CNN
F 2 "" H 8100 6000 50  0001 C CNN
F 3 "" H 8100 6000 50  0001 C CNN
	1    8100 6000
	1    0    0    -1  
$EndComp
$Comp
L power:GND #PWR?
U 1 1 5F3F56E7
P 8500 6000
AR Path="/5F1D940F/5F3F56E7" Ref="#PWR?"  Part="1" 
AR Path="/5F1D49F5/5F3F56E7" Ref="#PWR?"  Part="1" 
AR Path="/5F3F56E7" Ref="#PWR021"  Part="1" 
AR Path="/5F202C6C/5F3F56E7" Ref="#PWR?"  Part="1" 
F 0 "#PWR021" H 8500 5750 50  0001 C CNN
F 1 "GND" H 8505 5827 50  0000 C CNN
F 2 "" H 8500 6000 50  0001 C CNN
F 3 "" H 8500 6000 50  0001 C CNN
	1    8500 6000
	1    0    0    -1  
$EndComp
$Comp
L Device:R_Small R4
U 1 1 5F3F56ED
P 8100 5850
AR Path="/5F3F56ED" Ref="R4"  Part="1" 
AR Path="/5F1D940F/5F3F56ED" Ref="R?"  Part="1" 
AR Path="/5F1D49F5/5F3F56ED" Ref="R?"  Part="1" 
AR Path="/5F202C6C/5F3F56ED" Ref="R?"  Part="1" 
F 0 "R4" H 8150 5800 39  0000 L CNN
F 1 "10k" H 8150 5850 39  0000 L CNN
F 2 "Resistor_SMD:R_0603_1608Metric" H 8100 5850 50  0001 C CNN
F 3 "~" H 8100 5850 50  0001 C CNN
	1    8100 5850
	-1   0    0    1   
$EndComp
$Comp
L Device:Q_NMOS_GSD Q?
U 1 1 5F3F56F3
P 8400 5650
AR Path="/5F1D940F/5F3F56F3" Ref="Q?"  Part="1" 
AR Path="/5F1D49F5/5F3F56F3" Ref="Q?"  Part="1" 
AR Path="/5F3F56F3" Ref="Q3"  Part="1" 
AR Path="/5F202C6C/5F3F56F3" Ref="Q?"  Part="1" 
F 0 "Q3" H 8605 5696 39  0000 L CNN
F 1 "Si2302CDS" H 8605 5605 39  0000 L CNN
F 2 "Package_TO_SOT_SMD:SOT-23" H 8600 5750 50  0001 C CNN
F 3 "https://eu.mouser.com/datasheet/2/427/si2302cds-1764899.pdf" H 8400 5650 50  0001 C CNN
	1    8400 5650
	1    0    0    -1  
$EndComp
Wire Wire Line
	8500 5100 8500 5450
Wire Wire Line
	8100 5650 8100 5750
Wire Wire Line
	8100 5650 8200 5650
Wire Wire Line
	8100 5650 8000 5650
Connection ~ 8100 5650
Wire Wire Line
	8700 5100 8500 5100
$Comp
L power:+3.3V #PWR018
U 1 1 5F312500
P 8500 3000
AR Path="/5F312500" Ref="#PWR018"  Part="1" 
AR Path="/5F1D49F5/5F312500" Ref="#PWR?"  Part="1" 
AR Path="/5F202C6C/5F312500" Ref="#PWR?"  Part="1" 
AR Path="/5F1D940F/5F312500" Ref="#PWR?"  Part="1" 
F 0 "#PWR018" H 8500 2850 50  0001 C CNN
F 1 "+3.3V" H 8515 3173 39  0000 C CNN
F 2 "" H 8500 3000 50  0001 C CNN
F 3 "" H 8500 3000 50  0001 C CNN
	1    8500 3000
	1    0    0    -1  
$EndComp
$Comp
L power:+3.3V #PWR020
U 1 1 5F3392BB
P 8500 5000
AR Path="/5F3392BB" Ref="#PWR020"  Part="1" 
AR Path="/5F1D49F5/5F3392BB" Ref="#PWR?"  Part="1" 
AR Path="/5F202C6C/5F3392BB" Ref="#PWR?"  Part="1" 
AR Path="/5F1D940F/5F3392BB" Ref="#PWR?"  Part="1" 
F 0 "#PWR020" H 8500 4850 50  0001 C CNN
F 1 "+3.3V" H 8515 5173 39  0000 C CNN
F 2 "" H 8500 5000 50  0001 C CNN
F 3 "" H 8500 5000 50  0001 C CNN
	1    8500 5000
	1    0    0    -1  
$EndComp
Text Notes 9250 5800 0    50   ~ 0
IN-S124ARUW White\nVf = 3.1 V @ 10 mA
Text Notes 9250 3800 0    50   ~ 0
IN-S124ARG Green\nVf = 3.1 V @ 10 mA
Text Notes 9250 1800 0    50   ~ 0
IN-S124ARUR Red\nVf = 2.05 V @ 10 mA
$Comp
L Power_Supervisor:LM809 U1
U 1 1 5F3BDE17
P 1600 2950
F 0 "U1" H 1371 2988 39  0000 R CNN
F 1 "TLV803E" H 1371 2913 39  0000 R CNN
F 2 "Package_TO_SOT_SMD:SOT-23" H 1900 3050 50  0001 C CNN
F 3 "https://www.ti.com/lit/ds/symlink/tlv803e.pdf" H 1900 3050 50  0001 C CNN
	1    1600 2950
	1    0    0    -1  
$EndComp
Wire Wire Line
	2450 2950 1900 2950
Connection ~ 2450 2950
$Comp
L power:GND #PWR02
U 1 1 5F3C1E9C
P 1600 3350
F 0 "#PWR02" H 1600 3100 50  0001 C CNN
F 1 "GND" H 1605 3177 39  0000 C CNN
F 2 "" H 1600 3350 50  0001 C CNN
F 3 "" H 1600 3350 50  0001 C CNN
	1    1600 3350
	1    0    0    -1  
$EndComp
$Comp
L power:+3.3V #PWR01
U 1 1 5F3C2192
P 1600 2450
F 0 "#PWR01" H 1600 2300 50  0001 C CNN
F 1 "+3.3V" H 1615 2623 39  0000 C CNN
F 2 "" H 1600 2450 50  0001 C CNN
F 3 "" H 1600 2450 50  0001 C CNN
	1    1600 2450
	1    0    0    -1  
$EndComp
Wire Wire Line
	1600 2450 1600 2550
$Comp
L power:GND #PWR?
U 1 1 5F4010BA
P 7100 2350
AR Path="/5F1D940F/5F4010BA" Ref="#PWR?"  Part="1" 
AR Path="/5F1D49F5/5F4010BA" Ref="#PWR?"  Part="1" 
AR Path="/5F4010BA" Ref="#PWR012"  Part="1" 
AR Path="/5F202C6C/5F4010BA" Ref="#PWR?"  Part="1" 
F 0 "#PWR012" H 7100 2100 50  0001 C CNN
F 1 "GND" V 7100 2150 39  0000 C CNN
F 2 "" H 7100 2350 50  0001 C CNN
F 3 "" H 7100 2350 50  0001 C CNN
	1    7100 2350
	0    -1   -1   0   
$EndComp
Wire Wire Line
	7100 2350 7000 2350
Wire Wire Line
	7100 2350 7100 2450
Wire Wire Line
	7100 2450 7000 2450
Connection ~ 7100 2350
Wire Wire Line
	4700 5250 4800 5250
Text Label 4800 5250 0    39   ~ 0
~IRQ
Wire Wire Line
	7100 2550 7000 2550
Text Label 7100 2550 0    39   ~ 0
~IRQ
$Sheet
S 6450 1550 550  400 
U 5F580A78
F0 "Mechanical" 39
F1 "sub_mechanical.sch" 39
$EndSheet
$Comp
L Connector_Generic:Conn_01x02 J1
U 1 1 5F731397
P 8900 1000
F 0 "J1" H 8980 984 39  0000 L CNN
F 1 "JST/SR" H 8980 909 39  0000 L CNN
F 2 "Connector_JST:JST_SH_BM02B-SRSS-TB_1x02-1MP_P1.00mm_Vertical" H 8900 1000 50  0001 C CNN
F 3 "http://www.jst-mfg.com/product/pdf/eng/eSH.pdf" H 8900 1000 50  0001 C CNN
F 4 "BM02B-SRSS-TB" H 8900 1000 50  0001 C CNN "Mfr"
F 5 "455-1788-1-ND" H 8900 1000 50  0001 C CNN "Dist"
	1    8900 1000
	1    0    0    -1  
$EndComp
$Comp
L Connector_Generic:Conn_01x02 J4
U 1 1 5F75A8B4
P 9700 1000
F 0 "J4" H 9780 984 39  0000 L CNN
F 1 "JST/SH" H 9780 909 39  0000 L CNN
F 2 "Connector_PinHeader_1.00mm:PinHeader_1x02_P1.00mm_Vertical" H 9700 1000 50  0001 C CNN
F 3 "~" H 9700 1000 50  0001 C CNN
F 4 "1832-1049-ND" H 9700 1000 50  0001 C CNN "Dist"
F 5 "ASR00015-50" H 9700 1000 50  0001 C CNN "Mfr"
	1    9700 1000
	-1   0    0    -1  
$EndComp
$Comp
L Connector_Generic:Conn_01x02 J2
U 1 1 5F767C6F
P 8900 3000
F 0 "J2" H 8980 2984 39  0000 L CNN
F 1 "JST/SR" H 8980 2909 39  0000 L CNN
F 2 "Connector_JST:JST_SH_BM02B-SRSS-TB_1x02-1MP_P1.00mm_Vertical" H 8900 3000 50  0001 C CNN
F 3 "http://www.jst-mfg.com/product/pdf/eng/eSH.pdf" H 8900 3000 50  0001 C CNN
F 4 "BM02B-SRSS-TB" H 8900 3000 50  0001 C CNN "Mfr"
F 5 "455-1788-1-ND" H 8900 3000 50  0001 C CNN "Dist"
	1    8900 3000
	1    0    0    -1  
$EndComp
$Comp
L Connector_Generic:Conn_01x02 J5
U 1 1 5F767C77
P 9700 3000
F 0 "J5" H 9780 2984 39  0000 L CNN
F 1 "JST/SH" H 9780 2909 39  0000 L CNN
F 2 "Connector_PinHeader_1.00mm:PinHeader_1x02_P1.00mm_Vertical" H 9700 3000 50  0001 C CNN
F 3 "~" H 9700 3000 50  0001 C CNN
F 4 "1832-1049-ND" H 9700 3000 50  0001 C CNN "Dist"
F 5 "ASR00015-50" H 9700 3000 50  0001 C CNN "Mfr"
	1    9700 3000
	-1   0    0    -1  
$EndComp
$Comp
L Connector_Generic:Conn_01x02 J3
U 1 1 5F782455
P 8900 5000
F 0 "J3" H 8980 4984 39  0000 L CNN
F 1 "JST/SR" H 8980 4909 39  0000 L CNN
F 2 "Connector_JST:JST_SH_BM02B-SRSS-TB_1x02-1MP_P1.00mm_Vertical" H 8900 5000 50  0001 C CNN
F 3 "http://www.jst-mfg.com/product/pdf/eng/eSH.pdf" H 8900 5000 50  0001 C CNN
F 4 "BM02B-SRSS-TB" H 8900 5000 50  0001 C CNN "Mfr"
F 5 "455-1788-1-ND" H 8900 5000 50  0001 C CNN "Dist"
	1    8900 5000
	1    0    0    -1  
$EndComp
$Comp
L Connector_Generic:Conn_01x02 J6
U 1 1 5F78245D
P 9700 5000
F 0 "J6" H 9780 4984 39  0000 L CNN
F 1 "JST/SH" H 9780 4909 39  0000 L CNN
F 2 "Connector_PinHeader_1.00mm:PinHeader_1x02_P1.00mm_Vertical" H 9700 5000 50  0001 C CNN
F 3 "~" H 9700 5000 50  0001 C CNN
F 4 "1832-1049-ND" H 9700 5000 50  0001 C CNN "Dist"
F 5 "ASR00015-50" H 9700 5000 50  0001 C CNN "Mfr"
	1    9700 5000
	-1   0    0    -1  
$EndComp
Wire Wire Line
	9950 5000 9900 5000
Wire Wire Line
	9950 5100 9900 5100
Wire Wire Line
	8500 1000 8700 1000
Wire Wire Line
	8500 3000 8700 3000
Wire Wire Line
	8500 5000 8700 5000
Text GLabel 4800 3650 2    39   Input ~ 0
SDA
Wire Wire Line
	4800 3950 4700 3950
Wire Wire Line
	4800 3150 4700 3150
$Sheet
S 6450 3700 550  675 
U 5F0B26AB
F0 "Speaker" 39
F1 "sub_speaker.sch" 39
F2 "LRCLK" I L 6450 3800 39 
F3 "DIN" I L 6450 3900 39 
F4 "BCLK" I L 6450 4000 39 
F5 "~SD" I L 6450 4100 39 
F6 "~CS" I L 6450 4200 39 
F7 "~CD" I L 6450 4300 39 
$EndSheet
Wire Wire Line
	6350 4300 6450 4300
Text Label 6350 4300 2    39   ~ 0
~CD
Text Label 4800 5150 0    39   ~ 0
~CD
$Sheet
S 9950 850  800  400 
U 5F7B4C62
F0 "Granstand team A" 39
F1 "sub_granstand_a.sch" 39
F2 "V+" I L 9950 1000 39 
F3 "V-" I L 9950 1100 39 
$EndSheet
$Sheet
S 9950 2850 800  400 
U 5F7B83A2
F0 "Grandstand Team B" 39
F1 "sub_granstand_b.sch" 39
F2 "V+" I L 9950 3000 39 
F3 "V-" I L 9950 3100 39 
$EndSheet
$Sheet
S 9950 4850 800  400 
U 5F7C0AF0
F0 "Stadium Light" 39
F1 "sub_lighting.sch" 39
F2 "V+" I L 9950 5000 39 
F3 "V-" I L 9950 5100 39 
$EndSheet
$EndSCHEMATC
