EESchema Schematic File Version 4
EELAYER 30 0
EELAYER END
$Descr A4 11693 8268
encoding utf-8
Sheet 8 9
Title "Electrical Load"
Date "2020-09-01"
Rev "1.0"
Comp "Institute for Automation of Complex Power Systems - E.ON ERC - RWTH Aachen University"
Comment1 "Designer: D.Wienands, S.Melcher, L.Jeske, D.Moll"
Comment2 "Supervisor: C. Guarnieri Calò Carducci"
Comment3 ""
Comment4 ""
$EndDescr
Wire Wire Line
	5900 2100 5900 2250
Text Notes 5050 2200 0    39   ~ 0
Amber LED\nVf = 2.2 V @ If = 30 mA
$Comp
L Device:Q_NMOS_GSD Q?
U 1 1 5F74D2B5
P 3650 6250
AR Path="/5F2104BF/5F74D2B5" Ref="Q?"  Part="1" 
AR Path="/5F74D2B5" Ref="Q?"  Part="1" 
AR Path="/5F5F0002/5F74D2B5" Ref="Q?"  Part="1" 
AR Path="/5F496ED4/5F74D2B5" Ref="Q?"  Part="1" 
AR Path="/5EFE1C3B/5F74D2B5" Ref="Q21"  Part="1" 
F 0 "Q21" H 3855 6288 39  0000 L CNN
F 1 "Si2302CDS" H 3855 6213 39  0000 L CNN
F 2 "Package_TO_SOT_SMD:SOT-23" H 3850 6350 50  0001 C CNN
F 3 "https://eu.mouser.com/datasheet/2/427/si2302cds-1764899.pdf" H 3650 6250 50  0001 C CNN
	1    3650 6250
	1    0    0    -1  
$EndComp
$Comp
L Device:Q_PMOS_GSD Q?
U 1 1 5F74D2BB
P 3650 5600
AR Path="/5F496ED4/5F74D2BB" Ref="Q?"  Part="1" 
AR Path="/5F74D2BB" Ref="Q?"  Part="1" 
AR Path="/5F5F0002/5F74D2BB" Ref="Q?"  Part="1" 
AR Path="/5F2104BF/5F74D2BB" Ref="Q?"  Part="1" 
AR Path="/5EFE1C3B/5F74D2BB" Ref="Q20"  Part="1" 
F 0 "Q20" H 3855 5562 39  0000 L CNN
F 1 "Si2301BDS" H 3850 5625 39  0000 L CNN
F 2 "Package_TO_SOT_SMD:SOT-23" H 3850 5700 50  0001 C CNN
F 3 "https://eu.mouser.com/datasheet/2/427/si2301bds-1765637.pdf" H 3650 5600 50  0001 C CNN
	1    3650 5600
	1    0    0    1   
$EndComp
Text HLabel 2325 5600 0    39   Input ~ 0
SOURCE
Text HLabel 3450 6250 0    39   Input ~ 0
SOURCE
$Comp
L Device:R_Small R?
U 1 1 5F74D2F4
P 2550 5750
AR Path="/5F2104BF/5F74D2F4" Ref="R?"  Part="1" 
AR Path="/5F74D2F4" Ref="R?"  Part="1" 
AR Path="/5F5F0002/5F74D2F4" Ref="R?"  Part="1" 
AR Path="/5EFE1C3B/5F74D2F4" Ref="R47"  Part="1" 
F 0 "R47" H 2609 5788 39  0000 L CNN
F 1 "10k" H 2609 5713 39  0000 L CNN
F 2 "Resistor_SMD:R_0603_1608Metric" H 2550 5750 50  0001 C CNN
F 3 "~" H 2550 5750 50  0001 C CNN
F 4 "" H 2550 5750 50  0001 C CNN "Mfr"
	1    2550 5750
	1    0    0    -1  
$EndComp
$Comp
L power:GND #PWR?
U 1 1 5F74D2FA
P 2550 5900
AR Path="/5F2104BF/5F74D2FA" Ref="#PWR?"  Part="1" 
AR Path="/5F74D2FA" Ref="#PWR?"  Part="1" 
AR Path="/5F5F0002/5F74D2FA" Ref="#PWR?"  Part="1" 
AR Path="/5EFE1C3B/5F74D2FA" Ref="#PWR089"  Part="1" 
F 0 "#PWR089" H 2550 5650 50  0001 C CNN
F 1 "GND" H 2555 5735 39  0000 C CNN
F 2 "" H 2550 5900 50  0001 C CNN
F 3 "" H 2550 5900 50  0001 C CNN
	1    2550 5900
	1    0    0    -1  
$EndComp
Wire Wire Line
	2550 5850 2550 5900
Wire Wire Line
	2550 5650 2550 5600
Text Notes 3450 5575 0    39   ~ 0
GRID
Text Notes 3400 6225 0    39   ~ 0
SOLAR
$Comp
L Device:R_Small R?
U 1 1 5F77AD0E
P 5900 1600
AR Path="/5F2104BF/5F77AD0E" Ref="R?"  Part="1" 
AR Path="/5F77AD0E" Ref="R?"  Part="1" 
AR Path="/5F5F0002/5F77AD0E" Ref="R?"  Part="1" 
AR Path="/5EFE1C3B/5F77AD0E" Ref="R70"  Part="1" 
F 0 "R70" H 5959 1638 39  0000 L CNN
F 1 "100" H 5959 1563 39  0000 L CNN
F 2 "Resistor_SMD:R_0603_1608Metric" H 5900 1600 50  0001 C CNN
F 3 "~" H 5900 1600 50  0001 C CNN
	1    5900 1600
	1    0    0    -1  
$EndComp
Wire Wire Line
	5900 1700 5900 1800
$Comp
L Device:Q_NMOS_GSD Q?
U 1 1 5F7CC35A
P 2950 5500
AR Path="/5F2104BF/5F7CC35A" Ref="Q?"  Part="1" 
AR Path="/5F7CC35A" Ref="Q?"  Part="1" 
AR Path="/5F5F0002/5F7CC35A" Ref="Q?"  Part="1" 
AR Path="/5F496ED4/5F7CC35A" Ref="Q?"  Part="1" 
AR Path="/5EFE1C3B/5F7CC35A" Ref="Q19"  Part="1" 
F 0 "Q19" V 3155 5538 39  0000 L CNN
F 1 "Si2302CDS" V 3225 5500 39  0000 L CNN
F 2 "Package_TO_SOT_SMD:SOT-23" H 3150 5600 50  0001 C CNN
F 3 "https://eu.mouser.com/datasheet/2/427/si2302cds-1764899.pdf" H 2950 5500 50  0001 C CNN
	1    2950 5500
	0    1    1    0   
$EndComp
$Comp
L Device:R_Small R?
U 1 1 5F7D5FD8
P 3225 5450
AR Path="/5F2104BF/5F7D5FD8" Ref="R?"  Part="1" 
AR Path="/5F7D5FD8" Ref="R?"  Part="1" 
AR Path="/5F5F0002/5F7D5FD8" Ref="R?"  Part="1" 
AR Path="/5EFE1C3B/5F7D5FD8" Ref="R48"  Part="1" 
F 0 "R48" H 3284 5488 39  0000 L CNN
F 1 "10k" H 3284 5413 39  0000 L CNN
F 2 "Resistor_SMD:R_0603_1608Metric" H 3225 5450 50  0001 C CNN
F 3 "~" H 3225 5450 50  0001 C CNN
F 4 "" H 3225 5450 50  0001 C CNN "Mfr"
	1    3225 5450
	1    0    0    -1  
$EndComp
Wire Wire Line
	3225 5550 3225 5600
Connection ~ 3225 5600
Wire Wire Line
	3225 5600 3150 5600
$Comp
L power:+3.3V #PWR?
U 1 1 5F7D94C9
P 2950 5300
AR Path="/5F7D94C9" Ref="#PWR?"  Part="1" 
AR Path="/5F2104BF/5F7D94C9" Ref="#PWR?"  Part="1" 
AR Path="/5EFE1C3B/5F7D94C9" Ref="#PWR090"  Part="1" 
F 0 "#PWR090" H 2950 5150 50  0001 C CNN
F 1 "+3.3V" H 2965 5473 39  0000 C CNN
F 2 "" H 2950 5300 50  0001 C CNN
F 3 "" H 2950 5300 50  0001 C CNN
	1    2950 5300
	1    0    0    -1  
$EndComp
Connection ~ 2550 5600
Wire Wire Line
	2550 5600 2750 5600
Wire Wire Line
	2325 5600 2550 5600
$Comp
L power:+5V #PWR?
U 1 1 5F7ED2A3
P 3225 5300
AR Path="/5F102375/5F7ED2A3" Ref="#PWR?"  Part="1" 
AR Path="/5F2104BF/5F7ED2A3" Ref="#PWR?"  Part="1" 
AR Path="/5EFE1C3B/5F7ED2A3" Ref="#PWR093"  Part="1" 
F 0 "#PWR093" H 3225 5150 50  0001 C CNN
F 1 "+5V" H 3225 5475 39  0000 C CNN
F 2 "" H 3225 5300 50  0001 C CNN
F 3 "" H 3225 5300 50  0001 C CNN
	1    3225 5300
	1    0    0    -1  
$EndComp
Wire Wire Line
	3225 5300 3225 5350
$Comp
L power:+5V #PWR?
U 1 1 5F7F2C13
P 3750 5300
AR Path="/5F102375/5F7F2C13" Ref="#PWR?"  Part="1" 
AR Path="/5F2104BF/5F7F2C13" Ref="#PWR?"  Part="1" 
AR Path="/5EFE1C3B/5F7F2C13" Ref="#PWR094"  Part="1" 
F 0 "#PWR094" H 3750 5150 50  0001 C CNN
F 1 "+5V" H 3750 5475 39  0000 C CNN
F 2 "" H 3750 5300 50  0001 C CNN
F 3 "" H 3750 5300 50  0001 C CNN
	1    3750 5300
	1    0    0    -1  
$EndComp
Wire Wire Line
	3750 5300 3750 5400
Wire Wire Line
	3225 5600 3450 5600
$Comp
L power:GND #PWR?
U 1 1 5F8082D7
P 3750 6450
AR Path="/5F2104BF/5F8082D7" Ref="#PWR?"  Part="1" 
AR Path="/5F8082D7" Ref="#PWR?"  Part="1" 
AR Path="/5F5F0002/5F8082D7" Ref="#PWR?"  Part="1" 
AR Path="/5EFE1C3B/5F8082D7" Ref="#PWR095"  Part="1" 
F 0 "#PWR095" H 3750 6200 50  0001 C CNN
F 1 "GND" H 3755 6285 39  0000 C CNN
F 2 "" H 3750 6450 50  0001 C CNN
F 3 "" H 3750 6450 50  0001 C CNN
	1    3750 6450
	1    0    0    -1  
$EndComp
Wire Wire Line
	3750 5800 3750 5850
Wire Wire Line
	3750 6000 3750 6050
Text Label 3750 5850 0    39   ~ 0
GRID
Text Label 3750 6000 0    39   ~ 0
SOLAR
$Comp
L power:GND #PWR?
U 1 1 5F560ECF
P 5900 2650
AR Path="/5F2104BF/5F560ECF" Ref="#PWR?"  Part="1" 
AR Path="/5F560ECF" Ref="#PWR?"  Part="1" 
AR Path="/5F5F0002/5F560ECF" Ref="#PWR?"  Part="1" 
AR Path="/5EFE1C3B/5F560ECF" Ref="#PWR0119"  Part="1" 
F 0 "#PWR0119" H 5900 2400 50  0001 C CNN
F 1 "GND" H 5905 2485 39  0000 C CNN
F 2 "" H 5900 2650 50  0001 C CNN
F 3 "" H 5900 2650 50  0001 C CNN
	1    5900 2650
	1    0    0    -1  
$EndComp
Wire Wire Line
	7250 1425 7250 1500
Wire Wire Line
	7250 2100 7250 2250
Text Notes 6400 2200 0    39   ~ 0
Red LED\nVf = 2.05 V @ If = 10 mA
Wire Wire Line
	7250 1700 7250 1800
$Comp
L power:GND #PWR?
U 1 1 5F5AA733
P 7250 2650
AR Path="/5F2104BF/5F5AA733" Ref="#PWR?"  Part="1" 
AR Path="/5F5AA733" Ref="#PWR?"  Part="1" 
AR Path="/5F5F0002/5F5AA733" Ref="#PWR?"  Part="1" 
AR Path="/5EFE1C3B/5F5AA733" Ref="#PWR0124"  Part="1" 
F 0 "#PWR0124" H 7250 2400 50  0001 C CNN
F 1 "GND" H 7255 2485 39  0000 C CNN
F 2 "" H 7250 2650 50  0001 C CNN
F 3 "" H 7250 2650 50  0001 C CNN
	1    7250 2650
	1    0    0    -1  
$EndComp
Wire Wire Line
	7750 1425 7750 1500
Wire Wire Line
	7750 2100 7750 2250
Wire Wire Line
	7750 1700 7750 1800
Wire Wire Line
	7750 2250 7250 2250
Connection ~ 7250 2250
$Comp
L Interface_Expansion:PCA9536D U12
U 1 1 5F5EB13A
P 2050 1650
F 0 "U12" H 2250 2050 39  0000 C CNN
F 1 "PCA9536D" H 2400 1950 39  0000 C CNN
F 2 "Package_SO:SOIC-8_3.9x4.9mm_P1.27mm" H 3050 1300 50  0001 C CNN
F 3 "http://www.nxp.com/documents/data_sheet/PCA9536.pdf" H 1850 -50 50  0001 C CNN
	1    2050 1650
	1    0    0    -1  
$EndComp
$Comp
L power:GND #PWR?
U 1 1 5F5ECE54
P 2050 2050
AR Path="/5F2104BF/5F5ECE54" Ref="#PWR?"  Part="1" 
AR Path="/5F5ECE54" Ref="#PWR?"  Part="1" 
AR Path="/5F5F0002/5F5ECE54" Ref="#PWR?"  Part="1" 
AR Path="/5EFE1C3B/5F5ECE54" Ref="#PWR092"  Part="1" 
F 0 "#PWR092" H 2050 1800 50  0001 C CNN
F 1 "GND" H 2055 1885 39  0000 C CNN
F 2 "" H 2050 2050 50  0001 C CNN
F 3 "" H 2050 2050 50  0001 C CNN
	1    2050 2050
	1    0    0    -1  
$EndComp
$Comp
L power:+3.3V #PWR?
U 1 1 5F6132A7
P 2050 1350
AR Path="/5F6132A7" Ref="#PWR?"  Part="1" 
AR Path="/5F2104BF/5F6132A7" Ref="#PWR?"  Part="1" 
AR Path="/5EFE1C3B/5F6132A7" Ref="#PWR091"  Part="1" 
F 0 "#PWR091" H 2050 1200 50  0001 C CNN
F 1 "+3.3V" H 2065 1523 39  0000 C CNN
F 2 "" H 2050 1350 50  0001 C CNN
F 3 "" H 2050 1350 50  0001 C CNN
	1    2050 1350
	1    0    0    -1  
$EndComp
Text GLabel 1450 1750 0    39   Input ~ 0
SDA
Text GLabel 1450 1850 0    39   Input ~ 0
SCL
Wire Wire Line
	1550 1750 1450 1750
Wire Wire Line
	1550 1850 1450 1850
Text Notes 3325 1475 0    39   ~ 0
Utility State Indicator
Text Notes 2050 2450 0    39   ~ 0
Red LED\nVf = 2.05 V @ If = 10 mA
Wire Wire Line
	3000 1850 3000 2100
$Comp
L power:GND #PWR?
U 1 1 5F66AD73
P 4200 2850
AR Path="/5F2104BF/5F66AD73" Ref="#PWR?"  Part="1" 
AR Path="/5F66AD73" Ref="#PWR?"  Part="1" 
AR Path="/5F5F0002/5F66AD73" Ref="#PWR?"  Part="1" 
AR Path="/5EFE1C3B/5F66AD73" Ref="#PWR099"  Part="1" 
F 0 "#PWR099" H 4200 2600 50  0001 C CNN
F 1 "GND" H 4205 2685 39  0000 C CNN
F 2 "" H 4200 2850 50  0001 C CNN
F 3 "" H 4200 2850 50  0001 C CNN
	1    4200 2850
	1    0    0    -1  
$EndComp
$Comp
L Device:LED D?
U 1 1 5F670AA3
P 3800 2250
AR Path="/5F2104BF/5F670AA3" Ref="D?"  Part="1" 
AR Path="/5F670AA3" Ref="D?"  Part="1" 
AR Path="/5F5F0002/5F670AA3" Ref="D?"  Part="1" 
AR Path="/5F496ED4/5F670AA3" Ref="D?"  Part="1" 
AR Path="/5EFE1C3B/5F670AA3" Ref="D17"  Part="1" 
F 0 "D17" V 3831 2132 39  0000 R CNN
F 1 "IN-S126ATR" V 3750 2100 39  0001 R CNN
F 2 "LED_SMD:LED_1206_3216Metric_Castellated" H 3800 2250 50  0001 C CNN
F 3 "http://inolux-corp.com/datasheet/SMDLED/Mono%20Color%20Top%20View/IN-S126AT%20Series_V1.0.pdf" H 3800 2250 50  0001 C CNN
	1    3800 2250
	0    1    -1   0   
$EndComp
$Comp
L Device:R_Small R?
U 1 1 5F670AAA
P 3800 2600
AR Path="/5F2104BF/5F670AAA" Ref="R?"  Part="1" 
AR Path="/5F670AAA" Ref="R?"  Part="1" 
AR Path="/5F5F0002/5F670AAA" Ref="R?"  Part="1" 
AR Path="/5EFE1C3B/5F670AAA" Ref="R54"  Part="1" 
F 0 "R54" H 3859 2638 39  0000 L CNN
F 1 "120" H 3859 2563 39  0000 L CNN
F 2 "Resistor_SMD:R_0603_1608Metric" H 3800 2600 50  0001 C CNN
F 3 "~" H 3800 2600 50  0001 C CNN
F 4 "" H 3800 2600 50  0001 C CNN "Mfr"
	1    3800 2600
	1    0    0    -1  
$EndComp
$Comp
L power:GND #PWR?
U 1 1 5F670AB0
P 3000 2850
AR Path="/5F2104BF/5F670AB0" Ref="#PWR?"  Part="1" 
AR Path="/5F670AB0" Ref="#PWR?"  Part="1" 
AR Path="/5F5F0002/5F670AB0" Ref="#PWR?"  Part="1" 
AR Path="/5EFE1C3B/5F670AB0" Ref="#PWR0101"  Part="1" 
F 0 "#PWR0101" H 3000 2600 50  0001 C CNN
F 1 "GND" H 3005 2685 39  0000 C CNN
F 2 "" H 3000 2850 50  0001 C CNN
F 3 "" H 3000 2850 50  0001 C CNN
	1    3000 2850
	1    0    0    -1  
$EndComp
Wire Wire Line
	3800 2400 3800 2500
Wire Wire Line
	3800 2700 3800 2850
Wire Wire Line
	2550 1850 3000 1850
Wire Wire Line
	2550 1750 3400 1750
Wire Wire Line
	3400 1750 3400 2100
Wire Wire Line
	2550 1650 3800 1650
Wire Wire Line
	3800 1650 3800 2100
Wire Wire Line
	2550 1550 4200 1550
Wire Wire Line
	4200 1550 4200 2100
Text Label 2600 1750 0    39   ~ 0
LED_AC
Text Label 2600 1650 0    39   ~ 0
LED_Oven
Wire Wire Line
	5600 2450 5500 2450
Wire Wire Line
	6950 2450 6850 2450
Text Label 5975 4575 3    39   ~ 0
SOLAR
$Comp
L power:+5V #PWR?
U 1 1 5F5B10CD
P 5975 3625
AR Path="/5F102375/5F5B10CD" Ref="#PWR?"  Part="1" 
AR Path="/5F2104BF/5F5B10CD" Ref="#PWR?"  Part="1" 
AR Path="/5EFE1C3B/5F5B10CD" Ref="#PWR0126"  Part="1" 
F 0 "#PWR0126" H 5975 3475 50  0001 C CNN
F 1 "+5V" H 5975 3800 39  0000 C CNN
F 2 "" H 5975 3625 50  0001 C CNN
F 3 "" H 5975 3625 50  0001 C CNN
	1    5975 3625
	1    0    0    -1  
$EndComp
Wire Wire Line
	5975 4575 5975 4425
$Comp
L Device:R_Small R?
U 1 1 5F5B10C6
P 5975 4325
AR Path="/5F2104BF/5F5B10C6" Ref="R?"  Part="1" 
AR Path="/5F5B10C6" Ref="R?"  Part="1" 
AR Path="/5F5F0002/5F5B10C6" Ref="R?"  Part="1" 
AR Path="/5EFE1C3B/5F5B10C6" Ref="R78"  Part="1" 
F 0 "R78" H 6034 4363 39  0000 L CNN
F 1 "180" H 6034 4288 39  0000 L CNN
F 2 "Resistor_SMD:R_0603_1608Metric" H 5975 4325 50  0001 C CNN
F 3 "~" H 5975 4325 50  0001 C CNN
F 4 "" H 5975 4325 50  0001 C CNN "Mfr"
	1    5975 4325
	1    0    0    -1  
$EndComp
Wire Wire Line
	5975 3775 5975 3625
$Comp
L Device:LED D?
U 1 1 5F5B10BE
P 5975 3925
AR Path="/5F2104BF/5F5B10BE" Ref="D?"  Part="1" 
AR Path="/5F5B10BE" Ref="D?"  Part="1" 
AR Path="/5F5F0002/5F5B10BE" Ref="D?"  Part="1" 
AR Path="/5F496ED4/5F5B10BE" Ref="D?"  Part="1" 
AR Path="/5EFE1C3B/5F5B10BE" Ref="D39"  Part="1" 
F 0 "D39" V 6006 3807 39  0000 R CNN
F 1 "IN-S126ATB " V 5931 3807 39  0001 R CNN
F 2 "LED_SMD:LED_1206_3216Metric_Castellated" H 5975 3925 50  0001 C CNN
F 3 "http://inolux-corp.com/datasheet/SMDLED/Mono%20Color%20Top%20View/IN-S126AT%20Series_V1.0.pdf" H 5975 3925 50  0001 C CNN
	1    5975 3925
	0    1    -1   0   
$EndComp
Wire Wire Line
	5975 4225 5975 4075
Text Label 3175 4575 3    39   ~ 0
SOLAR
$Comp
L power:+5V #PWR?
U 1 1 5F5E357C
P 3175 3625
AR Path="/5F102375/5F5E357C" Ref="#PWR?"  Part="1" 
AR Path="/5F2104BF/5F5E357C" Ref="#PWR?"  Part="1" 
AR Path="/5EFE1C3B/5F5E357C" Ref="#PWR098"  Part="1" 
F 0 "#PWR098" H 3175 3475 50  0001 C CNN
F 1 "+5V" H 3175 3800 39  0000 C CNN
F 2 "" H 3175 3625 50  0001 C CNN
F 3 "" H 3175 3625 50  0001 C CNN
	1    3175 3625
	1    0    0    -1  
$EndComp
Wire Wire Line
	3175 4575 3175 4425
$Comp
L Device:R_Small R?
U 1 1 5F5E3575
P 3175 4325
AR Path="/5F2104BF/5F5E3575" Ref="R?"  Part="1" 
AR Path="/5F5E3575" Ref="R?"  Part="1" 
AR Path="/5F5F0002/5F5E3575" Ref="R?"  Part="1" 
AR Path="/5EFE1C3B/5F5E3575" Ref="R51"  Part="1" 
F 0 "R51" H 3234 4363 39  0000 L CNN
F 1 "180" H 3234 4288 39  0000 L CNN
F 2 "Resistor_SMD:R_0603_1608Metric" H 3175 4325 50  0001 C CNN
F 3 "~" H 3175 4325 50  0001 C CNN
F 4 "" H 3175 4325 50  0001 C CNN "Mfr"
	1    3175 4325
	1    0    0    -1  
$EndComp
Wire Wire Line
	3175 3775 3175 3625
$Comp
L Device:LED D?
U 1 1 5F5E356D
P 3175 3925
AR Path="/5F2104BF/5F5E356D" Ref="D?"  Part="1" 
AR Path="/5F5E356D" Ref="D?"  Part="1" 
AR Path="/5F5F0002/5F5E356D" Ref="D?"  Part="1" 
AR Path="/5F496ED4/5F5E356D" Ref="D?"  Part="1" 
AR Path="/5EFE1C3B/5F5E356D" Ref="D14"  Part="1" 
F 0 "D14" V 3206 3807 39  0000 R CNN
F 1 "IN-S126ATB " V 3131 3807 39  0001 R CNN
F 2 "LED_SMD:LED_1206_3216Metric_Castellated" H 3175 3925 50  0001 C CNN
F 3 "http://inolux-corp.com/datasheet/SMDLED/Mono%20Color%20Top%20View/IN-S126AT%20Series_V1.0.pdf" H 3175 3925 50  0001 C CNN
	1    3175 3925
	0    1    -1   0   
$EndComp
Wire Wire Line
	3175 4225 3175 4075
Text Label 3525 4575 3    39   ~ 0
SOLAR
$Comp
L power:+5V #PWR?
U 1 1 5F5E3565
P 3525 3625
AR Path="/5F102375/5F5E3565" Ref="#PWR?"  Part="1" 
AR Path="/5F2104BF/5F5E3565" Ref="#PWR?"  Part="1" 
AR Path="/5EFE1C3B/5F5E3565" Ref="#PWR0100"  Part="1" 
F 0 "#PWR0100" H 3525 3475 50  0001 C CNN
F 1 "+5V" H 3525 3800 39  0000 C CNN
F 2 "" H 3525 3625 50  0001 C CNN
F 3 "" H 3525 3625 50  0001 C CNN
	1    3525 3625
	1    0    0    -1  
$EndComp
Wire Wire Line
	3525 4575 3525 4425
$Comp
L Device:R_Small R?
U 1 1 5F5E355E
P 3525 4325
AR Path="/5F2104BF/5F5E355E" Ref="R?"  Part="1" 
AR Path="/5F5E355E" Ref="R?"  Part="1" 
AR Path="/5F5F0002/5F5E355E" Ref="R?"  Part="1" 
AR Path="/5EFE1C3B/5F5E355E" Ref="R53"  Part="1" 
F 0 "R53" H 3584 4363 39  0000 L CNN
F 1 "180" H 3584 4288 39  0000 L CNN
F 2 "Resistor_SMD:R_0603_1608Metric" H 3525 4325 50  0001 C CNN
F 3 "~" H 3525 4325 50  0001 C CNN
F 4 "" H 3525 4325 50  0001 C CNN "Mfr"
	1    3525 4325
	1    0    0    -1  
$EndComp
Wire Wire Line
	3525 3775 3525 3625
$Comp
L Device:LED D?
U 1 1 5F5E3556
P 3525 3925
AR Path="/5F2104BF/5F5E3556" Ref="D?"  Part="1" 
AR Path="/5F5E3556" Ref="D?"  Part="1" 
AR Path="/5F5F0002/5F5E3556" Ref="D?"  Part="1" 
AR Path="/5F496ED4/5F5E3556" Ref="D?"  Part="1" 
AR Path="/5EFE1C3B/5F5E3556" Ref="D16"  Part="1" 
F 0 "D16" V 3556 3807 39  0000 R CNN
F 1 "IN-S126ATB " V 3481 3807 39  0001 R CNN
F 2 "LED_SMD:LED_1206_3216Metric_Castellated" H 3525 3925 50  0001 C CNN
F 3 "http://inolux-corp.com/datasheet/SMDLED/Mono%20Color%20Top%20View/IN-S126AT%20Series_V1.0.pdf" H 3525 3925 50  0001 C CNN
	1    3525 3925
	0    1    -1   0   
$EndComp
Wire Wire Line
	3525 4225 3525 4075
Text Label 3875 4575 3    39   ~ 0
SOLAR
$Comp
L power:+5V #PWR?
U 1 1 5F5E354E
P 3875 3625
AR Path="/5F102375/5F5E354E" Ref="#PWR?"  Part="1" 
AR Path="/5F2104BF/5F5E354E" Ref="#PWR?"  Part="1" 
AR Path="/5EFE1C3B/5F5E354E" Ref="#PWR0102"  Part="1" 
F 0 "#PWR0102" H 3875 3475 50  0001 C CNN
F 1 "+5V" H 3875 3800 39  0000 C CNN
F 2 "" H 3875 3625 50  0001 C CNN
F 3 "" H 3875 3625 50  0001 C CNN
	1    3875 3625
	1    0    0    -1  
$EndComp
Wire Wire Line
	3875 4575 3875 4425
$Comp
L Device:R_Small R?
U 1 1 5F5E3547
P 3875 4325
AR Path="/5F2104BF/5F5E3547" Ref="R?"  Part="1" 
AR Path="/5F5E3547" Ref="R?"  Part="1" 
AR Path="/5F5F0002/5F5E3547" Ref="R?"  Part="1" 
AR Path="/5EFE1C3B/5F5E3547" Ref="R55"  Part="1" 
F 0 "R55" H 3934 4363 39  0000 L CNN
F 1 "180" H 3934 4288 39  0000 L CNN
F 2 "Resistor_SMD:R_0603_1608Metric" H 3875 4325 50  0001 C CNN
F 3 "~" H 3875 4325 50  0001 C CNN
F 4 "" H 3875 4325 50  0001 C CNN "Mfr"
	1    3875 4325
	1    0    0    -1  
$EndComp
Wire Wire Line
	3875 3775 3875 3625
$Comp
L Device:LED D?
U 1 1 5F5E353F
P 3875 3925
AR Path="/5F2104BF/5F5E353F" Ref="D?"  Part="1" 
AR Path="/5F5E353F" Ref="D?"  Part="1" 
AR Path="/5F5F0002/5F5E353F" Ref="D?"  Part="1" 
AR Path="/5F496ED4/5F5E353F" Ref="D?"  Part="1" 
AR Path="/5EFE1C3B/5F5E353F" Ref="D18"  Part="1" 
F 0 "D18" V 3906 3807 39  0000 R CNN
F 1 "IN-S126ATB " V 3831 3807 39  0001 R CNN
F 2 "LED_SMD:LED_1206_3216Metric_Castellated" H 3875 3925 50  0001 C CNN
F 3 "http://inolux-corp.com/datasheet/SMDLED/Mono%20Color%20Top%20View/IN-S126AT%20Series_V1.0.pdf" H 3875 3925 50  0001 C CNN
	1    3875 3925
	0    1    -1   0   
$EndComp
Wire Wire Line
	3875 4225 3875 4075
Text Label 4225 4575 3    39   ~ 0
SOLAR
$Comp
L power:+5V #PWR?
U 1 1 5F5E3537
P 4225 3625
AR Path="/5F102375/5F5E3537" Ref="#PWR?"  Part="1" 
AR Path="/5F2104BF/5F5E3537" Ref="#PWR?"  Part="1" 
AR Path="/5EFE1C3B/5F5E3537" Ref="#PWR0103"  Part="1" 
F 0 "#PWR0103" H 4225 3475 50  0001 C CNN
F 1 "+5V" H 4225 3800 39  0000 C CNN
F 2 "" H 4225 3625 50  0001 C CNN
F 3 "" H 4225 3625 50  0001 C CNN
	1    4225 3625
	1    0    0    -1  
$EndComp
Wire Wire Line
	4225 4575 4225 4425
$Comp
L Device:R_Small R?
U 1 1 5F5E3530
P 4225 4325
AR Path="/5F2104BF/5F5E3530" Ref="R?"  Part="1" 
AR Path="/5F5E3530" Ref="R?"  Part="1" 
AR Path="/5F5F0002/5F5E3530" Ref="R?"  Part="1" 
AR Path="/5EFE1C3B/5F5E3530" Ref="R56"  Part="1" 
F 0 "R56" H 4284 4363 39  0000 L CNN
F 1 "180" H 4284 4288 39  0000 L CNN
F 2 "Resistor_SMD:R_0603_1608Metric" H 4225 4325 50  0001 C CNN
F 3 "~" H 4225 4325 50  0001 C CNN
F 4 "" H 4225 4325 50  0001 C CNN "Mfr"
	1    4225 4325
	1    0    0    -1  
$EndComp
Wire Wire Line
	4225 3775 4225 3625
$Comp
L Device:LED D?
U 1 1 5F5E3528
P 4225 3925
AR Path="/5F2104BF/5F5E3528" Ref="D?"  Part="1" 
AR Path="/5F5E3528" Ref="D?"  Part="1" 
AR Path="/5F5F0002/5F5E3528" Ref="D?"  Part="1" 
AR Path="/5F496ED4/5F5E3528" Ref="D?"  Part="1" 
AR Path="/5EFE1C3B/5F5E3528" Ref="D19"  Part="1" 
F 0 "D19" V 4256 3807 39  0000 R CNN
F 1 "IN-S126ATB " V 4181 3807 39  0001 R CNN
F 2 "LED_SMD:LED_1206_3216Metric_Castellated" H 4225 3925 50  0001 C CNN
F 3 "http://inolux-corp.com/datasheet/SMDLED/Mono%20Color%20Top%20View/IN-S126AT%20Series_V1.0.pdf" H 4225 3925 50  0001 C CNN
	1    4225 3925
	0    1    -1   0   
$EndComp
Wire Wire Line
	4225 4225 4225 4075
Wire Wire Line
	4575 5925 4575 5775
Text Label 4575 4975 1    39   ~ 0
GRID
$Comp
L power:GND #PWR?
U 1 1 5F8A5044
P 4575 5925
AR Path="/5F2104BF/5F8A5044" Ref="#PWR?"  Part="1" 
AR Path="/5F8A5044" Ref="#PWR?"  Part="1" 
AR Path="/5F5F0002/5F8A5044" Ref="#PWR?"  Part="1" 
AR Path="/5EFE1C3B/5F8A5044" Ref="#PWR0105"  Part="1" 
F 0 "#PWR0105" H 4575 5675 50  0001 C CNN
F 1 "GND" H 4580 5760 39  0000 C CNN
F 2 "" H 4575 5925 50  0001 C CNN
F 3 "" H 4575 5925 50  0001 C CNN
	1    4575 5925
	1    0    0    -1  
$EndComp
$Comp
L Device:R_Small R?
U 1 1 5F8A503E
P 4575 5675
AR Path="/5F2104BF/5F8A503E" Ref="R?"  Part="1" 
AR Path="/5F8A503E" Ref="R?"  Part="1" 
AR Path="/5F5F0002/5F8A503E" Ref="R?"  Part="1" 
AR Path="/5EFE1C3B/5F8A503E" Ref="R58"  Part="1" 
F 0 "R58" H 4634 5713 39  0000 L CNN
F 1 "180" H 4634 5638 39  0000 L CNN
F 2 "Resistor_SMD:R_0603_1608Metric" H 4575 5675 50  0001 C CNN
F 3 "~" H 4575 5675 50  0001 C CNN
F 4 "" H 4575 5675 50  0001 C CNN "Mfr"
	1    4575 5675
	1    0    0    -1  
$EndComp
Wire Wire Line
	4575 5125 4575 4975
$Comp
L Device:LED D?
U 1 1 5F8A5036
P 4575 5275
AR Path="/5F2104BF/5F8A5036" Ref="D?"  Part="1" 
AR Path="/5F8A5036" Ref="D?"  Part="1" 
AR Path="/5F5F0002/5F8A5036" Ref="D?"  Part="1" 
AR Path="/5F496ED4/5F8A5036" Ref="D?"  Part="1" 
AR Path="/5EFE1C3B/5F8A5036" Ref="D21"  Part="1" 
F 0 "D21" V 4606 5157 39  0000 R CNN
F 1 "IN-S126AT5UW" V 4531 5157 39  0001 R CNN
F 2 "LED_SMD:LED_1206_3216Metric_Castellated" H 4575 5275 50  0001 C CNN
F 3 "http://inolux-corp.com/datasheet/SMDLED/Mono%20Color%20Top%20View/IN-S126AT%20Series_V1.0.pdf" H 4575 5275 50  0001 C CNN
	1    4575 5275
	0    1    -1   0   
$EndComp
Wire Wire Line
	4575 5575 4575 5425
Text Label 4575 4575 3    39   ~ 0
SOLAR
$Comp
L power:+5V #PWR?
U 1 1 5F8A502E
P 4575 3625
AR Path="/5F102375/5F8A502E" Ref="#PWR?"  Part="1" 
AR Path="/5F2104BF/5F8A502E" Ref="#PWR?"  Part="1" 
AR Path="/5EFE1C3B/5F8A502E" Ref="#PWR0104"  Part="1" 
F 0 "#PWR0104" H 4575 3475 50  0001 C CNN
F 1 "+5V" H 4575 3800 39  0000 C CNN
F 2 "" H 4575 3625 50  0001 C CNN
F 3 "" H 4575 3625 50  0001 C CNN
	1    4575 3625
	1    0    0    -1  
$EndComp
Wire Wire Line
	4575 4575 4575 4425
$Comp
L Device:R_Small R?
U 1 1 5F8A5027
P 4575 4325
AR Path="/5F2104BF/5F8A5027" Ref="R?"  Part="1" 
AR Path="/5F8A5027" Ref="R?"  Part="1" 
AR Path="/5F5F0002/5F8A5027" Ref="R?"  Part="1" 
AR Path="/5EFE1C3B/5F8A5027" Ref="R57"  Part="1" 
F 0 "R57" H 4634 4363 39  0000 L CNN
F 1 "180" H 4634 4288 39  0000 L CNN
F 2 "Resistor_SMD:R_0603_1608Metric" H 4575 4325 50  0001 C CNN
F 3 "~" H 4575 4325 50  0001 C CNN
F 4 "" H 4575 4325 50  0001 C CNN "Mfr"
	1    4575 4325
	1    0    0    -1  
$EndComp
Wire Wire Line
	4575 3775 4575 3625
$Comp
L Device:LED D?
U 1 1 5F8A501F
P 4575 3925
AR Path="/5F2104BF/5F8A501F" Ref="D?"  Part="1" 
AR Path="/5F8A501F" Ref="D?"  Part="1" 
AR Path="/5F5F0002/5F8A501F" Ref="D?"  Part="1" 
AR Path="/5F496ED4/5F8A501F" Ref="D?"  Part="1" 
AR Path="/5EFE1C3B/5F8A501F" Ref="D20"  Part="1" 
F 0 "D20" V 4606 3807 39  0000 R CNN
F 1 "IN-S126ATB " V 4531 3807 39  0001 R CNN
F 2 "LED_SMD:LED_1206_3216Metric_Castellated" H 4575 3925 50  0001 C CNN
F 3 "http://inolux-corp.com/datasheet/SMDLED/Mono%20Color%20Top%20View/IN-S126AT%20Series_V1.0.pdf" H 4575 3925 50  0001 C CNN
	1    4575 3925
	0    1    -1   0   
$EndComp
Wire Wire Line
	4575 4225 4575 4075
Wire Wire Line
	4925 5925 4925 5775
Text Label 4925 4975 1    39   ~ 0
GRID
$Comp
L power:GND #PWR?
U 1 1 5F8A5016
P 4925 5925
AR Path="/5F2104BF/5F8A5016" Ref="#PWR?"  Part="1" 
AR Path="/5F8A5016" Ref="#PWR?"  Part="1" 
AR Path="/5F5F0002/5F8A5016" Ref="#PWR?"  Part="1" 
AR Path="/5EFE1C3B/5F8A5016" Ref="#PWR0107"  Part="1" 
F 0 "#PWR0107" H 4925 5675 50  0001 C CNN
F 1 "GND" H 4930 5760 39  0000 C CNN
F 2 "" H 4925 5925 50  0001 C CNN
F 3 "" H 4925 5925 50  0001 C CNN
	1    4925 5925
	1    0    0    -1  
$EndComp
$Comp
L Device:R_Small R?
U 1 1 5F8A5010
P 4925 5675
AR Path="/5F2104BF/5F8A5010" Ref="R?"  Part="1" 
AR Path="/5F8A5010" Ref="R?"  Part="1" 
AR Path="/5F5F0002/5F8A5010" Ref="R?"  Part="1" 
AR Path="/5EFE1C3B/5F8A5010" Ref="R60"  Part="1" 
F 0 "R60" H 4984 5713 39  0000 L CNN
F 1 "180" H 4984 5638 39  0000 L CNN
F 2 "Resistor_SMD:R_0603_1608Metric" H 4925 5675 50  0001 C CNN
F 3 "~" H 4925 5675 50  0001 C CNN
F 4 "" H 4925 5675 50  0001 C CNN "Mfr"
	1    4925 5675
	1    0    0    -1  
$EndComp
Wire Wire Line
	4925 5125 4925 4975
$Comp
L Device:LED D?
U 1 1 5F8A5008
P 4925 5275
AR Path="/5F2104BF/5F8A5008" Ref="D?"  Part="1" 
AR Path="/5F8A5008" Ref="D?"  Part="1" 
AR Path="/5F5F0002/5F8A5008" Ref="D?"  Part="1" 
AR Path="/5F496ED4/5F8A5008" Ref="D?"  Part="1" 
AR Path="/5EFE1C3B/5F8A5008" Ref="D23"  Part="1" 
F 0 "D23" V 4956 5157 39  0000 R CNN
F 1 "IN-S126AT5UW" V 4881 5157 39  0001 R CNN
F 2 "LED_SMD:LED_1206_3216Metric_Castellated" H 4925 5275 50  0001 C CNN
F 3 "http://inolux-corp.com/datasheet/SMDLED/Mono%20Color%20Top%20View/IN-S126AT%20Series_V1.0.pdf" H 4925 5275 50  0001 C CNN
	1    4925 5275
	0    1    -1   0   
$EndComp
Wire Wire Line
	4925 5575 4925 5425
Text Label 4925 4575 3    39   ~ 0
SOLAR
$Comp
L power:+5V #PWR?
U 1 1 5F8A5000
P 4925 3625
AR Path="/5F102375/5F8A5000" Ref="#PWR?"  Part="1" 
AR Path="/5F2104BF/5F8A5000" Ref="#PWR?"  Part="1" 
AR Path="/5EFE1C3B/5F8A5000" Ref="#PWR0106"  Part="1" 
F 0 "#PWR0106" H 4925 3475 50  0001 C CNN
F 1 "+5V" H 4925 3800 39  0000 C CNN
F 2 "" H 4925 3625 50  0001 C CNN
F 3 "" H 4925 3625 50  0001 C CNN
	1    4925 3625
	1    0    0    -1  
$EndComp
Wire Wire Line
	4925 4575 4925 4425
$Comp
L Device:R_Small R?
U 1 1 5F8A4FF9
P 4925 4325
AR Path="/5F2104BF/5F8A4FF9" Ref="R?"  Part="1" 
AR Path="/5F8A4FF9" Ref="R?"  Part="1" 
AR Path="/5F5F0002/5F8A4FF9" Ref="R?"  Part="1" 
AR Path="/5EFE1C3B/5F8A4FF9" Ref="R59"  Part="1" 
F 0 "R59" H 4984 4363 39  0000 L CNN
F 1 "180" H 4984 4288 39  0000 L CNN
F 2 "Resistor_SMD:R_0603_1608Metric" H 4925 4325 50  0001 C CNN
F 3 "~" H 4925 4325 50  0001 C CNN
F 4 "" H 4925 4325 50  0001 C CNN "Mfr"
	1    4925 4325
	1    0    0    -1  
$EndComp
Wire Wire Line
	4925 3775 4925 3625
$Comp
L Device:LED D?
U 1 1 5F8A4FF1
P 4925 3925
AR Path="/5F2104BF/5F8A4FF1" Ref="D?"  Part="1" 
AR Path="/5F8A4FF1" Ref="D?"  Part="1" 
AR Path="/5F5F0002/5F8A4FF1" Ref="D?"  Part="1" 
AR Path="/5F496ED4/5F8A4FF1" Ref="D?"  Part="1" 
AR Path="/5EFE1C3B/5F8A4FF1" Ref="D22"  Part="1" 
F 0 "D22" V 4956 3807 39  0000 R CNN
F 1 "IN-S126ATB " V 4881 3807 39  0001 R CNN
F 2 "LED_SMD:LED_1206_3216Metric_Castellated" H 4925 3925 50  0001 C CNN
F 3 "http://inolux-corp.com/datasheet/SMDLED/Mono%20Color%20Top%20View/IN-S126AT%20Series_V1.0.pdf" H 4925 3925 50  0001 C CNN
	1    4925 3925
	0    1    -1   0   
$EndComp
Wire Wire Line
	4925 4225 4925 4075
Wire Wire Line
	5275 5925 5275 5775
Text Label 5275 4975 1    39   ~ 0
GRID
$Comp
L power:GND #PWR?
U 1 1 5F89A997
P 5275 5925
AR Path="/5F2104BF/5F89A997" Ref="#PWR?"  Part="1" 
AR Path="/5F89A997" Ref="#PWR?"  Part="1" 
AR Path="/5F5F0002/5F89A997" Ref="#PWR?"  Part="1" 
AR Path="/5EFE1C3B/5F89A997" Ref="#PWR0109"  Part="1" 
F 0 "#PWR0109" H 5275 5675 50  0001 C CNN
F 1 "GND" H 5280 5760 39  0000 C CNN
F 2 "" H 5275 5925 50  0001 C CNN
F 3 "" H 5275 5925 50  0001 C CNN
	1    5275 5925
	1    0    0    -1  
$EndComp
$Comp
L Device:R_Small R?
U 1 1 5F89A991
P 5275 5675
AR Path="/5F2104BF/5F89A991" Ref="R?"  Part="1" 
AR Path="/5F89A991" Ref="R?"  Part="1" 
AR Path="/5F5F0002/5F89A991" Ref="R?"  Part="1" 
AR Path="/5EFE1C3B/5F89A991" Ref="R62"  Part="1" 
F 0 "R62" H 5334 5713 39  0000 L CNN
F 1 "180" H 5334 5638 39  0000 L CNN
F 2 "Resistor_SMD:R_0603_1608Metric" H 5275 5675 50  0001 C CNN
F 3 "~" H 5275 5675 50  0001 C CNN
F 4 "" H 5275 5675 50  0001 C CNN "Mfr"
	1    5275 5675
	1    0    0    -1  
$EndComp
Wire Wire Line
	5275 5125 5275 4975
$Comp
L Device:LED D?
U 1 1 5F89A989
P 5275 5275
AR Path="/5F2104BF/5F89A989" Ref="D?"  Part="1" 
AR Path="/5F89A989" Ref="D?"  Part="1" 
AR Path="/5F5F0002/5F89A989" Ref="D?"  Part="1" 
AR Path="/5F496ED4/5F89A989" Ref="D?"  Part="1" 
AR Path="/5EFE1C3B/5F89A989" Ref="D25"  Part="1" 
F 0 "D25" V 5306 5157 39  0000 R CNN
F 1 "IN-S126AT5UW" V 5231 5157 39  0001 R CNN
F 2 "LED_SMD:LED_1206_3216Metric_Castellated" H 5275 5275 50  0001 C CNN
F 3 "http://inolux-corp.com/datasheet/SMDLED/Mono%20Color%20Top%20View/IN-S126AT%20Series_V1.0.pdf" H 5275 5275 50  0001 C CNN
	1    5275 5275
	0    1    -1   0   
$EndComp
Wire Wire Line
	5275 5575 5275 5425
Text Label 5275 4575 3    39   ~ 0
SOLAR
$Comp
L power:+5V #PWR?
U 1 1 5F89A981
P 5275 3625
AR Path="/5F102375/5F89A981" Ref="#PWR?"  Part="1" 
AR Path="/5F2104BF/5F89A981" Ref="#PWR?"  Part="1" 
AR Path="/5EFE1C3B/5F89A981" Ref="#PWR0108"  Part="1" 
F 0 "#PWR0108" H 5275 3475 50  0001 C CNN
F 1 "+5V" H 5275 3800 39  0000 C CNN
F 2 "" H 5275 3625 50  0001 C CNN
F 3 "" H 5275 3625 50  0001 C CNN
	1    5275 3625
	1    0    0    -1  
$EndComp
Wire Wire Line
	5275 4575 5275 4425
$Comp
L Device:R_Small R?
U 1 1 5F89A97A
P 5275 4325
AR Path="/5F2104BF/5F89A97A" Ref="R?"  Part="1" 
AR Path="/5F89A97A" Ref="R?"  Part="1" 
AR Path="/5F5F0002/5F89A97A" Ref="R?"  Part="1" 
AR Path="/5EFE1C3B/5F89A97A" Ref="R61"  Part="1" 
F 0 "R61" H 5334 4363 39  0000 L CNN
F 1 "180" H 5334 4288 39  0000 L CNN
F 2 "Resistor_SMD:R_0603_1608Metric" H 5275 4325 50  0001 C CNN
F 3 "~" H 5275 4325 50  0001 C CNN
F 4 "" H 5275 4325 50  0001 C CNN "Mfr"
	1    5275 4325
	1    0    0    -1  
$EndComp
Wire Wire Line
	5275 3775 5275 3625
$Comp
L Device:LED D?
U 1 1 5F89A972
P 5275 3925
AR Path="/5F2104BF/5F89A972" Ref="D?"  Part="1" 
AR Path="/5F89A972" Ref="D?"  Part="1" 
AR Path="/5F5F0002/5F89A972" Ref="D?"  Part="1" 
AR Path="/5F496ED4/5F89A972" Ref="D?"  Part="1" 
AR Path="/5EFE1C3B/5F89A972" Ref="D24"  Part="1" 
F 0 "D24" V 5306 3807 39  0000 R CNN
F 1 "IN-S126ATB " V 5231 3807 39  0001 R CNN
F 2 "LED_SMD:LED_1206_3216Metric_Castellated" H 5275 3925 50  0001 C CNN
F 3 "http://inolux-corp.com/datasheet/SMDLED/Mono%20Color%20Top%20View/IN-S126AT%20Series_V1.0.pdf" H 5275 3925 50  0001 C CNN
	1    5275 3925
	0    1    -1   0   
$EndComp
Wire Wire Line
	5275 4225 5275 4075
Text Label 5625 4575 3    39   ~ 0
SOLAR
$Comp
L power:+5V #PWR?
U 1 1 5F867BF2
P 5625 3625
AR Path="/5F102375/5F867BF2" Ref="#PWR?"  Part="1" 
AR Path="/5F2104BF/5F867BF2" Ref="#PWR?"  Part="1" 
AR Path="/5EFE1C3B/5F867BF2" Ref="#PWR0110"  Part="1" 
F 0 "#PWR0110" H 5625 3475 50  0001 C CNN
F 1 "+5V" H 5625 3800 39  0000 C CNN
F 2 "" H 5625 3625 50  0001 C CNN
F 3 "" H 5625 3625 50  0001 C CNN
	1    5625 3625
	1    0    0    -1  
$EndComp
Wire Wire Line
	5625 4575 5625 4425
$Comp
L Device:R_Small R?
U 1 1 5F867BEB
P 5625 4325
AR Path="/5F2104BF/5F867BEB" Ref="R?"  Part="1" 
AR Path="/5F867BEB" Ref="R?"  Part="1" 
AR Path="/5F5F0002/5F867BEB" Ref="R?"  Part="1" 
AR Path="/5EFE1C3B/5F867BEB" Ref="R63"  Part="1" 
F 0 "R63" H 5684 4363 39  0000 L CNN
F 1 "180" H 5684 4288 39  0000 L CNN
F 2 "Resistor_SMD:R_0603_1608Metric" H 5625 4325 50  0001 C CNN
F 3 "~" H 5625 4325 50  0001 C CNN
F 4 "" H 5625 4325 50  0001 C CNN "Mfr"
	1    5625 4325
	1    0    0    -1  
$EndComp
Wire Wire Line
	5625 3775 5625 3625
$Comp
L Device:LED D?
U 1 1 5F867BE3
P 5625 3925
AR Path="/5F2104BF/5F867BE3" Ref="D?"  Part="1" 
AR Path="/5F867BE3" Ref="D?"  Part="1" 
AR Path="/5F5F0002/5F867BE3" Ref="D?"  Part="1" 
AR Path="/5F496ED4/5F867BE3" Ref="D?"  Part="1" 
AR Path="/5EFE1C3B/5F867BE3" Ref="D26"  Part="1" 
F 0 "D26" V 5656 3807 39  0000 R CNN
F 1 "IN-S126ATB " V 5581 3807 39  0001 R CNN
F 2 "LED_SMD:LED_1206_3216Metric_Castellated" H 5625 3925 50  0001 C CNN
F 3 "http://inolux-corp.com/datasheet/SMDLED/Mono%20Color%20Top%20View/IN-S126AT%20Series_V1.0.pdf" H 5625 3925 50  0001 C CNN
	1    5625 3925
	0    1    -1   0   
$EndComp
Wire Wire Line
	5625 4225 5625 4075
$Comp
L Device:LED D?
U 1 1 5F5F3803
P 10000 4925
AR Path="/5F2104BF/5F5F3803" Ref="D?"  Part="1" 
AR Path="/5F5F3803" Ref="D?"  Part="1" 
AR Path="/5F5F0002/5F5F3803" Ref="D?"  Part="1" 
AR Path="/5F496ED4/5F5F3803" Ref="D?"  Part="1" 
AR Path="/5EFE1C3B/5F5F3803" Ref="D41"  Part="1" 
F 0 "D41" V 10031 4807 39  0000 R CNN
F 1 "IN-S126AT5UW" V 9900 5475 39  0000 R CNN
F 2 "LED_SMD:LED_1206_3216Metric_Castellated" H 10000 4925 50  0001 C CNN
F 3 "http://inolux-corp.com/datasheet/SMDLED/Mono%20Color%20Top%20View/IN-S126AT%20Series_V1.0.pdf" H 10000 4925 50  0001 C CNN
	1    10000 4925
	0    1    -1   0   
$EndComp
Text Label 9650 5575 3    39   ~ 0
SOLAR
$Comp
L power:+5V #PWR?
U 1 1 5F5F37FC
P 9650 4625
AR Path="/5F102375/5F5F37FC" Ref="#PWR?"  Part="1" 
AR Path="/5F2104BF/5F5F37FC" Ref="#PWR?"  Part="1" 
AR Path="/5EFE1C3B/5F5F37FC" Ref="#PWR0128"  Part="1" 
F 0 "#PWR0128" H 9650 4475 50  0001 C CNN
F 1 "+5V" H 9650 4800 39  0000 C CNN
F 2 "" H 9650 4625 50  0001 C CNN
F 3 "" H 9650 4625 50  0001 C CNN
	1    9650 4625
	1    0    0    -1  
$EndComp
Wire Wire Line
	9650 5575 9650 5425
Wire Wire Line
	10000 5575 10000 5425
$Comp
L Device:R_Small R?
U 1 1 5F5F37F4
P 9650 5325
AR Path="/5F2104BF/5F5F37F4" Ref="R?"  Part="1" 
AR Path="/5F5F37F4" Ref="R?"  Part="1" 
AR Path="/5F5F0002/5F5F37F4" Ref="R?"  Part="1" 
AR Path="/5EFE1C3B/5F5F37F4" Ref="R64"  Part="1" 
F 0 "R64" H 9709 5363 39  0000 L CNN
F 1 "180" H 9709 5288 39  0000 L CNN
F 2 "Resistor_SMD:R_0603_1608Metric" H 9650 5325 50  0001 C CNN
F 3 "~" H 9650 5325 50  0001 C CNN
F 4 "" H 9650 5325 50  0001 C CNN "Mfr"
	1    9650 5325
	1    0    0    -1  
$EndComp
Text Label 10000 4625 1    39   ~ 0
GRID
$Comp
L power:GND #PWR?
U 1 1 5F5F37EC
P 10000 5575
AR Path="/5F2104BF/5F5F37EC" Ref="#PWR?"  Part="1" 
AR Path="/5F5F37EC" Ref="#PWR?"  Part="1" 
AR Path="/5F5F0002/5F5F37EC" Ref="#PWR?"  Part="1" 
AR Path="/5EFE1C3B/5F5F37EC" Ref="#PWR0111"  Part="1" 
F 0 "#PWR0111" H 10000 5325 50  0001 C CNN
F 1 "GND" H 10005 5410 39  0000 C CNN
F 2 "" H 10000 5575 50  0001 C CNN
F 3 "" H 10000 5575 50  0001 C CNN
	1    10000 5575
	1    0    0    -1  
$EndComp
$Comp
L Device:R_Small R?
U 1 1 5F5F37E6
P 10000 5325
AR Path="/5F2104BF/5F5F37E6" Ref="R?"  Part="1" 
AR Path="/5F5F37E6" Ref="R?"  Part="1" 
AR Path="/5F5F0002/5F5F37E6" Ref="R?"  Part="1" 
AR Path="/5EFE1C3B/5F5F37E6" Ref="R80"  Part="1" 
F 0 "R80" H 10059 5363 39  0000 L CNN
F 1 "180" H 10059 5288 39  0000 L CNN
F 2 "Resistor_SMD:R_0603_1608Metric" H 10000 5325 50  0001 C CNN
F 3 "~" H 10000 5325 50  0001 C CNN
F 4 "" H 10000 5325 50  0001 C CNN "Mfr"
	1    10000 5325
	1    0    0    -1  
$EndComp
Wire Wire Line
	10000 4775 10000 4625
Wire Wire Line
	9650 4775 9650 4625
$Comp
L Device:LED D?
U 1 1 5F5F37DD
P 9650 4925
AR Path="/5F2104BF/5F5F37DD" Ref="D?"  Part="1" 
AR Path="/5F5F37DD" Ref="D?"  Part="1" 
AR Path="/5F5F0002/5F5F37DD" Ref="D?"  Part="1" 
AR Path="/5F496ED4/5F5F37DD" Ref="D?"  Part="1" 
AR Path="/5EFE1C3B/5F5F37DD" Ref="D27"  Part="1" 
F 0 "D27" V 9681 4807 39  0000 R CNN
F 1 "IN-S126ATB " V 9606 4807 39  0001 R CNN
F 2 "LED_SMD:LED_1206_3216Metric_Castellated" H 9650 4925 50  0001 C CNN
F 3 "http://inolux-corp.com/datasheet/SMDLED/Mono%20Color%20Top%20View/IN-S126AT%20Series_V1.0.pdf" H 9650 4925 50  0001 C CNN
	1    9650 4925
	0    1    -1   0   
$EndComp
Wire Wire Line
	10000 5225 10000 5075
Wire Wire Line
	9650 5225 9650 5075
$Comp
L Device:LED D?
U 1 1 5F738C21
P 9300 4925
AR Path="/5F2104BF/5F738C21" Ref="D?"  Part="1" 
AR Path="/5F738C21" Ref="D?"  Part="1" 
AR Path="/5F5F0002/5F738C21" Ref="D?"  Part="1" 
AR Path="/5F496ED4/5F738C21" Ref="D?"  Part="1" 
AR Path="/5EFE1C3B/5F738C21" Ref="D37"  Part="1" 
F 0 "D37" V 9331 4807 39  0000 R CNN
F 1 "IN-S126AT5UW" V 9200 5475 39  0001 R CNN
F 2 "LED_SMD:LED_1206_3216Metric_Castellated" H 9300 4925 50  0001 C CNN
F 3 "http://inolux-corp.com/datasheet/SMDLED/Mono%20Color%20Top%20View/IN-S126AT%20Series_V1.0.pdf" H 9300 4925 50  0001 C CNN
	1    9300 4925
	0    1    -1   0   
$EndComp
Text Label 6850 5575 3    39   ~ 0
SOLAR
$Comp
L power:+5V #PWR?
U 1 1 5F84AB54
P 6850 4625
AR Path="/5F102375/5F84AB54" Ref="#PWR?"  Part="1" 
AR Path="/5F2104BF/5F84AB54" Ref="#PWR?"  Part="1" 
AR Path="/5EFE1C3B/5F84AB54" Ref="#PWR0114"  Part="1" 
F 0 "#PWR0114" H 6850 4475 50  0001 C CNN
F 1 "+5V" H 6850 4800 39  0000 C CNN
F 2 "" H 6850 4625 50  0001 C CNN
F 3 "" H 6850 4625 50  0001 C CNN
	1    6850 4625
	1    0    0    -1  
$EndComp
Wire Wire Line
	6850 5575 6850 5425
Wire Wire Line
	7200 5575 7200 5425
$Comp
L Device:R_Small R?
U 1 1 5F84AB4C
P 6850 5325
AR Path="/5F2104BF/5F84AB4C" Ref="R?"  Part="1" 
AR Path="/5F84AB4C" Ref="R?"  Part="1" 
AR Path="/5F5F0002/5F84AB4C" Ref="R?"  Part="1" 
AR Path="/5EFE1C3B/5F84AB4C" Ref="R66"  Part="1" 
F 0 "R66" H 6909 5363 39  0000 L CNN
F 1 "180" H 6909 5288 39  0000 L CNN
F 2 "Resistor_SMD:R_0603_1608Metric" H 6850 5325 50  0001 C CNN
F 3 "~" H 6850 5325 50  0001 C CNN
F 4 "" H 6850 5325 50  0001 C CNN "Mfr"
	1    6850 5325
	1    0    0    -1  
$EndComp
Text Label 7200 4625 1    39   ~ 0
GRID
$Comp
L power:GND #PWR?
U 1 1 5F84AB44
P 7200 5575
AR Path="/5F2104BF/5F84AB44" Ref="#PWR?"  Part="1" 
AR Path="/5F84AB44" Ref="#PWR?"  Part="1" 
AR Path="/5F5F0002/5F84AB44" Ref="#PWR?"  Part="1" 
AR Path="/5EFE1C3B/5F84AB44" Ref="#PWR0116"  Part="1" 
F 0 "#PWR0116" H 7200 5325 50  0001 C CNN
F 1 "GND" H 7205 5410 39  0000 C CNN
F 2 "" H 7200 5575 50  0001 C CNN
F 3 "" H 7200 5575 50  0001 C CNN
	1    7200 5575
	1    0    0    -1  
$EndComp
$Comp
L Device:R_Small R?
U 1 1 5F84AB3E
P 7200 5325
AR Path="/5F2104BF/5F84AB3E" Ref="R?"  Part="1" 
AR Path="/5F84AB3E" Ref="R?"  Part="1" 
AR Path="/5F5F0002/5F84AB3E" Ref="R?"  Part="1" 
AR Path="/5EFE1C3B/5F84AB3E" Ref="R68"  Part="1" 
F 0 "R68" H 7259 5363 39  0000 L CNN
F 1 "180" H 7259 5288 39  0000 L CNN
F 2 "Resistor_SMD:R_0603_1608Metric" H 7200 5325 50  0001 C CNN
F 3 "~" H 7200 5325 50  0001 C CNN
F 4 "" H 7200 5325 50  0001 C CNN "Mfr"
	1    7200 5325
	1    0    0    -1  
$EndComp
Wire Wire Line
	7200 4775 7200 4625
Wire Wire Line
	6850 4775 6850 4625
$Comp
L Device:LED D?
U 1 1 5F84AB35
P 6850 4925
AR Path="/5F2104BF/5F84AB35" Ref="D?"  Part="1" 
AR Path="/5F84AB35" Ref="D?"  Part="1" 
AR Path="/5F5F0002/5F84AB35" Ref="D?"  Part="1" 
AR Path="/5F496ED4/5F84AB35" Ref="D?"  Part="1" 
AR Path="/5EFE1C3B/5F84AB35" Ref="D28"  Part="1" 
F 0 "D28" V 6881 4807 39  0000 R CNN
F 1 "IN-S126ATB" V 6806 4807 39  0000 R CNN
F 2 "LED_SMD:LED_1206_3216Metric_Castellated" H 6850 4925 50  0001 C CNN
F 3 "http://inolux-corp.com/datasheet/SMDLED/Mono%20Color%20Top%20View/IN-S126AT%20Series_V1.0.pdf" H 6850 4925 50  0001 C CNN
	1    6850 4925
	0    1    -1   0   
$EndComp
$Comp
L Device:LED D?
U 1 1 5F84AB2F
P 7200 4925
AR Path="/5F2104BF/5F84AB2F" Ref="D?"  Part="1" 
AR Path="/5F84AB2F" Ref="D?"  Part="1" 
AR Path="/5F5F0002/5F84AB2F" Ref="D?"  Part="1" 
AR Path="/5F496ED4/5F84AB2F" Ref="D?"  Part="1" 
AR Path="/5EFE1C3B/5F84AB2F" Ref="D29"  Part="1" 
F 0 "D29" V 7231 4807 39  0000 R CNN
F 1 "IN-S126AT5UW" V 7156 4807 39  0001 R CNN
F 2 "LED_SMD:LED_1206_3216Metric_Castellated" H 7200 4925 50  0001 C CNN
F 3 "http://inolux-corp.com/datasheet/SMDLED/Mono%20Color%20Top%20View/IN-S126AT%20Series_V1.0.pdf" H 7200 4925 50  0001 C CNN
	1    7200 4925
	0    1    -1   0   
$EndComp
Wire Wire Line
	7200 5225 7200 5075
Wire Wire Line
	6850 5225 6850 5075
Text Label 7550 5575 3    39   ~ 0
SOLAR
$Comp
L power:+5V #PWR?
U 1 1 5F84AB26
P 7550 4625
AR Path="/5F102375/5F84AB26" Ref="#PWR?"  Part="1" 
AR Path="/5F2104BF/5F84AB26" Ref="#PWR?"  Part="1" 
AR Path="/5EFE1C3B/5F84AB26" Ref="#PWR0117"  Part="1" 
F 0 "#PWR0117" H 7550 4475 50  0001 C CNN
F 1 "+5V" H 7550 4800 39  0000 C CNN
F 2 "" H 7550 4625 50  0001 C CNN
F 3 "" H 7550 4625 50  0001 C CNN
	1    7550 4625
	1    0    0    -1  
$EndComp
Wire Wire Line
	7550 5575 7550 5425
Wire Wire Line
	7900 5575 7900 5425
$Comp
L Device:R_Small R?
U 1 1 5F84AB1E
P 7550 5325
AR Path="/5F2104BF/5F84AB1E" Ref="R?"  Part="1" 
AR Path="/5F84AB1E" Ref="R?"  Part="1" 
AR Path="/5F5F0002/5F84AB1E" Ref="R?"  Part="1" 
AR Path="/5EFE1C3B/5F84AB1E" Ref="R69"  Part="1" 
F 0 "R69" H 7609 5363 39  0000 L CNN
F 1 "180" H 7609 5288 39  0000 L CNN
F 2 "Resistor_SMD:R_0603_1608Metric" H 7550 5325 50  0001 C CNN
F 3 "~" H 7550 5325 50  0001 C CNN
F 4 "" H 7550 5325 50  0001 C CNN "Mfr"
	1    7550 5325
	1    0    0    -1  
$EndComp
Text Label 7900 4625 1    39   ~ 0
GRID
$Comp
L power:GND #PWR?
U 1 1 5F84AB16
P 7900 5575
AR Path="/5F2104BF/5F84AB16" Ref="#PWR?"  Part="1" 
AR Path="/5F84AB16" Ref="#PWR?"  Part="1" 
AR Path="/5F5F0002/5F84AB16" Ref="#PWR?"  Part="1" 
AR Path="/5EFE1C3B/5F84AB16" Ref="#PWR0120"  Part="1" 
F 0 "#PWR0120" H 7900 5325 50  0001 C CNN
F 1 "GND" H 7905 5410 39  0000 C CNN
F 2 "" H 7900 5575 50  0001 C CNN
F 3 "" H 7900 5575 50  0001 C CNN
	1    7900 5575
	1    0    0    -1  
$EndComp
$Comp
L Device:R_Small R?
U 1 1 5F84AB10
P 7900 5325
AR Path="/5F2104BF/5F84AB10" Ref="R?"  Part="1" 
AR Path="/5F84AB10" Ref="R?"  Part="1" 
AR Path="/5F5F0002/5F84AB10" Ref="R?"  Part="1" 
AR Path="/5EFE1C3B/5F84AB10" Ref="R71"  Part="1" 
F 0 "R71" H 7959 5363 39  0000 L CNN
F 1 "180" H 7959 5288 39  0000 L CNN
F 2 "Resistor_SMD:R_0603_1608Metric" H 7900 5325 50  0001 C CNN
F 3 "~" H 7900 5325 50  0001 C CNN
F 4 "" H 7900 5325 50  0001 C CNN "Mfr"
	1    7900 5325
	1    0    0    -1  
$EndComp
Wire Wire Line
	7900 4775 7900 4625
Wire Wire Line
	7550 4775 7550 4625
$Comp
L Device:LED D?
U 1 1 5F84AB07
P 7550 4925
AR Path="/5F2104BF/5F84AB07" Ref="D?"  Part="1" 
AR Path="/5F84AB07" Ref="D?"  Part="1" 
AR Path="/5F5F0002/5F84AB07" Ref="D?"  Part="1" 
AR Path="/5F496ED4/5F84AB07" Ref="D?"  Part="1" 
AR Path="/5EFE1C3B/5F84AB07" Ref="D30"  Part="1" 
F 0 "D30" V 7581 4807 39  0000 R CNN
F 1 "IN-S126ATB " V 7506 4807 39  0001 R CNN
F 2 "LED_SMD:LED_1206_3216Metric_Castellated" H 7550 4925 50  0001 C CNN
F 3 "http://inolux-corp.com/datasheet/SMDLED/Mono%20Color%20Top%20View/IN-S126AT%20Series_V1.0.pdf" H 7550 4925 50  0001 C CNN
	1    7550 4925
	0    1    -1   0   
$EndComp
$Comp
L Device:LED D?
U 1 1 5F84AB01
P 7900 4925
AR Path="/5F2104BF/5F84AB01" Ref="D?"  Part="1" 
AR Path="/5F84AB01" Ref="D?"  Part="1" 
AR Path="/5F5F0002/5F84AB01" Ref="D?"  Part="1" 
AR Path="/5F496ED4/5F84AB01" Ref="D?"  Part="1" 
AR Path="/5EFE1C3B/5F84AB01" Ref="D32"  Part="1" 
F 0 "D32" V 7931 4807 39  0000 R CNN
F 1 "IN-S126AT5UW" V 7856 4807 39  0001 R CNN
F 2 "LED_SMD:LED_1206_3216Metric_Castellated" H 7900 4925 50  0001 C CNN
F 3 "http://inolux-corp.com/datasheet/SMDLED/Mono%20Color%20Top%20View/IN-S126AT%20Series_V1.0.pdf" H 7900 4925 50  0001 C CNN
	1    7900 4925
	0    1    -1   0   
$EndComp
Wire Wire Line
	7900 5225 7900 5075
Wire Wire Line
	7550 5225 7550 5075
Text Label 8250 5575 3    39   ~ 0
SOLAR
$Comp
L power:+5V #PWR?
U 1 1 5F83FB9A
P 8250 4625
AR Path="/5F102375/5F83FB9A" Ref="#PWR?"  Part="1" 
AR Path="/5F2104BF/5F83FB9A" Ref="#PWR?"  Part="1" 
AR Path="/5EFE1C3B/5F83FB9A" Ref="#PWR0121"  Part="1" 
F 0 "#PWR0121" H 8250 4475 50  0001 C CNN
F 1 "+5V" H 8250 4800 39  0000 C CNN
F 2 "" H 8250 4625 50  0001 C CNN
F 3 "" H 8250 4625 50  0001 C CNN
	1    8250 4625
	1    0    0    -1  
$EndComp
Wire Wire Line
	8250 5575 8250 5425
Wire Wire Line
	8600 5575 8600 5425
$Comp
L Device:R_Small R?
U 1 1 5F83FB92
P 8250 5325
AR Path="/5F2104BF/5F83FB92" Ref="R?"  Part="1" 
AR Path="/5F83FB92" Ref="R?"  Part="1" 
AR Path="/5F5F0002/5F83FB92" Ref="R?"  Part="1" 
AR Path="/5EFE1C3B/5F83FB92" Ref="R72"  Part="1" 
F 0 "R72" H 8309 5363 39  0000 L CNN
F 1 "180" H 8309 5288 39  0000 L CNN
F 2 "Resistor_SMD:R_0603_1608Metric" H 8250 5325 50  0001 C CNN
F 3 "~" H 8250 5325 50  0001 C CNN
F 4 "" H 8250 5325 50  0001 C CNN "Mfr"
	1    8250 5325
	1    0    0    -1  
$EndComp
Text Label 8600 4625 1    39   ~ 0
GRID
$Comp
L power:GND #PWR?
U 1 1 5F83FB8A
P 8600 5575
AR Path="/5F2104BF/5F83FB8A" Ref="#PWR?"  Part="1" 
AR Path="/5F83FB8A" Ref="#PWR?"  Part="1" 
AR Path="/5F5F0002/5F83FB8A" Ref="#PWR?"  Part="1" 
AR Path="/5EFE1C3B/5F83FB8A" Ref="#PWR0122"  Part="1" 
F 0 "#PWR0122" H 8600 5325 50  0001 C CNN
F 1 "GND" H 8605 5410 39  0000 C CNN
F 2 "" H 8600 5575 50  0001 C CNN
F 3 "" H 8600 5575 50  0001 C CNN
	1    8600 5575
	1    0    0    -1  
$EndComp
$Comp
L Device:R_Small R?
U 1 1 5F83FB84
P 8600 5325
AR Path="/5F2104BF/5F83FB84" Ref="R?"  Part="1" 
AR Path="/5F83FB84" Ref="R?"  Part="1" 
AR Path="/5F5F0002/5F83FB84" Ref="R?"  Part="1" 
AR Path="/5EFE1C3B/5F83FB84" Ref="R73"  Part="1" 
F 0 "R73" H 8659 5363 39  0000 L CNN
F 1 "180" H 8659 5288 39  0000 L CNN
F 2 "Resistor_SMD:R_0603_1608Metric" H 8600 5325 50  0001 C CNN
F 3 "~" H 8600 5325 50  0001 C CNN
F 4 "" H 8600 5325 50  0001 C CNN "Mfr"
	1    8600 5325
	1    0    0    -1  
$EndComp
Wire Wire Line
	8600 4775 8600 4625
Wire Wire Line
	8250 4775 8250 4625
$Comp
L Device:LED D?
U 1 1 5F83FB7B
P 8250 4925
AR Path="/5F2104BF/5F83FB7B" Ref="D?"  Part="1" 
AR Path="/5F83FB7B" Ref="D?"  Part="1" 
AR Path="/5F5F0002/5F83FB7B" Ref="D?"  Part="1" 
AR Path="/5F496ED4/5F83FB7B" Ref="D?"  Part="1" 
AR Path="/5EFE1C3B/5F83FB7B" Ref="D33"  Part="1" 
F 0 "D33" V 8281 4807 39  0000 R CNN
F 1 "IN-S126ATB " V 8206 4807 39  0001 R CNN
F 2 "LED_SMD:LED_1206_3216Metric_Castellated" H 8250 4925 50  0001 C CNN
F 3 "http://inolux-corp.com/datasheet/SMDLED/Mono%20Color%20Top%20View/IN-S126AT%20Series_V1.0.pdf" H 8250 4925 50  0001 C CNN
	1    8250 4925
	0    1    -1   0   
$EndComp
$Comp
L Device:LED D?
U 1 1 5F83FB75
P 8600 4925
AR Path="/5F2104BF/5F83FB75" Ref="D?"  Part="1" 
AR Path="/5F83FB75" Ref="D?"  Part="1" 
AR Path="/5F5F0002/5F83FB75" Ref="D?"  Part="1" 
AR Path="/5F496ED4/5F83FB75" Ref="D?"  Part="1" 
AR Path="/5EFE1C3B/5F83FB75" Ref="D34"  Part="1" 
F 0 "D34" V 8631 4807 39  0000 R CNN
F 1 "IN-S126AT5UW" V 8556 4807 39  0001 R CNN
F 2 "LED_SMD:LED_1206_3216Metric_Castellated" H 8600 4925 50  0001 C CNN
F 3 "http://inolux-corp.com/datasheet/SMDLED/Mono%20Color%20Top%20View/IN-S126AT%20Series_V1.0.pdf" H 8600 4925 50  0001 C CNN
	1    8600 4925
	0    1    -1   0   
$EndComp
Wire Wire Line
	8600 5225 8600 5075
Wire Wire Line
	8250 5225 8250 5075
Text Label 8950 5575 3    39   ~ 0
SOLAR
$Comp
L power:+5V #PWR?
U 1 1 5F83573F
P 8950 4625
AR Path="/5F102375/5F83573F" Ref="#PWR?"  Part="1" 
AR Path="/5F2104BF/5F83573F" Ref="#PWR?"  Part="1" 
AR Path="/5EFE1C3B/5F83573F" Ref="#PWR0123"  Part="1" 
F 0 "#PWR0123" H 8950 4475 50  0001 C CNN
F 1 "+5V" H 8950 4800 39  0000 C CNN
F 2 "" H 8950 4625 50  0001 C CNN
F 3 "" H 8950 4625 50  0001 C CNN
	1    8950 4625
	1    0    0    -1  
$EndComp
Wire Wire Line
	8950 5575 8950 5425
Wire Wire Line
	9300 5575 9300 5425
$Comp
L Device:R_Small R?
U 1 1 5F830756
P 8950 5325
AR Path="/5F2104BF/5F830756" Ref="R?"  Part="1" 
AR Path="/5F830756" Ref="R?"  Part="1" 
AR Path="/5F5F0002/5F830756" Ref="R?"  Part="1" 
AR Path="/5EFE1C3B/5F830756" Ref="R74"  Part="1" 
F 0 "R74" H 9009 5363 39  0000 L CNN
F 1 "180" H 9009 5288 39  0000 L CNN
F 2 "Resistor_SMD:R_0603_1608Metric" H 8950 5325 50  0001 C CNN
F 3 "~" H 8950 5325 50  0001 C CNN
F 4 "" H 8950 5325 50  0001 C CNN "Mfr"
	1    8950 5325
	1    0    0    -1  
$EndComp
Text Label 9300 4625 1    39   ~ 0
GRID
$Comp
L power:GND #PWR?
U 1 1 5F81E8C7
P 9300 5575
AR Path="/5F2104BF/5F81E8C7" Ref="#PWR?"  Part="1" 
AR Path="/5F81E8C7" Ref="#PWR?"  Part="1" 
AR Path="/5F5F0002/5F81E8C7" Ref="#PWR?"  Part="1" 
AR Path="/5EFE1C3B/5F81E8C7" Ref="#PWR0125"  Part="1" 
F 0 "#PWR0125" H 9300 5325 50  0001 C CNN
F 1 "GND" H 9305 5410 39  0000 C CNN
F 2 "" H 9300 5575 50  0001 C CNN
F 3 "" H 9300 5575 50  0001 C CNN
	1    9300 5575
	1    0    0    -1  
$EndComp
$Comp
L Device:R_Small R?
U 1 1 5F81CE33
P 9300 5325
AR Path="/5F2104BF/5F81CE33" Ref="R?"  Part="1" 
AR Path="/5F81CE33" Ref="R?"  Part="1" 
AR Path="/5F5F0002/5F81CE33" Ref="R?"  Part="1" 
AR Path="/5EFE1C3B/5F81CE33" Ref="R76"  Part="1" 
F 0 "R76" H 9359 5363 39  0000 L CNN
F 1 "180" H 9359 5288 39  0000 L CNN
F 2 "Resistor_SMD:R_0603_1608Metric" H 9300 5325 50  0001 C CNN
F 3 "~" H 9300 5325 50  0001 C CNN
F 4 "" H 9300 5325 50  0001 C CNN "Mfr"
	1    9300 5325
	1    0    0    -1  
$EndComp
Wire Wire Line
	9300 4775 9300 4625
Wire Wire Line
	8950 4775 8950 4625
$Comp
L Device:LED D?
U 1 1 5F7AC55C
P 8950 4925
AR Path="/5F2104BF/5F7AC55C" Ref="D?"  Part="1" 
AR Path="/5F7AC55C" Ref="D?"  Part="1" 
AR Path="/5F5F0002/5F7AC55C" Ref="D?"  Part="1" 
AR Path="/5F496ED4/5F7AC55C" Ref="D?"  Part="1" 
AR Path="/5EFE1C3B/5F7AC55C" Ref="D35"  Part="1" 
F 0 "D35" V 8981 4807 39  0000 R CNN
F 1 "IN-S126ATB " V 8906 4807 39  0001 R CNN
F 2 "LED_SMD:LED_1206_3216Metric_Castellated" H 8950 4925 50  0001 C CNN
F 3 "http://inolux-corp.com/datasheet/SMDLED/Mono%20Color%20Top%20View/IN-S126AT%20Series_V1.0.pdf" H 8950 4925 50  0001 C CNN
	1    8950 4925
	0    1    -1   0   
$EndComp
Wire Wire Line
	9300 5225 9300 5075
Wire Wire Line
	8950 5225 8950 5075
Text Notes 10100 4975 0    39   ~ 0
White LED\nVf = 3.1 V @ If = 10 mA
Text Notes 6450 3975 0    39   ~ 0
Blue LED\nVf = 3.1 V @ If = 10 mA
Text Label 6350 4575 3    39   ~ 0
SOLAR
$Comp
L power:+5V #PWR?
U 1 1 5F5B7784
P 6350 3625
AR Path="/5F102375/5F5B7784" Ref="#PWR?"  Part="1" 
AR Path="/5F2104BF/5F5B7784" Ref="#PWR?"  Part="1" 
AR Path="/5EFE1C3B/5F5B7784" Ref="#PWR0127"  Part="1" 
F 0 "#PWR0127" H 6350 3475 50  0001 C CNN
F 1 "+5V" H 6350 3800 39  0000 C CNN
F 2 "" H 6350 3625 50  0001 C CNN
F 3 "" H 6350 3625 50  0001 C CNN
	1    6350 3625
	1    0    0    -1  
$EndComp
Wire Wire Line
	6350 4575 6350 4425
$Comp
L Device:R_Small R?
U 1 1 5F5B777D
P 6350 4325
AR Path="/5F2104BF/5F5B777D" Ref="R?"  Part="1" 
AR Path="/5F5B777D" Ref="R?"  Part="1" 
AR Path="/5F5F0002/5F5B777D" Ref="R?"  Part="1" 
AR Path="/5EFE1C3B/5F5B777D" Ref="R79"  Part="1" 
F 0 "R79" H 6409 4363 39  0000 L CNN
F 1 "180" H 6409 4288 39  0000 L CNN
F 2 "Resistor_SMD:R_0603_1608Metric" H 6350 4325 50  0001 C CNN
F 3 "~" H 6350 4325 50  0001 C CNN
F 4 "" H 6350 4325 50  0001 C CNN "Mfr"
	1    6350 4325
	1    0    0    -1  
$EndComp
Wire Wire Line
	6350 3775 6350 3625
$Comp
L Device:LED D?
U 1 1 5F5B7775
P 6350 3925
AR Path="/5F2104BF/5F5B7775" Ref="D?"  Part="1" 
AR Path="/5F5B7775" Ref="D?"  Part="1" 
AR Path="/5F5F0002/5F5B7775" Ref="D?"  Part="1" 
AR Path="/5F496ED4/5F5B7775" Ref="D?"  Part="1" 
AR Path="/5EFE1C3B/5F5B7775" Ref="D40"  Part="1" 
F 0 "D40" V 6381 3807 39  0000 R CNN
F 1 "IN-S126ATB" V 6250 4375 39  0000 R CNN
F 2 "LED_SMD:LED_1206_3216Metric_Castellated" H 6350 3925 50  0001 C CNN
F 3 "http://inolux-corp.com/datasheet/SMDLED/Mono%20Color%20Top%20View/IN-S126AT%20Series_V1.0.pdf" H 6350 3925 50  0001 C CNN
	1    6350 3925
	0    1    -1   0   
$EndComp
Wire Wire Line
	6350 4225 6350 4075
Wire Wire Line
	3750 6000 3950 6000
$Comp
L Device:LED D?
U 1 1 5F6B6136
P 5900 1950
AR Path="/5F2104BF/5F6B6136" Ref="D?"  Part="1" 
AR Path="/5F6B6136" Ref="D?"  Part="1" 
AR Path="/5F5F0002/5F6B6136" Ref="D?"  Part="1" 
AR Path="/5F496ED4/5F6B6136" Ref="D?"  Part="1" 
AR Path="/5EFE1C3B/5F6B6136" Ref="D31"  Part="1" 
F 0 "D31" V 5931 1832 39  0000 R CNN
F 1 "IN-S126ATA" V 5856 1832 39  0000 R CNN
F 2 "LED_SMD:LED_1206_3216Metric_Castellated" H 5900 1950 50  0001 C CNN
F 3 "http://inolux-corp.com/datasheet/SMDLED/Mono%20Color%20Top%20View/IN-S126AT%20Series_V1.0.pdf" H 5900 1950 50  0001 C CNN
	1    5900 1950
	0    1    -1   0   
$EndComp
$Comp
L Device:LED D?
U 1 1 5F6C5ED5
P 7250 1950
AR Path="/5F2104BF/5F6C5ED5" Ref="D?"  Part="1" 
AR Path="/5F6C5ED5" Ref="D?"  Part="1" 
AR Path="/5F5F0002/5F6C5ED5" Ref="D?"  Part="1" 
AR Path="/5F496ED4/5F6C5ED5" Ref="D?"  Part="1" 
AR Path="/5EFE1C3B/5F6C5ED5" Ref="D36"  Part="1" 
F 0 "D36" V 7281 1832 39  0000 R CNN
F 1 "IN-S126ATR" V 7206 1832 39  0000 R CNN
F 2 "LED_SMD:LED_1206_3216Metric_Castellated" H 7250 1950 50  0001 C CNN
F 3 "http://inolux-corp.com/datasheet/SMDLED/Mono%20Color%20Top%20View/IN-S126AT%20Series_V1.0.pdf" H 7250 1950 50  0001 C CNN
	1    7250 1950
	0    1    -1   0   
$EndComp
$Comp
L Device:LED D?
U 1 1 5F6C66AB
P 7750 1950
AR Path="/5F2104BF/5F6C66AB" Ref="D?"  Part="1" 
AR Path="/5F6C66AB" Ref="D?"  Part="1" 
AR Path="/5F5F0002/5F6C66AB" Ref="D?"  Part="1" 
AR Path="/5F496ED4/5F6C66AB" Ref="D?"  Part="1" 
AR Path="/5EFE1C3B/5F6C66AB" Ref="D38"  Part="1" 
F 0 "D38" V 7781 1832 39  0000 R CNN
F 1 "IN-S126ATR" V 7706 1832 39  0000 R CNN
F 2 "LED_SMD:LED_1206_3216Metric_Castellated" H 7750 1950 50  0001 C CNN
F 3 "http://inolux-corp.com/datasheet/SMDLED/Mono%20Color%20Top%20View/IN-S126AT%20Series_V1.0.pdf" H 7750 1950 50  0001 C CNN
	1    7750 1950
	0    1    -1   0   
$EndComp
Text GLabel 3950 6000 2    39   Input ~ 0
SOLAR
$Comp
L Device:Q_NMOS_GSD Q?
U 1 1 5F5AA72D
P 7150 2450
AR Path="/5F2104BF/5F5AA72D" Ref="Q?"  Part="1" 
AR Path="/5F5AA72D" Ref="Q?"  Part="1" 
AR Path="/5F5F0002/5F5AA72D" Ref="Q?"  Part="1" 
AR Path="/5F496ED4/5F5AA72D" Ref="Q?"  Part="1" 
AR Path="/5EFE1C3B/5F5AA72D" Ref="Q23"  Part="1" 
F 0 "Q23" H 7355 2488 39  0000 L CNN
F 1 "Si2302CDS" H 7355 2413 39  0000 L CNN
F 2 "Package_TO_SOT_SMD:SOT-23" H 7350 2550 50  0001 C CNN
F 3 "https://eu.mouser.com/datasheet/2/427/si2302cds-1764899.pdf" H 7150 2450 50  0001 C CNN
	1    7150 2450
	1    0    0    -1  
$EndComp
$Comp
L Device:Q_NMOS_GSD Q?
U 1 1 5F560EC9
P 5800 2450
AR Path="/5F2104BF/5F560EC9" Ref="Q?"  Part="1" 
AR Path="/5F560EC9" Ref="Q?"  Part="1" 
AR Path="/5F5F0002/5F560EC9" Ref="Q?"  Part="1" 
AR Path="/5F496ED4/5F560EC9" Ref="Q?"  Part="1" 
AR Path="/5EFE1C3B/5F560EC9" Ref="Q22"  Part="1" 
F 0 "Q22" H 6005 2488 39  0000 L CNN
F 1 "Si2302CDS" H 6005 2413 39  0000 L CNN
F 2 "Package_TO_SOT_SMD:SOT-23" H 6000 2550 50  0001 C CNN
F 3 "https://eu.mouser.com/datasheet/2/427/si2302cds-1764899.pdf" H 5800 2450 50  0001 C CNN
	1    5800 2450
	1    0    0    -1  
$EndComp
$Comp
L power:+5V #PWR?
U 1 1 5F7D1338
P 7250 1425
AR Path="/5F102375/5F7D1338" Ref="#PWR?"  Part="1" 
AR Path="/5F2104BF/5F7D1338" Ref="#PWR?"  Part="1" 
AR Path="/5EFE1C3B/5F7D1338" Ref="#PWR0112"  Part="1" 
F 0 "#PWR0112" H 7250 1275 50  0001 C CNN
F 1 "+5V" H 7250 1600 39  0000 C CNN
F 2 "" H 7250 1425 50  0001 C CNN
F 3 "" H 7250 1425 50  0001 C CNN
	1    7250 1425
	1    0    0    -1  
$EndComp
$Comp
L power:+5V #PWR?
U 1 1 5F5D5541
P 5900 1425
AR Path="/5F102375/5F5D5541" Ref="#PWR?"  Part="1" 
AR Path="/5F2104BF/5F5D5541" Ref="#PWR?"  Part="1" 
AR Path="/5EFE1C3B/5F5D5541" Ref="#PWR0118"  Part="1" 
F 0 "#PWR0118" H 5900 1275 50  0001 C CNN
F 1 "+5V" H 5900 1600 39  0000 C CNN
F 2 "" H 5900 1425 50  0001 C CNN
F 3 "" H 5900 1425 50  0001 C CNN
	1    5900 1425
	1    0    0    -1  
$EndComp
Wire Wire Line
	5900 1425 5900 1500
$Comp
L Device:R_Small R?
U 1 1 5F5AA726
P 7250 1600
AR Path="/5F2104BF/5F5AA726" Ref="R?"  Part="1" 
AR Path="/5F5AA726" Ref="R?"  Part="1" 
AR Path="/5F5F0002/5F5AA726" Ref="R?"  Part="1" 
AR Path="/5EFE1C3B/5F5AA726" Ref="R65"  Part="1" 
F 0 "R65" H 7309 1638 39  0000 L CNN
F 1 "270" H 7309 1563 39  0000 L CNN
F 2 "Resistor_SMD:R_0603_1608Metric" H 7250 1600 50  0001 C CNN
F 3 "~" H 7250 1600 50  0001 C CNN
	1    7250 1600
	1    0    0    -1  
$EndComp
$Comp
L Device:R_Small R?
U 1 1 5F5B3405
P 7750 1600
AR Path="/5F2104BF/5F5B3405" Ref="R?"  Part="1" 
AR Path="/5F5B3405" Ref="R?"  Part="1" 
AR Path="/5F5F0002/5F5B3405" Ref="R?"  Part="1" 
AR Path="/5EFE1C3B/5F5B3405" Ref="R67"  Part="1" 
F 0 "R67" H 7809 1638 39  0000 L CNN
F 1 "270" H 7809 1563 39  0000 L CNN
F 2 "Resistor_SMD:R_0603_1608Metric" H 7750 1600 50  0001 C CNN
F 3 "~" H 7750 1600 50  0001 C CNN
	1    7750 1600
	1    0    0    -1  
$EndComp
$Comp
L power:+5V #PWR?
U 1 1 5F7E98EA
P 7750 1425
AR Path="/5F102375/5F7E98EA" Ref="#PWR?"  Part="1" 
AR Path="/5F2104BF/5F7E98EA" Ref="#PWR?"  Part="1" 
AR Path="/5EFE1C3B/5F7E98EA" Ref="#PWR0113"  Part="1" 
F 0 "#PWR0113" H 7750 1275 50  0001 C CNN
F 1 "+5V" H 7750 1600 39  0000 C CNN
F 2 "" H 7750 1425 50  0001 C CNN
F 3 "" H 7750 1425 50  0001 C CNN
	1    7750 1425
	1    0    0    -1  
$EndComp
Text Label 5500 2450 2    39   ~ 0
LED_Oven
Text Label 6850 2450 2    39   ~ 0
LED_Stove
Wire Wire Line
	9950 1425 9950 1525
$Comp
L power:+5V #PWR?
U 1 1 5F756652
P 9950 1425
AR Path="/5F112078/5F756652" Ref="#PWR?"  Part="1" 
AR Path="/5F756652" Ref="#PWR?"  Part="1" 
AR Path="/5F25F1E7/5F756652" Ref="#PWR?"  Part="1" 
AR Path="/5F56A024/5F756652" Ref="#PWR?"  Part="1" 
AR Path="/5EFE1C3B/5F756652" Ref="#PWR0140"  Part="1" 
F 0 "#PWR0140" H 9950 1275 50  0001 C CNN
F 1 "+5V" H 9950 1575 39  0000 C CNN
F 2 "" H 9950 1425 50  0001 C CNN
F 3 "" H 9950 1425 50  0001 C CNN
	1    9950 1425
	1    0    0    -1  
$EndComp
$Comp
L power:GND #PWR?
U 1 1 5F756664
P 9950 2650
AR Path="/5F756664" Ref="#PWR?"  Part="1" 
AR Path="/5EFE1C3B/5F756664" Ref="#PWR0141"  Part="1" 
AR Path="/5F25F1E7/5F756664" Ref="#PWR?"  Part="1" 
AR Path="/5F56A024/5F756664" Ref="#PWR?"  Part="1" 
F 0 "#PWR0141" H 9950 2400 50  0001 C CNN
F 1 "GND" H 9955 2477 39  0000 C CNN
F 2 "" H 9950 2650 50  0001 C CNN
F 3 "" H 9950 2650 50  0001 C CNN
	1    9950 2650
	1    0    0    -1  
$EndComp
$Comp
L power:GND #PWR?
U 1 1 5F756670
P 8725 2650
AR Path="/5F756670" Ref="#PWR?"  Part="1" 
AR Path="/5EFE1C3B/5F756670" Ref="#PWR0142"  Part="1" 
AR Path="/5F25F1E7/5F756670" Ref="#PWR?"  Part="1" 
AR Path="/5F56A024/5F756670" Ref="#PWR?"  Part="1" 
F 0 "#PWR0142" H 8725 2400 50  0001 C CNN
F 1 "GND" H 8730 2477 39  0000 C CNN
F 2 "" H 8725 2650 50  0001 C CNN
F 3 "" H 8725 2650 50  0001 C CNN
	1    8725 2650
	1    0    0    -1  
$EndComp
Wire Wire Line
	8725 1500 8725 1425
$Comp
L power:+5V #PWR?
U 1 1 5F756677
P 8725 1425
AR Path="/5F112078/5F756677" Ref="#PWR?"  Part="1" 
AR Path="/5F756677" Ref="#PWR?"  Part="1" 
AR Path="/5F25F1E7/5F756677" Ref="#PWR?"  Part="1" 
AR Path="/5F56A024/5F756677" Ref="#PWR?"  Part="1" 
AR Path="/5EFE1C3B/5F756677" Ref="#PWR0143"  Part="1" 
F 0 "#PWR0143" H 8725 1275 50  0001 C CNN
F 1 "+5V" H 8725 1575 39  0000 C CNN
F 2 "" H 8725 1425 50  0001 C CNN
F 3 "" H 8725 1425 50  0001 C CNN
	1    8725 1425
	1    0    0    -1  
$EndComp
Text Notes 10075 2150 0    39   ~ 0
Blue LED\nVf = 3.1 V @ If = 10 mA
Text Notes 8850 2150 0    39   ~ 0
Red LED\nVf = 2.05 V @ If = 10 mA
$Comp
L Device:LED D?
U 1 1 5F75667F
P 9950 1950
AR Path="/5F25F1E7/5F75667F" Ref="D?"  Part="1" 
AR Path="/5F56A024/5F75667F" Ref="D?"  Part="1" 
AR Path="/5EFE1C3B/5F75667F" Ref="D11"  Part="1" 
F 0 "D11" V 9981 1832 39  0000 R CNN
F 1 "IN-S126ATB " V 9906 1832 39  0000 R CNN
F 2 "LED_SMD:LED_1206_3216Metric_Castellated" H 9950 1950 50  0001 C CNN
F 3 "http://inolux-corp.com/datasheet/SMDLED/Mono%20Color%20Top%20View/IN-S126AT%20Series_V1.0.pdf" H 9950 1950 50  0001 C CNN
	1    9950 1950
	0    -1   -1   0   
$EndComp
Wire Wire Line
	9950 1725 9950 1800
$Comp
L Device:R_Small R?
U 1 1 5F756686
P 9950 1625
AR Path="/5F756686" Ref="R?"  Part="1" 
AR Path="/5EFE1C3B/5F756686" Ref="R46"  Part="1" 
AR Path="/5F25F1E7/5F756686" Ref="R?"  Part="1" 
AR Path="/5F56A024/5F756686" Ref="R?"  Part="1" 
F 0 "R46" H 10009 1671 39  0000 L CNN
F 1 "180" H 10009 1580 39  0000 L CNN
F 2 "Resistor_SMD:R_0603_1608Metric" H 9950 1625 50  0001 C CNN
F 3 "~" H 9950 1625 50  0001 C CNN
	1    9950 1625
	1    0    0    -1  
$EndComp
Wire Wire Line
	8725 1700 8725 1800
$Comp
L Device:R_Small R?
U 1 1 5F75668D
P 8725 1600
AR Path="/5F75668D" Ref="R?"  Part="1" 
AR Path="/5EFE1C3B/5F75668D" Ref="R43"  Part="1" 
AR Path="/5F25F1E7/5F75668D" Ref="R?"  Part="1" 
AR Path="/5F56A024/5F75668D" Ref="R?"  Part="1" 
F 0 "R43" H 8784 1646 39  0000 L CNN
F 1 "270" H 8784 1555 39  0000 L CNN
F 2 "Resistor_SMD:R_0603_1608Metric" H 8725 1600 50  0001 C CNN
F 3 "~" H 8725 1600 50  0001 C CNN
	1    8725 1600
	1    0    0    -1  
$EndComp
$Comp
L Device:LED D?
U 1 1 5F756697
P 8725 1950
AR Path="/5F25F1E7/5F756697" Ref="D?"  Part="1" 
AR Path="/5F56A024/5F756697" Ref="D?"  Part="1" 
AR Path="/5EFE1C3B/5F756697" Ref="D10"  Part="1" 
F 0 "D10" V 8756 1832 39  0000 R CNN
F 1 "IN-S126ATR" V 8681 1832 39  0000 R CNN
F 2 "LED_SMD:LED_1206_3216Metric_Castellated" H 8725 1950 50  0001 C CNN
F 3 "http://inolux-corp.com/datasheet/SMDLED/Mono%20Color%20Top%20View/IN-S126AT%20Series_V1.0.pdf" H 8725 1950 50  0001 C CNN
	1    8725 1950
	0    -1   -1   0   
$EndComp
$Comp
L power:GND #PWR?
U 1 1 5F643B05
P 3800 2850
AR Path="/5F2104BF/5F643B05" Ref="#PWR?"  Part="1" 
AR Path="/5F643B05" Ref="#PWR?"  Part="1" 
AR Path="/5F5F0002/5F643B05" Ref="#PWR?"  Part="1" 
AR Path="/5EFE1C3B/5F643B05" Ref="#PWR096"  Part="1" 
F 0 "#PWR096" H 3800 2600 50  0001 C CNN
F 1 "GND" H 3805 2685 39  0000 C CNN
F 2 "" H 3800 2850 50  0001 C CNN
F 3 "" H 3800 2850 50  0001 C CNN
	1    3800 2850
	1    0    0    -1  
$EndComp
Wire Wire Line
	3400 2700 3400 2850
Wire Wire Line
	3400 2400 3400 2500
$Comp
L power:GND #PWR?
U 1 1 5F663FEA
P 3400 2850
AR Path="/5F2104BF/5F663FEA" Ref="#PWR?"  Part="1" 
AR Path="/5F663FEA" Ref="#PWR?"  Part="1" 
AR Path="/5F5F0002/5F663FEA" Ref="#PWR?"  Part="1" 
AR Path="/5EFE1C3B/5F663FEA" Ref="#PWR097"  Part="1" 
F 0 "#PWR097" H 3400 2600 50  0001 C CNN
F 1 "GND" H 3405 2685 39  0000 C CNN
F 2 "" H 3400 2850 50  0001 C CNN
F 3 "" H 3400 2850 50  0001 C CNN
	1    3400 2850
	1    0    0    -1  
$EndComp
$Comp
L Device:R_Small R?
U 1 1 5F663FE4
P 3400 2600
AR Path="/5F2104BF/5F663FE4" Ref="R?"  Part="1" 
AR Path="/5F663FE4" Ref="R?"  Part="1" 
AR Path="/5F5F0002/5F663FE4" Ref="R?"  Part="1" 
AR Path="/5EFE1C3B/5F663FE4" Ref="R50"  Part="1" 
F 0 "R50" H 3459 2638 39  0000 L CNN
F 1 "120" H 3459 2563 39  0000 L CNN
F 2 "Resistor_SMD:R_0603_1608Metric" H 3400 2600 50  0001 C CNN
F 3 "~" H 3400 2600 50  0001 C CNN
F 4 "" H 3400 2600 50  0001 C CNN "Mfr"
	1    3400 2600
	1    0    0    -1  
$EndComp
$Comp
L Device:LED D?
U 1 1 5F663FDD
P 3400 2250
AR Path="/5F2104BF/5F663FDD" Ref="D?"  Part="1" 
AR Path="/5F663FDD" Ref="D?"  Part="1" 
AR Path="/5F5F0002/5F663FDD" Ref="D?"  Part="1" 
AR Path="/5F496ED4/5F663FDD" Ref="D?"  Part="1" 
AR Path="/5EFE1C3B/5F663FDD" Ref="D13"  Part="1" 
F 0 "D13" V 3431 2132 39  0000 R CNN
F 1 "IN-S126ATR" V 3350 2100 39  0001 R CNN
F 2 "LED_SMD:LED_1206_3216Metric_Castellated" H 3400 2250 50  0001 C CNN
F 3 "http://inolux-corp.com/datasheet/SMDLED/Mono%20Color%20Top%20View/IN-S126AT%20Series_V1.0.pdf" H 3400 2250 50  0001 C CNN
	1    3400 2250
	0    1    -1   0   
$EndComp
Text Label 2600 1550 0    39   ~ 0
LED_Stove
Text Label 2600 1850 0    39   ~ 0
LED_Heater
$Comp
L Device:LED D?
U 1 1 5F63BB0F
P 3000 2250
AR Path="/5F2104BF/5F63BB0F" Ref="D?"  Part="1" 
AR Path="/5F63BB0F" Ref="D?"  Part="1" 
AR Path="/5F5F0002/5F63BB0F" Ref="D?"  Part="1" 
AR Path="/5F496ED4/5F63BB0F" Ref="D?"  Part="1" 
AR Path="/5EFE1C3B/5F63BB0F" Ref="D12"  Part="1" 
F 0 "D12" V 3031 2132 39  0000 R CNN
F 1 "IN-S126ATR" V 2950 2100 39  0000 R CNN
F 2 "LED_SMD:LED_1206_3216Metric_Castellated" H 3000 2250 50  0001 C CNN
F 3 "http://inolux-corp.com/datasheet/SMDLED/Mono%20Color%20Top%20View/IN-S126AT%20Series_V1.0.pdf" H 3000 2250 50  0001 C CNN
	1    3000 2250
	0    1    -1   0   
$EndComp
$Comp
L Device:R_Small R?
U 1 1 5F6428ED
P 3000 2600
AR Path="/5F2104BF/5F6428ED" Ref="R?"  Part="1" 
AR Path="/5F6428ED" Ref="R?"  Part="1" 
AR Path="/5F5F0002/5F6428ED" Ref="R?"  Part="1" 
AR Path="/5EFE1C3B/5F6428ED" Ref="R49"  Part="1" 
F 0 "R49" H 3059 2638 39  0000 L CNN
F 1 "120" H 3059 2563 39  0000 L CNN
F 2 "Resistor_SMD:R_0603_1608Metric" H 3000 2600 50  0001 C CNN
F 3 "~" H 3000 2600 50  0001 C CNN
F 4 "" H 3000 2600 50  0001 C CNN "Mfr"
	1    3000 2600
	1    0    0    -1  
$EndComp
Wire Wire Line
	3000 2400 3000 2500
Wire Wire Line
	3000 2700 3000 2850
Wire Wire Line
	4200 2700 4200 2850
Wire Wire Line
	4200 2400 4200 2500
$Comp
L Device:R_Small R?
U 1 1 5F66AD6D
P 4200 2600
AR Path="/5F2104BF/5F66AD6D" Ref="R?"  Part="1" 
AR Path="/5F66AD6D" Ref="R?"  Part="1" 
AR Path="/5F5F0002/5F66AD6D" Ref="R?"  Part="1" 
AR Path="/5EFE1C3B/5F66AD6D" Ref="R52"  Part="1" 
F 0 "R52" H 4259 2638 39  0000 L CNN
F 1 "120" H 4259 2563 39  0000 L CNN
F 2 "Resistor_SMD:R_0603_1608Metric" H 4200 2600 50  0001 C CNN
F 3 "~" H 4200 2600 50  0001 C CNN
F 4 "" H 4200 2600 50  0001 C CNN "Mfr"
	1    4200 2600
	1    0    0    -1  
$EndComp
$Comp
L Device:LED D?
U 1 1 5F66AD66
P 4200 2250
AR Path="/5F2104BF/5F66AD66" Ref="D?"  Part="1" 
AR Path="/5F66AD66" Ref="D?"  Part="1" 
AR Path="/5F5F0002/5F66AD66" Ref="D?"  Part="1" 
AR Path="/5F496ED4/5F66AD66" Ref="D?"  Part="1" 
AR Path="/5EFE1C3B/5F66AD66" Ref="D15"  Part="1" 
F 0 "D15" V 4231 2132 39  0000 R CNN
F 1 "IN-S126ATR" V 4150 2100 39  0001 R CNN
F 2 "LED_SMD:LED_1206_3216Metric_Castellated" H 4200 2250 50  0001 C CNN
F 3 "http://inolux-corp.com/datasheet/SMDLED/Mono%20Color%20Top%20View/IN-S126AT%20Series_V1.0.pdf" H 4200 2250 50  0001 C CNN
	1    4200 2250
	0    1    -1   0   
$EndComp
Text Label 9550 2450 2    39   ~ 0
LED_AC
Wire Wire Line
	8325 2450 8425 2450
Text Label 8325 2450 2    39   ~ 0
LED_Heater
Wire Wire Line
	9550 2450 9650 2450
Text Label 2825 4575 3    39   ~ 0
SOLAR
$Comp
L power:+5V #PWR?
U 1 1 5F66962B
P 2825 3625
AR Path="/5F102375/5F66962B" Ref="#PWR?"  Part="1" 
AR Path="/5F2104BF/5F66962B" Ref="#PWR?"  Part="1" 
AR Path="/5EFE1C3B/5F66962B" Ref="#PWR0146"  Part="1" 
F 0 "#PWR0146" H 2825 3475 50  0001 C CNN
F 1 "+5V" H 2825 3800 39  0000 C CNN
F 2 "" H 2825 3625 50  0001 C CNN
F 3 "" H 2825 3625 50  0001 C CNN
	1    2825 3625
	1    0    0    -1  
$EndComp
Wire Wire Line
	2825 4575 2825 4425
$Comp
L Device:R_Small R?
U 1 1 5F669633
P 2825 4325
AR Path="/5F2104BF/5F669633" Ref="R?"  Part="1" 
AR Path="/5F669633" Ref="R?"  Part="1" 
AR Path="/5F5F0002/5F669633" Ref="R?"  Part="1" 
AR Path="/5EFE1C3B/5F669633" Ref="R81"  Part="1" 
F 0 "R81" H 2884 4363 39  0000 L CNN
F 1 "180" H 2884 4288 39  0000 L CNN
F 2 "Resistor_SMD:R_0603_1608Metric" H 2825 4325 50  0001 C CNN
F 3 "~" H 2825 4325 50  0001 C CNN
F 4 "" H 2825 4325 50  0001 C CNN "Mfr"
	1    2825 4325
	1    0    0    -1  
$EndComp
Wire Wire Line
	2825 3775 2825 3625
$Comp
L Device:LED D?
U 1 1 5F66963A
P 2825 3925
AR Path="/5F2104BF/5F66963A" Ref="D?"  Part="1" 
AR Path="/5F66963A" Ref="D?"  Part="1" 
AR Path="/5F5F0002/5F66963A" Ref="D?"  Part="1" 
AR Path="/5F496ED4/5F66963A" Ref="D?"  Part="1" 
AR Path="/5EFE1C3B/5F66963A" Ref="D4"  Part="1" 
F 0 "D4" V 2856 3807 39  0000 R CNN
F 1 "IN-S126ATB " V 2781 3807 39  0001 R CNN
F 2 "LED_SMD:LED_1206_3216Metric_Castellated" H 2825 3925 50  0001 C CNN
F 3 "http://inolux-corp.com/datasheet/SMDLED/Mono%20Color%20Top%20View/IN-S126AT%20Series_V1.0.pdf" H 2825 3925 50  0001 C CNN
	1    2825 3925
	0    1    -1   0   
$EndComp
Wire Wire Line
	2825 4225 2825 4075
$Comp
L Device:Q_NMOS_GSD Q?
U 1 1 5F9C378F
P 8625 2450
AR Path="/5F2104BF/5F9C378F" Ref="Q?"  Part="1" 
AR Path="/5F9C378F" Ref="Q?"  Part="1" 
AR Path="/5F5F0002/5F9C378F" Ref="Q?"  Part="1" 
AR Path="/5F496ED4/5F9C378F" Ref="Q?"  Part="1" 
AR Path="/5EFE1C3B/5F9C378F" Ref="Q14"  Part="1" 
F 0 "Q14" H 8830 2488 39  0000 L CNN
F 1 "Si2302CDS" H 8830 2413 39  0000 L CNN
F 2 "Package_TO_SOT_SMD:SOT-23" H 8825 2550 50  0001 C CNN
F 3 "https://eu.mouser.com/datasheet/2/427/si2302cds-1764899.pdf" H 8625 2450 50  0001 C CNN
	1    8625 2450
	1    0    0    -1  
$EndComp
$Comp
L Device:Q_NMOS_GSD Q?
U 1 1 5F9C3EDC
P 9850 2450
AR Path="/5F2104BF/5F9C3EDC" Ref="Q?"  Part="1" 
AR Path="/5F9C3EDC" Ref="Q?"  Part="1" 
AR Path="/5F5F0002/5F9C3EDC" Ref="Q?"  Part="1" 
AR Path="/5F496ED4/5F9C3EDC" Ref="Q?"  Part="1" 
AR Path="/5EFE1C3B/5F9C3EDC" Ref="Q18"  Part="1" 
F 0 "Q18" H 10055 2488 39  0000 L CNN
F 1 "Si2302CDS" H 10055 2413 39  0000 L CNN
F 2 "Package_TO_SOT_SMD:SOT-23" H 10050 2550 50  0001 C CNN
F 3 "https://eu.mouser.com/datasheet/2/427/si2302cds-1764899.pdf" H 9850 2450 50  0001 C CNN
	1    9850 2450
	1    0    0    -1  
$EndComp
Wire Wire Line
	8725 2100 8725 2175
Wire Wire Line
	9950 2100 9950 2175
Text GLabel 9900 2175 0    39   Input ~ 0
AC
Text GLabel 8675 2175 0    39   Input ~ 0
HEATER
Wire Wire Line
	9950 2175 9900 2175
Connection ~ 9950 2175
Wire Wire Line
	9950 2175 9950 2250
Wire Wire Line
	8725 2175 8675 2175
Connection ~ 8725 2175
Wire Wire Line
	8725 2175 8725 2250
$EndSCHEMATC
