EESchema Schematic File Version 4
EELAYER 30 0
EELAYER END
$Descr A4 11693 8268
encoding utf-8
Sheet 16 16
Title "BUS"
Date "2020-04-11"
Rev "1.2"
Comp "Institute for Automation of Complex Power Systems - E.ON ERC - RWTH Aachen University"
Comment1 "Designer: C. Guarnieri Calò Carducci"
Comment2 ""
Comment3 ""
Comment4 ""
$EndDescr
Text HLabel 3625 3975 0    50   Input ~ 0
VA
Text HLabel 8625 3975 2    50   Input ~ 0
VB
Text HLabel 3225 4875 0    50   Input ~ 0
~EN_A
Text HLabel 5025 6525 0    50   Input ~ 0
EN_G
$Comp
L power:+3.3V #PWR?
U 1 1 5E929E98
P 1975 1975
AR Path="/5E929E98" Ref="#PWR?"  Part="1" 
AR Path="/5E872B89/5E929E98" Ref="#PWR094"  Part="1" 
F 0 "#PWR094" H 1975 1825 50  0001 C CNN
F 1 "+3.3V" H 1990 2148 50  0000 C CNN
F 2 "" H 1975 1975 50  0001 C CNN
F 3 "" H 1975 1975 50  0001 C CNN
	1    1975 1975
	1    0    0    -1  
$EndComp
$Comp
L Device:R_Small R35
U 1 1 5E92AFDA
P 9875 2275
F 0 "R35" H 9934 2321 50  0000 L CNN
F 1 "4.7k" H 9934 2230 50  0000 L CNN
F 2 "Resistor_SMD:R_0402_1005Metric" H 9875 2275 50  0001 C CNN
F 3 "~" H 9875 2275 50  0001 C CNN
	1    9875 2275
	1    0    0    -1  
$EndComp
Wire Wire Line
	9875 1975 9875 2175
Wire Wire Line
	9875 2375 9875 2775
$Comp
L power:GND #PWR?
U 1 1 5E933A58
P 3175 2275
AR Path="/5E933A58" Ref="#PWR?"  Part="1" 
AR Path="/5E872B89/5E933A58" Ref="#PWR090"  Part="1" 
F 0 "#PWR090" H 3175 2025 50  0001 C CNN
F 1 "GND" H 3180 2102 50  0000 C CNN
F 2 "" H 3175 2275 50  0001 C CNN
F 3 "" H 3175 2275 50  0001 C CNN
	1    3175 2275
	0    1    -1   0   
$EndComp
Wire Wire Line
	2375 2375 2375 2775
Wire Wire Line
	2375 1975 2375 2175
$Comp
L Device:R_Small R32
U 1 1 5E933A4D
P 2375 2275
F 0 "R32" H 2434 2321 50  0000 L CNN
F 1 "4.7k" H 2434 2230 50  0000 L CNN
F 2 "Resistor_SMD:R_0402_1005Metric" H 2375 2275 50  0001 C CNN
F 3 "~" H 2375 2275 50  0001 C CNN
	1    2375 2275
	-1   0    0    -1  
$EndComp
Text HLabel 1425 2475 0    50   Input ~ 0
SDA
Wire Wire Line
	1575 1975 1575 2175
Wire Wire Line
	1975 1975 1975 2175
$Comp
L Device:R_Small R34
U 1 1 5E933A34
P 1575 2275
F 0 "R34" H 1634 2321 50  0000 L CNN
F 1 "4.7k" H 1634 2230 50  0000 L CNN
F 2 "Resistor_SMD:R_0402_1005Metric" H 1575 2275 50  0001 C CNN
F 3 "~" H 1575 2275 50  0001 C CNN
	1    1575 2275
	-1   0    0    -1  
$EndComp
$Comp
L Device:R_Small R33
U 1 1 5E933A2E
P 1975 2275
F 0 "R33" H 2034 2321 50  0000 L CNN
F 1 "4.7k" H 2034 2230 50  0000 L CNN
F 2 "Resistor_SMD:R_0402_1005Metric" H 1975 2275 50  0001 C CNN
F 3 "~" H 1975 2275 50  0001 C CNN
	1    1975 2275
	-1   0    0    -1  
$EndComp
$Comp
L power:GND #PWR?
U 1 1 5E933A28
P 2825 2225
AR Path="/5E933A28" Ref="#PWR?"  Part="1" 
AR Path="/5E872B89/5E933A28" Ref="#PWR086"  Part="1" 
F 0 "#PWR086" H 2825 1975 50  0001 C CNN
F 1 "GND" H 2830 2052 50  0000 C CNN
F 2 "" H 2825 2225 50  0001 C CNN
F 3 "" H 2825 2225 50  0001 C CNN
	1    2825 2225
	1    0    0    -1  
$EndComp
$Comp
L Analog_ADC:INA233 U?
U 1 1 5E933A1C
P 3575 2475
AR Path="/5E933A1C" Ref="U?"  Part="1" 
AR Path="/5E872B89/5E933A1C" Ref="U7"  Part="1" 
F 0 "U7" H 3625 2475 50  0000 R BNN
F 1 "INA233" H 3425 2575 50  0000 L BNN
F 2 "Package_SO:VSSOP-10_3x3mm_P0.5mm" H 4375 2025 50  0001 C CNN
F 3 "https://www.ti.com/lit/ds/symlink/ina233.pdf" H 3925 2375 50  0001 C CNN
	1    3575 2475
	-1   0    0    -1  
$EndComp
Text HLabel 1425 2575 0    50   Input ~ 0
SCL
$Comp
L Device:C_Small C?
U 1 1 5E933A0E
P 2825 2125
AR Path="/5E933A0E" Ref="C?"  Part="1" 
AR Path="/5E872B89/5E933A0E" Ref="C22"  Part="1" 
F 0 "C22" H 2917 2171 50  0000 L CNN
F 1 "100n" H 2917 2080 50  0000 L CNN
F 2 "Capacitor_SMD:C_0402_1005Metric" H 2825 2125 50  0001 C CNN
F 3 "~" H 2825 2125 50  0001 C CNN
	1    2825 2125
	-1   0    0    1   
$EndComp
$Comp
L power:GND #PWR?
U 1 1 5E933A08
P 3575 2975
AR Path="/5E933A08" Ref="#PWR?"  Part="1" 
AR Path="/5E872B89/5E933A08" Ref="#PWR089"  Part="1" 
F 0 "#PWR089" H 3575 2725 50  0001 C CNN
F 1 "GND" H 3580 2802 50  0000 C CNN
F 2 "" H 3575 2975 50  0001 C CNN
F 3 "" H 3575 2975 50  0001 C CNN
	1    3575 2975
	-1   0    0    -1  
$EndComp
Text HLabel 9025 4875 2    50   Input ~ 0
~EN_B
Wire Wire Line
	3875 5925 4225 5925
$Comp
L power:GND #PWR?
U 1 1 5E9B0DA6
P 3275 6475
AR Path="/5E9B0DA6" Ref="#PWR?"  Part="1" 
AR Path="/5E872B89/5E9B0DA6" Ref="#PWR085"  Part="1" 
F 0 "#PWR085" H 3275 6225 50  0001 C CNN
F 1 "GND" H 3280 6302 50  0000 C CNN
F 2 "" H 3275 6475 50  0001 C CNN
F 3 "" H 3275 6475 50  0001 C CNN
	1    3275 6475
	1    0    0    -1  
$EndComp
$Comp
L power:+3.3V #PWR?
U 1 1 5E9B0DAC
P 3275 6075
AR Path="/5E9B0DAC" Ref="#PWR?"  Part="1" 
AR Path="/5E872B89/5E9B0DAC" Ref="#PWR084"  Part="1" 
F 0 "#PWR084" H 3275 5925 50  0001 C CNN
F 1 "+3.3V" H 3290 6248 50  0000 C CNN
F 2 "" H 3275 6075 50  0001 C CNN
F 3 "" H 3275 6075 50  0001 C CNN
	1    3275 6075
	1    0    0    -1  
$EndComp
$Comp
L power:+3.3V #PWR?
U 1 1 5E9C0EEC
P 5325 6325
AR Path="/5E9C0EEC" Ref="#PWR?"  Part="1" 
AR Path="/5E872B89/5E9C0EEC" Ref="#PWR091"  Part="1" 
F 0 "#PWR091" H 5325 6175 50  0001 C CNN
F 1 "+3.3V" H 5340 6498 50  0000 C CNN
F 2 "" H 5325 6325 50  0001 C CNN
F 3 "" H 5325 6325 50  0001 C CNN
	1    5325 6325
	1    0    0    -1  
$EndComp
$Comp
L power:+3.3V #PWR?
U 1 1 5E9C125A
P 3525 4675
AR Path="/5E9C125A" Ref="#PWR?"  Part="1" 
AR Path="/5E872B89/5E9C125A" Ref="#PWR082"  Part="1" 
F 0 "#PWR082" H 3525 4525 50  0001 C CNN
F 1 "+3.3V" H 3540 4848 50  0000 C CNN
F 2 "" H 3525 4675 50  0001 C CNN
F 3 "" H 3525 4675 50  0001 C CNN
	1    3525 4675
	1    0    0    -1  
$EndComp
$Comp
L power:GND #PWR?
U 1 1 5E9C1942
P 3525 5075
AR Path="/5E9C1942" Ref="#PWR?"  Part="1" 
AR Path="/5E872B89/5E9C1942" Ref="#PWR083"  Part="1" 
F 0 "#PWR083" H 3525 4825 50  0001 C CNN
F 1 "GND" H 3530 4902 50  0000 C CNN
F 2 "" H 3525 5075 50  0001 C CNN
F 3 "" H 3525 5075 50  0001 C CNN
	1    3525 5075
	1    0    0    -1  
$EndComp
$Comp
L power:GND #PWR?
U 1 1 5E9C1C44
P 5325 6725
AR Path="/5E9C1C44" Ref="#PWR?"  Part="1" 
AR Path="/5E872B89/5E9C1C44" Ref="#PWR092"  Part="1" 
F 0 "#PWR092" H 5325 6475 50  0001 C CNN
F 1 "GND" H 5330 6552 50  0000 C CNN
F 2 "" H 5325 6725 50  0001 C CNN
F 3 "" H 5325 6725 50  0001 C CNN
	1    5325 6725
	1    0    0    -1  
$EndComp
$Comp
L power:+3.3V #PWR?
U 1 1 5E9C2068
P 8725 4675
AR Path="/5E9C2068" Ref="#PWR?"  Part="1" 
AR Path="/5E872B89/5E9C2068" Ref="#PWR0104"  Part="1" 
F 0 "#PWR0104" H 8725 4525 50  0001 C CNN
F 1 "+3.3V" H 8740 4848 50  0000 C CNN
F 2 "" H 8725 4675 50  0001 C CNN
F 3 "" H 8725 4675 50  0001 C CNN
	1    8725 4675
	1    0    0    -1  
$EndComp
$Comp
L power:GND #PWR?
U 1 1 5E9C2764
P 8725 5075
AR Path="/5E9C2764" Ref="#PWR?"  Part="1" 
AR Path="/5E872B89/5E9C2764" Ref="#PWR0105"  Part="1" 
F 0 "#PWR0105" H 8725 4825 50  0001 C CNN
F 1 "GND" V 8730 4902 50  0000 C CNN
F 2 "" H 8725 5075 50  0001 C CNN
F 3 "" H 8725 5075 50  0001 C CNN
	1    8725 5075
	-1   0    0    -1  
$EndComp
$Comp
L Device:C_Small C?
U 1 1 5E9CD9B5
P 3275 6275
AR Path="/5E9CD9B5" Ref="C?"  Part="1" 
AR Path="/5E872B89/5E9CD9B5" Ref="C21"  Part="1" 
F 0 "C21" H 3367 6321 50  0000 L CNN
F 1 "100n" H 3367 6230 50  0000 L CNN
F 2 "Capacitor_SMD:C_0402_1005Metric" H 3275 6275 50  0001 C CNN
F 3 "~" H 3275 6275 50  0001 C CNN
	1    3275 6275
	-1   0    0    -1  
$EndComp
Wire Wire Line
	3275 6075 3275 6175
Wire Wire Line
	3275 6375 3275 6475
Text HLabel 2275 2775 0    50   Input ~ 0
~IRQ_A
Text HLabel 9975 2775 2    50   Input ~ 0
~IRQ_B
Wire Wire Line
	1575 2375 1575 2575
Wire Wire Line
	2275 2775 2375 2775
Connection ~ 2375 2775
Connection ~ 9875 2775
Wire Wire Line
	2825 2025 2825 1975
$Comp
L power:+3.3V #PWR?
U 1 1 5EB7561E
P 1575 1975
AR Path="/5EB7561E" Ref="#PWR?"  Part="1" 
AR Path="/5E872B89/5EB7561E" Ref="#PWR095"  Part="1" 
F 0 "#PWR095" H 1575 1825 50  0001 C CNN
F 1 "+3.3V" H 1590 2148 50  0000 C CNN
F 2 "" H 1575 1975 50  0001 C CNN
F 3 "" H 1575 1975 50  0001 C CNN
	1    1575 1975
	1    0    0    -1  
$EndComp
$Comp
L power:+3.3V #PWR?
U 1 1 5EB758C3
P 9875 1975
AR Path="/5EB758C3" Ref="#PWR?"  Part="1" 
AR Path="/5E872B89/5EB758C3" Ref="#PWR098"  Part="1" 
F 0 "#PWR098" H 9875 1825 50  0001 C CNN
F 1 "+3.3V" H 9890 2148 50  0000 C CNN
F 2 "" H 9875 1975 50  0001 C CNN
F 3 "" H 9875 1975 50  0001 C CNN
	1    9875 1975
	1    0    0    -1  
$EndComp
$Comp
L power:+3.3V #PWR?
U 1 1 5EB75BF7
P 2375 1975
AR Path="/5EB75BF7" Ref="#PWR?"  Part="1" 
AR Path="/5E872B89/5EB75BF7" Ref="#PWR093"  Part="1" 
F 0 "#PWR093" H 2375 1825 50  0001 C CNN
F 1 "+3.3V" H 2390 2148 50  0000 C CNN
F 2 "" H 2375 1975 50  0001 C CNN
F 3 "" H 2375 1975 50  0001 C CNN
	1    2375 1975
	1    0    0    -1  
$EndComp
$Comp
L power:+3.3V #PWR?
U 1 1 5EBD96B8
P 3575 1975
AR Path="/5EBD96B8" Ref="#PWR?"  Part="1" 
AR Path="/5E872B89/5EBD96B8" Ref="#PWR0164"  Part="1" 
F 0 "#PWR0164" H 3575 1825 50  0001 C CNN
F 1 "+3.3V" H 3590 2148 50  0000 C CNN
F 2 "" H 3575 1975 50  0001 C CNN
F 3 "" H 3575 1975 50  0001 C CNN
	1    3575 1975
	1    0    0    -1  
$EndComp
Text Notes 3925 5425 0    47   ~ 0
EN  NP  OUT\n 0   0   0\n 0   1   1\n 1   0   1\n 1   1   1
Wire Notes Line
	3875 5125 4425 5125
Wire Notes Line
	4225 5025 4225 5475
Text Notes 5675 7025 0    47   ~ 0
EN  NP  OUT\n 0   0   0\n 0   1   1\n 1   0   1\n 1   1   1
Wire Notes Line
	5625 6725 6175 6725
Wire Notes Line
	5975 6625 5975 7075
Wire Wire Line
	3175 2175 3175 2275
Connection ~ 3175 2275
Text Label 6275 3975 0    50   ~ 0
VBUS_C
$Comp
L power:GND #PWR?
U 1 1 5EF0325D
P 5975 4875
AR Path="/5EF0325D" Ref="#PWR?"  Part="1" 
AR Path="/5E872B89/5EF0325D" Ref="#PWR0102"  Part="1" 
F 0 "#PWR0102" H 5975 4625 50  0001 C CNN
F 1 "GND" H 5980 4702 50  0000 C CNN
F 2 "" H 5975 4875 50  0001 C CNN
F 3 "" H 5975 4875 50  0001 C CNN
	1    5975 4875
	1    0    0    -1  
$EndComp
$Comp
L LEGOS:DMP2005UFG U15
U 1 1 5EEC591F
P 4475 4075
F 0 "U15" V 4817 4075 50  0000 C CNN
F 1 "DMP2005UFG" V 4725 4175 50  0000 C CNN
F 2 "LEGOS:Diodes_PowerDI3333-8" H 4675 4175 50  0001 C CNN
F 3 "https://www.diodes.com/assets/Datasheets/DMP2005UFG.pdf" H 4475 4075 50  0001 C CNN
	1    4475 4075
	0    1    -1   0   
$EndComp
Wire Wire Line
	3825 4875 4475 4875
$Comp
L LEGOS:BUK6D230-80E U9
U 1 1 5EF025E5
P 5875 4525
F 0 "U9" H 6080 4571 50  0000 L CNN
F 1 "BUK6D22-30E" H 6080 4480 50  0000 L CNN
F 2 "LEGOS:SOT-1220" H 6075 4625 50  0001 C CNN
F 3 "https://assets.nexperia.com/documents/data-sheet/BUK6D22-30E.pdf" H 5875 4525 50  0001 C CNN
	1    5875 4525
	1    0    0    -1  
$EndComp
$Comp
L LEGOS:DMP2005UFG U16
U 1 1 5EECDE25
P 7775 4075
F 0 "U16" V 8117 4075 50  0000 C CNN
F 1 "DMP2005UFG" V 8025 4150 50  0000 C CNN
F 2 "LEGOS:Diodes_PowerDI3333-8" H 7975 4175 50  0001 C CNN
F 3 "https://www.diodes.com/assets/Datasheets/DMP2005UFG.pdf" H 7775 4075 50  0001 C CNN
	1    7775 4075
	0    -1   -1   0   
$EndComp
Wire Wire Line
	7775 4275 7775 4875
Wire Wire Line
	7775 4875 8425 4875
Wire Wire Line
	9875 2775 9975 2775
Wire Wire Line
	9225 2275 9225 1975
Wire Wire Line
	9075 2275 9225 2275
Connection ~ 8675 1975
$Comp
L power:+3.3V #PWR?
U 1 1 5EBD9A3E
P 8675 1975
AR Path="/5EBD9A3E" Ref="#PWR?"  Part="1" 
AR Path="/5E872B89/5EBD9A3E" Ref="#PWR0165"  Part="1" 
F 0 "#PWR0165" H 8675 1825 50  0001 C CNN
F 1 "+3.3V" H 8690 2148 50  0000 C CNN
F 2 "" H 8675 1975 50  0001 C CNN
F 3 "" H 8675 1975 50  0001 C CNN
	1    8675 1975
	1    0    0    -1  
$EndComp
Wire Wire Line
	9425 1975 9225 1975
Wire Wire Line
	9425 2025 9425 1975
$Comp
L power:GND #PWR?
U 1 1 5E92C95C
P 9075 2175
AR Path="/5E92C95C" Ref="#PWR?"  Part="1" 
AR Path="/5E872B89/5E92C95C" Ref="#PWR099"  Part="1" 
F 0 "#PWR099" H 9075 1925 50  0001 C CNN
F 1 "GND" H 9080 2002 50  0000 C CNN
F 2 "" H 9075 2175 50  0001 C CNN
F 3 "" H 9075 2175 50  0001 C CNN
	1    9075 2175
	0    -1   -1   0   
$EndComp
$Comp
L power:GND #PWR?
U 1 1 5E92508D
P 9425 2225
AR Path="/5E92508D" Ref="#PWR?"  Part="1" 
AR Path="/5E872B89/5E92508D" Ref="#PWR0103"  Part="1" 
F 0 "#PWR0103" H 9425 1975 50  0001 C CNN
F 1 "GND" H 9430 2052 50  0000 C CNN
F 2 "" H 9425 2225 50  0001 C CNN
F 3 "" H 9425 2225 50  0001 C CNN
	1    9425 2225
	-1   0    0    -1  
$EndComp
$Comp
L Analog_ADC:INA233 U?
U 1 1 5E89352D
P 8675 2475
AR Path="/5E89352D" Ref="U?"  Part="1" 
AR Path="/5E872B89/5E89352D" Ref="U10"  Part="1" 
F 0 "U10" H 8725 2475 50  0000 R BNN
F 1 "INA233" H 8525 2575 50  0000 L BNN
F 2 "Package_SO:VSSOP-10_3x3mm_P0.5mm" H 9475 2025 50  0001 C CNN
F 3 "https://www.ti.com/lit/ds/symlink/ina233.pdf" H 9025 2375 50  0001 C CNN
	1    8675 2475
	1    0    0    -1  
$EndComp
$Comp
L Device:C_Small C?
U 1 1 5E893533
P 9425 2125
AR Path="/5E893533" Ref="C?"  Part="1" 
AR Path="/5E872B89/5E893533" Ref="C23"  Part="1" 
F 0 "C23" H 9517 2171 50  0000 L CNN
F 1 "100n" H 9517 2080 50  0000 L CNN
F 2 "Capacitor_SMD:C_0402_1005Metric" H 9425 2125 50  0001 C CNN
F 3 "~" H 9425 2125 50  0001 C CNN
	1    9425 2125
	1    0    0    1   
$EndComp
$Comp
L power:GND #PWR?
U 1 1 5E8934F9
P 8675 2975
AR Path="/5E8934F9" Ref="#PWR?"  Part="1" 
AR Path="/5E872B89/5E8934F9" Ref="#PWR0101"  Part="1" 
F 0 "#PWR0101" H 8675 2725 50  0001 C CNN
F 1 "GND" H 8680 2802 50  0000 C CNN
F 2 "" H 8675 2975 50  0001 C CNN
F 3 "" H 8675 2975 50  0001 C CNN
	1    8675 2975
	1    0    0    -1  
$EndComp
Text HLabel 9975 2475 2    50   Input ~ 0
SDA
Text HLabel 9975 2575 2    50   Input ~ 0
SCL
Wire Wire Line
	1975 2375 1975 2475
Connection ~ 1575 2575
Wire Wire Line
	1575 2575 1425 2575
Connection ~ 1975 2475
Wire Wire Line
	1975 2475 1425 2475
Text HLabel 3225 4975 0    50   Input ~ 0
~EN_S
$Comp
L LEGOS:SN74LVC1G332DRY U12
U 1 1 5F0FD5E9
P 8725 4875
F 0 "U12" H 9125 4925 50  0000 C CNN
F 1 "SN74LVC1G332DRY" H 9325 4825 50  0000 C CNN
F 2 "LEGOS:USON-6_1.5x1.0mm_P0.5mm" H 8725 4875 50  0001 C CNN
F 3 "https://www.ti.com/lit/ds/symlink/sn74lvc1g332.pdf" H 8725 4875 50  0001 C CNN
	1    8725 4875
	-1   0    0    -1  
$EndComp
Text HLabel 9025 4775 2    50   Input ~ 0
~EN_S
Wire Wire Line
	9025 4975 9125 4975
$Comp
L power:GND #PWR?
U 1 1 5F0D815E
P 4525 6025
AR Path="/5F0D815E" Ref="#PWR?"  Part="1" 
AR Path="/5E872B89/5F0D815E" Ref="#PWR0191"  Part="1" 
F 0 "#PWR0191" H 4525 5775 50  0001 C CNN
F 1 "GND" H 4530 5852 50  0000 C CNN
F 2 "" H 4525 6025 50  0001 C CNN
F 3 "" H 4525 6025 50  0001 C CNN
	1    4525 6025
	1    0    0    -1  
$EndComp
$Comp
L power:+3.3V #PWR?
U 1 1 5F0D8164
P 4525 5825
AR Path="/5F0D8164" Ref="#PWR?"  Part="1" 
AR Path="/5E872B89/5F0D8164" Ref="#PWR0192"  Part="1" 
F 0 "#PWR0192" H 4525 5675 50  0001 C CNN
F 1 "+3.3V" H 4540 5998 50  0000 C CNN
F 2 "" H 4525 5825 50  0001 C CNN
F 3 "" H 4525 5825 50  0001 C CNN
	1    4525 5825
	1    0    0    -1  
$EndComp
Wire Wire Line
	7575 3975 7425 3975
$Comp
L LEGOS:SN74LVC1G332DRY U8
U 1 1 5F0D711F
P 5325 6525
F 0 "U8" H 5725 6575 50  0000 C CNN
F 1 "SN74LVC1G332DRY" H 5925 6475 50  0000 C CNN
F 2 "LEGOS:USON-6_1.5x1.0mm_P0.5mm" H 5325 6525 50  0001 C CNN
F 3 "https://www.ti.com/lit/ds/symlink/sn74lvc1g332.pdf" H 5325 6525 50  0001 C CNN
	1    5325 6525
	1    0    0    -1  
$EndComp
$Comp
L power:GND #PWR?
U 1 1 5F0DAA0A
P 4875 6425
AR Path="/5F0DAA0A" Ref="#PWR?"  Part="1" 
AR Path="/5E872B89/5F0DAA0A" Ref="#PWR0195"  Part="1" 
F 0 "#PWR0195" H 4875 6175 50  0001 C CNN
F 1 "GND" V 4875 6225 50  0000 C CNN
F 2 "" H 4875 6425 50  0001 C CNN
F 3 "" H 4875 6425 50  0001 C CNN
	1    4875 6425
	0    1    1    0   
$EndComp
Wire Wire Line
	5025 6625 4775 6625
Connection ~ 9225 1975
Wire Wire Line
	9075 2475 9975 2475
Wire Wire Line
	8675 1975 9225 1975
Wire Wire Line
	9075 2575 9975 2575
Wire Wire Line
	9075 2775 9875 2775
Wire Wire Line
	2825 1975 3575 1975
Connection ~ 3575 1975
Wire Wire Line
	1975 2475 3175 2475
Wire Wire Line
	1575 2575 3175 2575
Wire Wire Line
	2375 2775 3175 2775
Wire Wire Line
	3975 2175 4825 2175
Wire Wire Line
	4825 2175 4825 3975
Connection ~ 4825 3975
Wire Wire Line
	4825 3975 4675 3975
Wire Wire Line
	8275 2175 7425 2175
Wire Wire Line
	7425 2175 7425 3975
Connection ~ 7425 3975
Wire Wire Line
	4075 2675 3975 2675
Wire Wire Line
	4275 2575 3975 2575
Wire Wire Line
	8175 2675 8275 2675
Wire Wire Line
	7975 2575 8275 2575
Wire Wire Line
	3125 4775 3225 4775
Wire Wire Line
	4075 2675 4075 3975
Wire Wire Line
	3625 3975 3675 3975
Connection ~ 4075 3975
Wire Wire Line
	4275 2575 4275 3975
Connection ~ 4275 3975
Wire Wire Line
	8175 2675 8175 3975
Connection ~ 8175 3975
Wire Wire Line
	7975 2575 7975 3975
Connection ~ 7975 3975
$Comp
L Device:R_Small R68
U 1 1 5F264E5F
P 8075 3975
F 0 "R68" V 7975 3975 50  0000 C CNN
F 1 "10m" V 8175 3975 50  0000 C CNN
F 2 "Resistor_SMD:R_0805_2012Metric" H 8075 3975 50  0001 C CNN
F 3 "https://eu.mouser.com/datasheet/2/315/AOA0000C313-1141758.pdf" H 8075 3975 50  0001 C CNN
F 4 "ERJ-6CWDR010V" V 8075 3975 50  0001 C CNN "Mfr"
	1    8075 3975
	0    1    1    0   
$EndComp
$Comp
L Device:R_Small R67
U 1 1 5F2635BC
P 4175 3975
F 0 "R67" V 4075 3975 50  0000 C CNN
F 1 "10m" V 4275 3975 50  0000 C CNN
F 2 "Resistor_SMD:R_0805_2012Metric" H 4175 3975 50  0001 C CNN
F 3 "https://eu.mouser.com/datasheet/2/315/AOA0000C313-1141758.pdf" H 4175 3975 50  0001 C CNN
F 4 "ERJ-6CWDR010V" V 4175 3975 50  0001 C CNN "Mfr"
	1    4175 3975
	0    1    1    0   
$EndComp
Connection ~ 5975 3975
Wire Wire Line
	5975 3975 4825 3975
Wire Wire Line
	5975 3975 6775 3975
$Comp
L Device:R_Small R69
U 1 1 5F2D9C30
P 6775 4525
F 0 "R69" H 6834 4571 50  0000 L CNN
F 1 "4.7k" H 6834 4480 50  0000 L CNN
F 2 "Resistor_SMD:R_0402_1005Metric" H 6775 4525 50  0001 C CNN
F 3 "~" H 6775 4525 50  0001 C CNN
	1    6775 4525
	1    0    0    -1  
$EndComp
Wire Wire Line
	6775 4425 6775 3975
Connection ~ 6775 3975
Wire Wire Line
	6775 3975 7425 3975
$Comp
L power:GND #PWR?
U 1 1 5F2DC49E
P 6775 4875
AR Path="/5F2DC49E" Ref="#PWR?"  Part="1" 
AR Path="/5E872B89/5F2DC49E" Ref="#PWR0198"  Part="1" 
F 0 "#PWR0198" H 6775 4625 50  0001 C CNN
F 1 "GND" H 6780 4702 50  0000 C CNN
F 2 "" H 6775 4875 50  0001 C CNN
F 3 "" H 6775 4875 50  0001 C CNN
	1    6775 4875
	1    0    0    -1  
$EndComp
Wire Wire Line
	6775 4625 6775 4875
$Comp
L LEGOS:DMP2005UFG U17
U 1 1 5F29E2D0
P 3875 4075
F 0 "U17" V 4217 4075 50  0000 C CNN
F 1 "DMP2005UFG" V 4125 4175 50  0000 C CNN
F 2 "LEGOS:Diodes_PowerDI3333-8" H 4075 4175 50  0001 C CNN
F 3 "https://www.diodes.com/assets/Datasheets/DMP2005UFG.pdf" H 3875 4075 50  0001 C CNN
	1    3875 4075
	0    -1   -1   0   
$EndComp
Wire Wire Line
	3875 4275 4475 4275
Connection ~ 4475 4275
Wire Wire Line
	4475 4275 4475 4875
$Comp
L LEGOS:DMP2005UFG U18
U 1 1 5F2B4E46
P 8375 4075
F 0 "U18" V 8717 4075 50  0000 C CNN
F 1 "DMP2005UFG" V 8625 4150 50  0000 C CNN
F 2 "LEGOS:Diodes_PowerDI3333-8" H 8575 4175 50  0001 C CNN
F 3 "https://www.diodes.com/assets/Datasheets/DMP2005UFG.pdf" H 8375 4075 50  0001 C CNN
	1    8375 4075
	0    1    -1   0   
$EndComp
Wire Wire Line
	8575 3975 8625 3975
Wire Wire Line
	8375 4275 7775 4275
Connection ~ 7775 4275
$Comp
L LEGOS:AH1390 U6
U 1 1 5F407D1B
P 3575 6275
F 0 "U6" H 3575 6742 50  0000 C CNN
F 1 "AH1390" H 3575 6651 50  0000 C CNN
F 2 "LEGOS:Diodes_X2-DFN1410-4_1.4x1mm_P0.5mm" H 3550 6275 50  0001 C CNN
F 3 "https://www.diodes.com/assets/Datasheets/AH1390.pdf" H 3550 6275 50  0001 C CNN
	1    3575 6275
	1    0    0    -1  
$EndComp
Connection ~ 3275 6075
Connection ~ 3275 6475
$Comp
L power:+3.3V #PWR?
U 1 1 5F4173B5
P 4525 6525
AR Path="/5F4173B5" Ref="#PWR?"  Part="1" 
AR Path="/5E872B89/5F4173B5" Ref="#PWR0106"  Part="1" 
F 0 "#PWR0106" H 4525 6375 50  0001 C CNN
F 1 "+3.3V" H 4540 6698 50  0000 C CNN
F 2 "" H 4525 6525 50  0001 C CNN
F 3 "" H 4525 6525 50  0001 C CNN
	1    4525 6525
	1    0    0    -1  
$EndComp
$Comp
L power:GND #PWR?
U 1 1 5F4177CB
P 4525 6725
AR Path="/5F4177CB" Ref="#PWR?"  Part="1" 
AR Path="/5E872B89/5F4177CB" Ref="#PWR0107"  Part="1" 
F 0 "#PWR0107" H 4525 6475 50  0001 C CNN
F 1 "GND" H 4530 6552 50  0000 C CNN
F 2 "" H 4525 6725 50  0001 C CNN
F 3 "" H 4525 6725 50  0001 C CNN
	1    4525 6725
	1    0    0    -1  
$EndComp
Wire Wire Line
	3875 6075 3875 5925
Wire Wire Line
	3875 6475 3875 6625
Wire Wire Line
	3875 6625 4225 6625
Wire Wire Line
	4875 5925 4775 5925
Text Label 4875 5925 0    39   ~ 0
~EN_F
Text Label 3125 4775 2    39   ~ 0
~EN_F
Text Label 9125 4975 0    39   ~ 0
~EN_F
$Comp
L LEGOS:74LVC2G04GM U11
U 2 1 5F416D07
P 4525 6625
F 0 "U11" H 4025 6875 50  0000 C CNN
F 1 "74LVC2G04GM" H 4175 6775 50  0000 C CNN
F 2 "Package_TO_SOT_SMD:SOT-886" H 4525 6625 50  0001 C CNN
F 3 "https://eu.mouser.com/datasheet/2/916/74LVC2G04-1598268.pdf" H 4525 6625 50  0001 C CNN
	2    4525 6625
	1    0    0    -1  
$EndComp
$Comp
L LEGOS:74LVC2G04GM U11
U 1 1 5F41171C
P 4525 5925
F 0 "U11" H 4025 6175 50  0000 C CNN
F 1 "74LVC2G04GM" H 4175 6075 50  0000 C CNN
F 2 "Package_TO_SOT_SMD:SOT-886" H 4525 5925 50  0001 C CNN
F 3 "https://eu.mouser.com/datasheet/2/916/74LVC2G04-1598268.pdf" H 4525 5925 50  0001 C CNN
	1    4525 5925
	1    0    0    -1  
$EndComp
Wire Wire Line
	5625 6525 5675 6525
Wire Wire Line
	5975 4725 5975 4875
Wire Wire Line
	5975 3975 5975 4325
Wire Wire Line
	5675 4525 5675 6525
Wire Wire Line
	4875 6425 5025 6425
$Comp
L LEGOS:SN74LVC1G332DRY U4
U 1 1 5F0F993E
P 3525 4875
F 0 "U4" H 3869 4921 50  0000 L CNN
F 1 "SN74LVC1G332DRY" H 3869 4830 50  0000 L CNN
F 2 "LEGOS:USON-6_1.5x1.0mm_P0.5mm" H 3525 4875 50  0001 C CNN
F 3 "https://www.ti.com/lit/ds/symlink/sn74lvc1g332.pdf" H 3525 4875 50  0001 C CNN
	1    3525 4875
	1    0    0    -1  
$EndComp
$EndSCHEMATC
