EESchema Schematic File Version 4
EELAYER 30 0
EELAYER END
$Descr A4 11693 8268
encoding utf-8
Sheet 7 8
Title "Solar Tracker"
Date "2020-10-09"
Rev "1.1"
Comp "Institute for Automation of Complex Power Systems - E.ON ERC - RWTH Aachen University"
Comment1 "Designer: D. Wienands, S. Melcher, L. Jeske, D. Moll"
Comment2 "Supervisor: C. Guarnieri Calò Carducci"
Comment3 ""
Comment4 ""
$EndDescr
$Comp
L Motor:Motor_Servo M?
U 1 1 5F428139
P 4300 2500
AR Path="/5F428139" Ref="M?"  Part="1" 
AR Path="/5F0C6676/5F428139" Ref="M?"  Part="1" 
AR Path="/5F47F17B/5F428139" Ref="M1"  Part="1" 
F 0 "M1" H 4632 2565 50  0000 L CNN
F 1 "SG51R" H 4632 2474 50  0000 L CNN
F 2 "LEGOS:SG51R_vertical" H 4300 2310 50  0001 C CNN
F 3 "https://www.adafruit.com/product/2201" H 4300 2310 50  0001 C CNN
	1    4300 2500
	1    0    0    -1  
$EndComp
$Comp
L power:GND #PWR?
U 1 1 5F42813F
P 4000 2600
AR Path="/5F42813F" Ref="#PWR?"  Part="1" 
AR Path="/5F0C6676/5F42813F" Ref="#PWR?"  Part="1" 
AR Path="/5F47F17B/5F42813F" Ref="#PWR054"  Part="1" 
F 0 "#PWR054" H 4000 2350 50  0001 C CNN
F 1 "GND" H 4005 2427 39  0000 C CNN
F 2 "" H 4000 2600 50  0001 C CNN
F 3 "" H 4000 2600 50  0001 C CNN
	1    4000 2600
	1    0    0    -1  
$EndComp
$Comp
L Device:Q_NMOS_GSD Q?
U 1 1 5F428145
P 3200 2300
AR Path="/5F0DB548/5F428145" Ref="Q?"  Part="1" 
AR Path="/5F428145" Ref="Q?"  Part="1" 
AR Path="/5F0C6676/5F428145" Ref="Q?"  Part="1" 
AR Path="/5F47F17B/5F428145" Ref="Q6"  Part="1" 
F 0 "Q6" V 3450 2350 39  0000 L CNN
F 1 "Si2302CDS" V 3550 2350 39  0000 L CNN
F 2 "Package_TO_SOT_SMD:SOT-23" H 3400 2400 50  0001 C CNN
F 3 "https://eu.mouser.com/datasheet/2/427/si2302cds-1764899.pdf" H 3200 2300 50  0001 C CNN
	1    3200 2300
	0    1    1    0   
$EndComp
$Comp
L Device:R_Small R?
U 1 1 5F42814B
P 2850 2200
AR Path="/5F42814B" Ref="R?"  Part="1" 
AR Path="/5F0C6676/5F42814B" Ref="R?"  Part="1" 
AR Path="/5F47F17B/5F42814B" Ref="R18"  Part="1" 
F 0 "R18" H 2900 2150 39  0000 L CNN
F 1 "10k" H 2900 2200 39  0000 L CNN
F 2 "Resistor_SMD:R_0603_1608Metric" H 2850 2200 50  0001 C CNN
F 3 "~" H 2850 2200 50  0001 C CNN
	1    2850 2200
	-1   0    0    1   
$EndComp
$Comp
L Device:R_Small R?
U 1 1 5F428151
P 3550 2200
AR Path="/5F428151" Ref="R?"  Part="1" 
AR Path="/5F0C6676/5F428151" Ref="R?"  Part="1" 
AR Path="/5F47F17B/5F428151" Ref="R19"  Part="1" 
F 0 "R19" H 3600 2150 39  0000 L CNN
F 1 "1k" H 3600 2200 39  0000 L CNN
F 2 "Resistor_SMD:R_0603_1608Metric" H 3550 2200 50  0001 C CNN
F 3 "~" H 3550 2200 50  0001 C CNN
	1    3550 2200
	-1   0    0    1   
$EndComp
Wire Wire Line
	2850 2300 2850 2400
Wire Wire Line
	2850 2400 3000 2400
Wire Wire Line
	3400 2400 3550 2400
Wire Wire Line
	3550 2400 3550 2300
Wire Wire Line
	3200 2000 2850 2000
Wire Wire Line
	2850 2000 2850 2100
Wire Wire Line
	3200 2000 3200 2100
Wire Wire Line
	3550 2000 3550 2100
$Comp
L power:+5V #PWR?
U 1 1 5F42815F
P 3550 2000
AR Path="/5F0DB548/5F42815F" Ref="#PWR?"  Part="1" 
AR Path="/5F42815F" Ref="#PWR?"  Part="1" 
AR Path="/5F0C6676/5F42815F" Ref="#PWR?"  Part="1" 
AR Path="/5F47F17B/5F42815F" Ref="#PWR052"  Part="1" 
F 0 "#PWR052" H 3550 1850 50  0001 C CNN
F 1 "+5V" H 3550 2173 39  0000 C CNN
F 2 "" H 3550 2000 50  0001 C CNN
F 3 "" H 3550 2000 50  0001 C CNN
	1    3550 2000
	1    0    0    -1  
$EndComp
$Comp
L power:+3.3V #PWR?
U 1 1 5F428165
P 2850 2000
AR Path="/5F428165" Ref="#PWR?"  Part="1" 
AR Path="/5F0C6676/5F428165" Ref="#PWR?"  Part="1" 
AR Path="/5F47F17B/5F428165" Ref="#PWR051"  Part="1" 
F 0 "#PWR051" H 2850 1850 50  0001 C CNN
F 1 "+3.3V" H 2865 2173 39  0000 C CNN
F 2 "" H 2850 2000 50  0001 C CNN
F 3 "" H 2850 2000 50  0001 C CNN
	1    2850 2000
	1    0    0    -1  
$EndComp
Connection ~ 2850 2000
Wire Wire Line
	4000 2400 3550 2400
Connection ~ 3550 2400
Wire Wire Line
	4000 2500 3850 2500
Wire Wire Line
	3850 2500 3850 2000
$Comp
L power:+5V #PWR?
U 1 1 5F428170
P 3850 2000
AR Path="/5F0DB548/5F428170" Ref="#PWR?"  Part="1" 
AR Path="/5F428170" Ref="#PWR?"  Part="1" 
AR Path="/5F0C6676/5F428170" Ref="#PWR?"  Part="1" 
AR Path="/5F47F17B/5F428170" Ref="#PWR053"  Part="1" 
F 0 "#PWR053" H 3850 1850 50  0001 C CNN
F 1 "+5V" H 3850 2173 39  0000 C CNN
F 2 "" H 3850 2000 50  0001 C CNN
F 3 "" H 3850 2000 50  0001 C CNN
	1    3850 2000
	1    0    0    -1  
$EndComp
Wire Wire Line
	2700 2400 2850 2400
Connection ~ 2850 2400
Text HLabel 2700 2400 0    39   Input ~ 0
SERVO
$Comp
L LEGOS:TSL23X U6
U 1 1 5F461ED7
P 6600 2250
F 0 "U6" H 6322 2288 39  0000 R CNN
F 1 "TSL235R-LF" H 6322 2213 39  0000 R CNN
F 2 "LEGOS:TO-92S_Wide" H 6600 2250 50  0001 C CNN
F 3 "https://ams.com/documents/20143/36005/TSL235R_DS000120_3-00.pdf" H 6600 2250 50  0001 C CNN
	1    6600 2250
	1    0    0    -1  
$EndComp
$Comp
L LEGOS:TSL23X U7
U 1 1 5F462D2A
P 6600 3250
F 0 "U7" H 6322 3288 39  0000 R CNN
F 1 "TSL235R-LF" H 6322 3213 39  0000 R CNN
F 2 "LEGOS:TO-92S_Wide" H 6600 3250 50  0001 C CNN
F 3 "https://ams.com/documents/20143/36005/TSL235R_DS000120_3-00.pdf" H 6600 3250 50  0001 C CNN
	1    6600 3250
	1    0    0    -1  
$EndComp
$Comp
L power:+3.3V #PWR?
U 1 1 5F46349A
P 6500 2000
AR Path="/5F46349A" Ref="#PWR?"  Part="1" 
AR Path="/5F47F17B/5F46349A" Ref="#PWR057"  Part="1" 
F 0 "#PWR057" H 6500 1850 50  0001 C CNN
F 1 "+3.3V" H 6515 2165 39  0000 C CNN
F 2 "" H 6500 2000 50  0001 C CNN
F 3 "" H 6500 2000 50  0001 C CNN
	1    6500 2000
	1    0    0    -1  
$EndComp
$Comp
L Device:C_Small C?
U 1 1 5F46540D
P 5850 2250
AR Path="/5EF40FCD/5F46540D" Ref="C?"  Part="1" 
AR Path="/5F46540D" Ref="C?"  Part="1" 
AR Path="/5F47F17B/5F46540D" Ref="C11"  Part="1" 
F 0 "C11" H 5800 2200 39  0000 R CNN
F 1 "100n" H 5850 2300 39  0000 R CNN
F 2 "Capacitor_SMD:C_0603_1608Metric" H 5850 2250 50  0001 C CNN
F 3 "~" H 5850 2250 50  0001 C CNN
	1    5850 2250
	1    0    0    1   
$EndComp
Wire Wire Line
	6500 2000 5850 2000
Wire Wire Line
	5850 2000 5850 2150
Connection ~ 6500 2000
Wire Wire Line
	6500 2500 5850 2500
Wire Wire Line
	5850 2500 5850 2350
$Comp
L Device:C_Small C?
U 1 1 5F46743B
P 5850 3250
AR Path="/5EF40FCD/5F46743B" Ref="C?"  Part="1" 
AR Path="/5F46743B" Ref="C?"  Part="1" 
AR Path="/5F47F17B/5F46743B" Ref="C12"  Part="1" 
F 0 "C12" H 5800 3200 39  0000 R CNN
F 1 "100n" H 5850 3300 39  0000 R CNN
F 2 "Capacitor_SMD:C_0603_1608Metric" H 5850 3250 50  0001 C CNN
F 3 "~" H 5850 3250 50  0001 C CNN
	1    5850 3250
	1    0    0    1   
$EndComp
Wire Wire Line
	6500 3000 5850 3000
Wire Wire Line
	5850 3000 5850 3150
Wire Wire Line
	6500 3500 5850 3500
Wire Wire Line
	5850 3500 5850 3350
$Comp
L power:+3.3V #PWR?
U 1 1 5F467B85
P 6500 3000
AR Path="/5F467B85" Ref="#PWR?"  Part="1" 
AR Path="/5F47F17B/5F467B85" Ref="#PWR059"  Part="1" 
F 0 "#PWR059" H 6500 2850 50  0001 C CNN
F 1 "+3.3V" H 6515 3165 39  0000 C CNN
F 2 "" H 6500 3000 50  0001 C CNN
F 3 "" H 6500 3000 50  0001 C CNN
	1    6500 3000
	1    0    0    -1  
$EndComp
Connection ~ 6500 3000
$Comp
L power:GND #PWR?
U 1 1 5F4684EA
P 6500 2500
AR Path="/5F4684EA" Ref="#PWR?"  Part="1" 
AR Path="/5F0C6676/5F4684EA" Ref="#PWR?"  Part="1" 
AR Path="/5F47F17B/5F4684EA" Ref="#PWR058"  Part="1" 
F 0 "#PWR058" H 6500 2250 50  0001 C CNN
F 1 "GND" H 6505 2327 39  0000 C CNN
F 2 "" H 6500 2500 50  0001 C CNN
F 3 "" H 6500 2500 50  0001 C CNN
	1    6500 2500
	1    0    0    -1  
$EndComp
Connection ~ 6500 2500
$Comp
L power:GND #PWR?
U 1 1 5F468AC1
P 6500 3500
AR Path="/5F468AC1" Ref="#PWR?"  Part="1" 
AR Path="/5F0C6676/5F468AC1" Ref="#PWR?"  Part="1" 
AR Path="/5F47F17B/5F468AC1" Ref="#PWR060"  Part="1" 
F 0 "#PWR060" H 6500 3250 50  0001 C CNN
F 1 "GND" H 6505 3327 39  0000 C CNN
F 2 "" H 6500 3500 50  0001 C CNN
F 3 "" H 6500 3500 50  0001 C CNN
	1    6500 3500
	1    0    0    -1  
$EndComp
Connection ~ 6500 3500
Text HLabel 7100 1600 2    39   Input ~ 0
LIGHT_R
Text HLabel 7100 3900 2    39   Input ~ 0
LIGHT_L
$Comp
L Device:Solar_Cell SC1
U 1 1 5F46EFF4
P 2500 4800
F 0 "SC1" H 2608 4888 39  0000 L CNN
F 1 "AM-1819CA" H 2608 4813 39  0000 L CNN
F 2 "Connector_PinSocket_2.54mm:PinSocket_1x02_P2.54mm_Vertical_SMD_Pin1Left" V 2500 4860 50  0001 C CNN
F 3 "https://www.mouser.de/datasheet/2/315/panasonic_AM-1819CA-1196921.pdf" V 2500 4860 50  0001 C CNN
F 4 "SSM-102-L-SV-BE" H 2500 4800 50  0001 C CNN "Mfr"
	1    2500 4800
	-1   0    0    1   
$EndComp
Text Notes 3950 2925 0    39   ~ 0
http://www.towerpro.com.tw/product/sg51r/
$Comp
L Amplifier_Operational:LM321 U8
U 1 1 5F6E97EA
P 3575 4750
F 0 "U8" H 3575 4500 39  0000 C CNN
F 1 "LM321LV" H 3650 4575 39  0000 C CNN
F 2 "Package_TO_SOT_SMD:SOT-23-5" H 3575 4750 50  0001 C CNN
F 3 "http://www.ti.com/lit/ds/symlink/lm321.pdf" H 3575 4750 50  0001 C CNN
	1    3575 4750
	1    0    0    1   
$EndComp
Wire Wire Line
	3275 4650 2925 4650
Wire Wire Line
	2500 4650 2500 4700
Wire Wire Line
	2925 4700 2925 4650
Wire Wire Line
	2925 4650 2500 4650
Wire Wire Line
	3275 4850 3275 5000
$Comp
L Device:C_Small C?
U 1 1 5F6EDE59
P 3475 5200
AR Path="/5EF40FCD/5F6EDE59" Ref="C?"  Part="1" 
AR Path="/5F6EDE59" Ref="C?"  Part="1" 
AR Path="/5F47F17B/5F6EDE59" Ref="C13"  Part="1" 
F 0 "C13" H 3425 5150 39  0000 R CNN
F 1 "100n" H 3475 5250 39  0000 R CNN
F 2 "Capacitor_SMD:C_0603_1608Metric" H 3475 5200 50  0001 C CNN
F 3 "~" H 3475 5200 50  0001 C CNN
	1    3475 5200
	-1   0    0    1   
$EndComp
Wire Wire Line
	3475 5050 3475 5075
$Comp
L power:GND #PWR?
U 1 1 5F6EF1DC
P 3475 5350
AR Path="/5F6EF1DC" Ref="#PWR?"  Part="1" 
AR Path="/5F0C6676/5F6EF1DC" Ref="#PWR?"  Part="1" 
AR Path="/5F47F17B/5F6EF1DC" Ref="#PWR0105"  Part="1" 
F 0 "#PWR0105" H 3475 5100 50  0001 C CNN
F 1 "GND" H 3480 5177 39  0000 C CNN
F 2 "" H 3475 5350 50  0001 C CNN
F 3 "" H 3475 5350 50  0001 C CNN
	1    3475 5350
	1    0    0    -1  
$EndComp
Wire Wire Line
	3475 5300 3475 5350
$Comp
L power:GND #PWR?
U 1 1 5F6F1656
P 3475 4450
AR Path="/5F6F1656" Ref="#PWR?"  Part="1" 
AR Path="/5F0C6676/5F6F1656" Ref="#PWR?"  Part="1" 
AR Path="/5F47F17B/5F6F1656" Ref="#PWR0106"  Part="1" 
F 0 "#PWR0106" H 3475 4200 50  0001 C CNN
F 1 "GND" H 3480 4277 39  0000 C CNN
F 2 "" H 3475 4450 50  0001 C CNN
F 3 "" H 3475 4450 50  0001 C CNN
	1    3475 4450
	-1   0    0    1   
$EndComp
$Comp
L Device:R_Small R?
U 1 1 5F6F33D4
P 4075 4550
AR Path="/5F6F33D4" Ref="R?"  Part="1" 
AR Path="/5F0C6676/5F6F33D4" Ref="R?"  Part="1" 
AR Path="/5F47F17B/5F6F33D4" Ref="R20"  Part="1" 
F 0 "R20" H 4125 4500 39  0000 L CNN
F 1 "220k" H 4125 4550 39  0000 L CNN
F 2 "Resistor_SMD:R_0603_1608Metric" H 4075 4550 50  0001 C CNN
F 3 "~" H 4075 4550 50  0001 C CNN
	1    4075 4550
	-1   0    0    1   
$EndComp
Wire Wire Line
	4075 4325 4075 4450
Wire Wire Line
	2925 4325 4075 4325
Wire Wire Line
	3875 4750 4075 4750
Wire Wire Line
	4075 4750 4075 4650
$Comp
L Device:R_Small R?
U 1 1 5F6F4B33
P 4075 4950
AR Path="/5F6F4B33" Ref="R?"  Part="1" 
AR Path="/5F0C6676/5F6F4B33" Ref="R?"  Part="1" 
AR Path="/5F47F17B/5F6F4B33" Ref="R21"  Part="1" 
F 0 "R21" H 4125 4900 39  0000 L CNN
F 1 "1k" H 4125 4950 39  0000 L CNN
F 2 "Resistor_SMD:R_0603_1608Metric" H 4075 4950 50  0001 C CNN
F 3 "~" H 4075 4950 50  0001 C CNN
	1    4075 4950
	-1   0    0    1   
$EndComp
Wire Wire Line
	4075 4750 4075 4850
Connection ~ 4075 4750
$Comp
L power:GND #PWR?
U 1 1 5F6F57EF
P 4075 5125
AR Path="/5F6F57EF" Ref="#PWR?"  Part="1" 
AR Path="/5F0C6676/5F6F57EF" Ref="#PWR?"  Part="1" 
AR Path="/5F47F17B/5F6F57EF" Ref="#PWR0107"  Part="1" 
F 0 "#PWR0107" H 4075 4875 50  0001 C CNN
F 1 "GND" H 4080 4952 39  0000 C CNN
F 2 "" H 4075 5125 50  0001 C CNN
F 3 "" H 4075 5125 50  0001 C CNN
	1    4075 5125
	1    0    0    -1  
$EndComp
Wire Wire Line
	4075 5050 4075 5125
$Comp
L Device:C_Small C?
U 1 1 5F6F6BB7
P 4325 4550
AR Path="/5EF40FCD/5F6F6BB7" Ref="C?"  Part="1" 
AR Path="/5F6F6BB7" Ref="C?"  Part="1" 
AR Path="/5F47F17B/5F6F6BB7" Ref="C14"  Part="1" 
F 0 "C14" H 4275 4500 39  0000 R CNN
F 1 "1n" H 4325 4600 39  0000 R CNN
F 2 "Capacitor_SMD:C_0603_1608Metric" H 4325 4550 50  0001 C CNN
F 3 "~" H 4325 4550 50  0001 C CNN
	1    4325 4550
	1    0    0    1   
$EndComp
Connection ~ 4075 4325
Wire Wire Line
	4325 4325 4325 4450
Wire Wire Line
	4075 4325 4325 4325
Wire Wire Line
	4075 4750 4325 4750
Wire Wire Line
	4325 4750 4325 4650
Wire Wire Line
	4400 4750 4325 4750
Connection ~ 4325 4750
$Comp
L power:+3.3V #PWR?
U 1 1 5F6FCD9B
P 3675 5075
AR Path="/5F6FCD9B" Ref="#PWR?"  Part="1" 
AR Path="/5F0C6676/5F6FCD9B" Ref="#PWR?"  Part="1" 
AR Path="/5F47F17B/5F6FCD9B" Ref="#PWR0108"  Part="1" 
F 0 "#PWR0108" H 3675 4925 50  0001 C CNN
F 1 "+3.3V" H 3690 5248 39  0000 C CNN
F 2 "" H 3675 5075 50  0001 C CNN
F 3 "" H 3675 5075 50  0001 C CNN
	1    3675 5075
	1    0    0    -1  
$EndComp
Wire Wire Line
	3675 5075 3475 5075
Connection ~ 3475 5075
Wire Wire Line
	3475 5075 3475 5100
Text HLabel 4400 4750 2    39   Input ~ 0
LIGHT
$Comp
L Motor:Motor_Servo M?
U 1 1 5F69E728
P 4300 3150
AR Path="/5F69E728" Ref="M?"  Part="1" 
AR Path="/5F0C6676/5F69E728" Ref="M?"  Part="1" 
AR Path="/5F47F17B/5F69E728" Ref="M2"  Part="1" 
F 0 "M2" H 4632 3215 50  0000 L CNN
F 1 "SG51R" H 4632 3124 50  0000 L CNN
F 2 "LEGOS:SG51R_vertical" H 4300 2960 50  0001 C CNN
F 3 "https://www.adafruit.com/product/2201" H 4300 2960 50  0001 C CNN
	1    4300 3150
	1    0    0    -1  
$EndComp
$Comp
L power:GND #PWR?
U 1 1 5F69FD9F
P 4000 3250
AR Path="/5F69FD9F" Ref="#PWR?"  Part="1" 
AR Path="/5F0C6676/5F69FD9F" Ref="#PWR?"  Part="1" 
AR Path="/5F47F17B/5F69FD9F" Ref="#PWR0109"  Part="1" 
F 0 "#PWR0109" H 4000 3000 50  0001 C CNN
F 1 "GND" H 4005 3077 39  0000 C CNN
F 2 "" H 4000 3250 50  0001 C CNN
F 3 "" H 4000 3250 50  0001 C CNN
	1    4000 3250
	1    0    0    -1  
$EndComp
Wire Wire Line
	3850 2500 3850 3150
Wire Wire Line
	3850 3150 4000 3150
Connection ~ 3850 2500
Wire Wire Line
	3550 2400 3550 3050
Wire Wire Line
	3550 3050 4000 3050
Connection ~ 2925 4650
Wire Wire Line
	2925 4325 2925 4650
$Comp
L Device:Solar_Cell SC2
U 1 1 5F6D69FE
P 2925 4800
F 0 "SC2" H 3033 4888 39  0000 L CNN
F 1 "AM-1819CA" H 3033 4813 39  0001 L CNN
F 2 "Connector_PinSocket_2.54mm:PinSocket_1x02_P2.54mm_Vertical_SMD_Pin1Left" V 2925 4860 50  0001 C CNN
F 3 "https://www.mouser.de/datasheet/2/315/panasonic_AM-1819CA-1196921.pdf" V 2925 4860 50  0001 C CNN
F 4 "SSM-102-L-SV-BE" H 2925 4800 50  0001 C CNN "Mfr"
	1    2925 4800
	-1   0    0    1   
$EndComp
Text Notes 2300 4975 0    39   ~ 0
3x
Text Notes 2750 4975 0    39   ~ 0
3x
Wire Wire Line
	3275 5000 2925 5000
Connection ~ 2925 5000
Wire Wire Line
	2925 5000 2500 5000
$Comp
L power:GND #PWR?
U 1 1 5F724B66
P 2500 5150
AR Path="/5F724B66" Ref="#PWR?"  Part="1" 
AR Path="/5F0C6676/5F724B66" Ref="#PWR?"  Part="1" 
AR Path="/5F47F17B/5F724B66" Ref="#PWR0101"  Part="1" 
F 0 "#PWR0101" H 2500 4900 50  0001 C CNN
F 1 "GND" H 2505 4977 39  0000 C CNN
F 2 "" H 2500 5150 50  0001 C CNN
F 3 "" H 2500 5150 50  0001 C CNN
	1    2500 5150
	1    0    0    -1  
$EndComp
Wire Bus Line
	2500 5000 2500 5025
Wire Bus Line
	2500 5050 2500 5075
Wire Bus Line
	2500 5100 2500 5125
$Comp
L Device:R_Small R?
U 1 1 5F80F2B4
P 7175 2250
AR Path="/5F80F2B4" Ref="R?"  Part="1" 
AR Path="/5F0C6676/5F80F2B4" Ref="R?"  Part="1" 
AR Path="/5F47F17B/5F80F2B4" Ref="R22"  Part="1" 
F 0 "R22" V 7050 2200 39  0000 L CNN
F 1 "100k" V 7100 2200 39  0000 L CNN
F 2 "Resistor_SMD:R_0603_1608Metric" H 7175 2250 50  0001 C CNN
F 3 "~" H 7175 2250 50  0001 C CNN
	1    7175 2250
	0    1    1    0   
$EndComp
Wire Wire Line
	6950 2250 7025 2250
$Comp
L Device:C_Small C?
U 1 1 5F80F2BB
P 7375 2475
AR Path="/5EF40FCD/5F80F2BB" Ref="C?"  Part="1" 
AR Path="/5F80F2BB" Ref="C?"  Part="1" 
AR Path="/5F47F17B/5F80F2BB" Ref="C15"  Part="1" 
F 0 "C15" H 7325 2425 39  0000 R CNN
F 1 "1u" H 7375 2525 39  0000 R CNN
F 2 "Capacitor_SMD:C_0603_1608Metric" H 7375 2475 50  0001 C CNN
F 3 "~" H 7375 2475 50  0001 C CNN
	1    7375 2475
	1    0    0    1   
$EndComp
Wire Wire Line
	7375 2250 7375 2375
Wire Wire Line
	7375 2250 7275 2250
Wire Wire Line
	7550 2250 7375 2250
Connection ~ 7375 2250
$Comp
L Device:R_Small R?
U 1 1 5F81B4EE
P 7175 3250
AR Path="/5F81B4EE" Ref="R?"  Part="1" 
AR Path="/5F0C6676/5F81B4EE" Ref="R?"  Part="1" 
AR Path="/5F47F17B/5F81B4EE" Ref="R23"  Part="1" 
F 0 "R23" V 7050 3200 39  0000 L CNN
F 1 "100k" V 7100 3200 39  0000 L CNN
F 2 "Resistor_SMD:R_0603_1608Metric" H 7175 3250 50  0001 C CNN
F 3 "~" H 7175 3250 50  0001 C CNN
	1    7175 3250
	0    1    1    0   
$EndComp
Wire Wire Line
	6950 3250 7025 3250
$Comp
L Device:C_Small C?
U 1 1 5F81B4F5
P 7375 3025
AR Path="/5EF40FCD/5F81B4F5" Ref="C?"  Part="1" 
AR Path="/5F81B4F5" Ref="C?"  Part="1" 
AR Path="/5F47F17B/5F81B4F5" Ref="C16"  Part="1" 
F 0 "C16" H 7325 2975 39  0000 R CNN
F 1 "1u" H 7375 3075 39  0000 R CNN
F 2 "Capacitor_SMD:C_0603_1608Metric" H 7375 3025 50  0001 C CNN
F 3 "~" H 7375 3025 50  0001 C CNN
	1    7375 3025
	-1   0    0    -1  
$EndComp
Wire Wire Line
	7375 3250 7375 3125
Wire Wire Line
	7375 3250 7275 3250
$Comp
L power:GND #PWR?
U 1 1 5F81B4FE
P 7375 2750
AR Path="/5F81B4FE" Ref="#PWR?"  Part="1" 
AR Path="/5F0C6676/5F81B4FE" Ref="#PWR?"  Part="1" 
AR Path="/5F47F17B/5F81B4FE" Ref="#PWR0103"  Part="1" 
F 0 "#PWR0103" H 7375 2500 50  0001 C CNN
F 1 "GND" H 7380 2577 39  0000 C CNN
F 2 "" H 7375 2750 50  0001 C CNN
F 3 "" H 7375 2750 50  0001 C CNN
	1    7375 2750
	0    1    1    0   
$EndComp
Wire Wire Line
	7550 3250 7375 3250
Connection ~ 7375 3250
$Comp
L LEGOS:TLV1805 U9
U 1 1 5F81FF44
P 8400 2750
F 0 "U9" H 8944 2788 39  0000 L CNN
F 1 "TLV1805" H 8944 2713 39  0000 L CNN
F 2 "Package_TO_SOT_SMD:SOT-23-6" H 8400 2350 50  0001 C CNN
F 3 "https://www.ti.com/lit/ds/symlink/tlv1805.pdf" H 8550 2950 50  0001 C CNN
	1    8400 2750
	1    0    0    -1  
$EndComp
Wire Wire Line
	7550 2250 7550 2700
Wire Wire Line
	7550 2700 8200 2700
Wire Wire Line
	7550 3250 7550 2800
Wire Wire Line
	7550 2800 8200 2800
$Comp
L power:GND #PWR?
U 1 1 5F8237A3
P 8400 3050
AR Path="/5F8237A3" Ref="#PWR?"  Part="1" 
AR Path="/5F0C6676/5F8237A3" Ref="#PWR?"  Part="1" 
AR Path="/5F47F17B/5F8237A3" Ref="#PWR0104"  Part="1" 
F 0 "#PWR0104" H 8400 2800 50  0001 C CNN
F 1 "GND" H 8405 2877 39  0000 C CNN
F 2 "" H 8400 3050 50  0001 C CNN
F 3 "" H 8400 3050 50  0001 C CNN
	1    8400 3050
	1    0    0    -1  
$EndComp
$Comp
L power:+3.3V #PWR?
U 1 1 5F823D50
P 8100 2400
AR Path="/5F823D50" Ref="#PWR?"  Part="1" 
AR Path="/5F47F17B/5F823D50" Ref="#PWR0110"  Part="1" 
F 0 "#PWR0110" H 8100 2250 50  0001 C CNN
F 1 "+3.3V" H 8115 2565 39  0000 C CNN
F 2 "" H 8100 2400 50  0001 C CNN
F 3 "" H 8100 2400 50  0001 C CNN
	1    8100 2400
	1    0    0    -1  
$EndComp
$Comp
L Device:C_Small C?
U 1 1 5F824BF2
P 8100 2500
AR Path="/5EF40FCD/5F824BF2" Ref="C?"  Part="1" 
AR Path="/5F824BF2" Ref="C?"  Part="1" 
AR Path="/5F47F17B/5F824BF2" Ref="C17"  Part="1" 
F 0 "C17" H 8050 2450 39  0000 R CNN
F 1 "100n" H 8100 2550 39  0000 R CNN
F 2 "Capacitor_SMD:C_0603_1608Metric" H 8100 2500 50  0001 C CNN
F 3 "~" H 8100 2500 50  0001 C CNN
	1    8100 2500
	1    0    0    1   
$EndComp
$Comp
L power:GND #PWR?
U 1 1 5F827F77
P 8100 2600
AR Path="/5F827F77" Ref="#PWR?"  Part="1" 
AR Path="/5F0C6676/5F827F77" Ref="#PWR?"  Part="1" 
AR Path="/5F47F17B/5F827F77" Ref="#PWR0111"  Part="1" 
F 0 "#PWR0111" H 8100 2350 50  0001 C CNN
F 1 "GND" H 8105 2427 39  0000 C CNN
F 2 "" H 8100 2600 50  0001 C CNN
F 3 "" H 8100 2600 50  0001 C CNN
	1    8100 2600
	1    0    0    -1  
$EndComp
Wire Wire Line
	8100 2400 8400 2400
Wire Wire Line
	8400 2400 8400 2450
Connection ~ 8100 2400
Wire Wire Line
	7025 2025 7025 2250
Connection ~ 7025 2250
Wire Wire Line
	7025 2250 7075 2250
Connection ~ 7025 3250
Wire Wire Line
	7025 3250 7075 3250
Text HLabel 9250 2750 2    39   Input ~ 0
LIGHT_LR
Wire Wire Line
	9250 2750 8900 2750
$Comp
L Jumper:SolderJumper_2_Open JP1
U 1 1 5F841C84
P 7025 1875
F 0 "JP1" V 6987 1943 39  0000 L CNN
F 1 "SolderJumper_2_Open" V 7062 1943 39  0000 L CNN
F 2 "LEGOS:SolderJumper-2_P1.1mm_Open_RoundedPad0.8x0.9mm" H 7025 1875 50  0001 C CNN
F 3 "~" H 7025 1875 50  0001 C CNN
	1    7025 1875
	0    1    1    0   
$EndComp
Wire Wire Line
	7100 1600 7025 1600
Wire Wire Line
	7025 1600 7025 1725
Wire Wire Line
	7375 2575 7375 2750
Connection ~ 7375 2750
Wire Wire Line
	7375 2750 7375 2925
Wire Wire Line
	7025 3475 7025 3250
$Comp
L Jumper:SolderJumper_2_Open JP2
U 1 1 5F852EBF
P 7025 3625
F 0 "JP2" V 7063 3693 39  0000 L CNN
F 1 "SolderJumper_2_Open" V 6988 3693 39  0000 L CNN
F 2 "LEGOS:SolderJumper-2_P1.1mm_Open_RoundedPad0.8x0.9mm" H 7025 3625 50  0001 C CNN
F 3 "~" H 7025 3625 50  0001 C CNN
	1    7025 3625
	0    1    -1   0   
$EndComp
Wire Wire Line
	7100 3900 7025 3900
Wire Wire Line
	7025 3900 7025 3775
$EndSCHEMATC
