EESchema Schematic File Version 4
EELAYER 30 0
EELAYER END
$Descr A4 11693 8268
encoding utf-8
Sheet 1 6
Title "Data Center"
Date "2020-09-12"
Rev "1.1"
Comp "Institute for Automation of Complex Power Systems - E.ON ERC - RWTH Aachen University"
Comment1 "Designer: D. Wienands, S. Melcher, L. Jeske, D. Moll"
Comment2 "Supervisor: C. Guarnieri Calò Carducci"
Comment3 ""
Comment4 ""
$EndDescr
$Comp
L power:GND #PWR07
U 1 1 5EF42F5A
P 4775 5025
F 0 "#PWR07" H 4775 4775 50  0001 C CNN
F 1 "GND" H 4780 4852 50  0000 C CNN
F 2 "" H 4775 5025 50  0001 C CNN
F 3 "" H 4775 5025 50  0001 C CNN
	1    4775 5025
	1    0    0    -1  
$EndComp
$Comp
L Device:CP_Small C3
U 1 1 5EF42F60
P 4775 2025
F 0 "C3" H 4925 1975 39  0000 R CNN
F 1 "10u" H 4925 2075 39  0000 R CNN
F 2 "Capacitor_SMD:C_0603_1608Metric" H 4775 2025 50  0001 C CNN
F 3 "~" H 4775 2025 50  0001 C CNN
	1    4775 2025
	-1   0    0    1   
$EndComp
$Comp
L Device:C_Small C2
U 1 1 5EF42F66
P 4525 2025
F 0 "C2" H 4475 1975 39  0000 R CNN
F 1 "100n" H 4525 2075 39  0000 R CNN
F 2 "Capacitor_SMD:C_0603_1608Metric" H 4525 2025 50  0001 C CNN
F 3 "~" H 4525 2025 50  0001 C CNN
	1    4525 2025
	1    0    0    1   
$EndComp
Wire Wire Line
	4775 2125 4775 2225
Wire Wire Line
	4525 2125 4525 2225
$Comp
L power:GND #PWR05
U 1 1 5EF42F6E
P 4525 1925
F 0 "#PWR05" H 4525 1675 50  0001 C CNN
F 1 "GND" H 4530 1752 39  0000 C CNN
F 2 "" H 4525 1925 50  0001 C CNN
F 3 "" H 4525 1925 50  0001 C CNN
	1    4525 1925
	-1   0    0    1   
$EndComp
$Comp
L power:GND #PWR06
U 1 1 5EF42F74
P 4775 1925
F 0 "#PWR06" H 4775 1675 50  0001 C CNN
F 1 "GND" H 4780 1752 39  0000 C CNN
F 2 "" H 4775 1925 50  0001 C CNN
F 3 "" H 4775 1925 50  0001 C CNN
	1    4775 1925
	-1   0    0    1   
$EndComp
$Comp
L power:GND #PWR03
U 1 1 5EF42F7A
P 3425 2825
F 0 "#PWR03" H 3425 2575 50  0001 C CNN
F 1 "GND" H 3430 2652 39  0000 C CNN
F 2 "" H 3425 2825 50  0001 C CNN
F 3 "" H 3425 2825 50  0001 C CNN
	1    3425 2825
	1    0    0    -1  
$EndComp
Connection ~ 3425 2425
$Comp
L Device:C_Small C1
U 1 1 5EF42F81
P 3425 2625
F 0 "C1" H 3375 2575 39  0000 R CNN
F 1 "10u" H 3375 2675 39  0000 R CNN
F 2 "Capacitor_SMD:C_0603_1608Metric" H 3425 2625 50  0001 C CNN
F 3 "~" H 3425 2625 50  0001 C CNN
	1    3425 2625
	1    0    0    1   
$EndComp
$Comp
L Device:R_Small R1
U 1 1 5EF42F87
P 3425 2175
F 0 "R1" H 3475 2125 39  0000 L CNN
F 1 "10k" H 3475 2175 39  0000 L CNN
F 2 "Resistor_SMD:R_0603_1608Metric" H 3425 2175 50  0001 C CNN
F 3 "~" H 3425 2175 50  0001 C CNN
	1    3425 2175
	-1   0    0    1   
$EndComp
Wire Wire Line
	3425 2425 3125 2425
Text Notes 5775 2425 0    28   ~ 0
UP during boot
Text Notes 5775 3025 0    28   ~ 0
DOWN during boot
Wire Wire Line
	5375 2525 5575 2525
Wire Wire Line
	5375 2725 5575 2725
Text Notes 5775 2625 0    28   ~ 0
DOWN during prog
Text Notes 5775 3325 0    28   ~ 0
UP during boot for log
Text Notes 4125 4175 1    28   ~ 0
Internally connected to the flash
Text Notes 5775 2925 0    28   ~ 0
UP during boot
Wire Wire Line
	5375 2425 5575 2425
Text Notes 5375 2425 0    39   ~ 0
IO0
Wire Wire Line
	3425 2425 3425 2525
Text Notes 5675 4625 2    28   ~ 0
only input
Text Notes 5675 4725 2    28   ~ 0
only input
Text Notes 4125 2625 2    28   ~ 0
only input
Text Notes 4125 2725 2    28   ~ 0
only input
Text Label 5575 2725 0    39   ~ 0
RXD
Text Label 5575 2525 0    39   ~ 0
TXD
Text Label 3575 2425 0    50   ~ 0
EN
Text Label 5575 2425 0    39   ~ 0
ID
Wire Wire Line
	4775 2225 4525 2225
Connection ~ 4525 2225
NoConn ~ 5375 4725
NoConn ~ 5375 4625
NoConn ~ 4175 2725
NoConn ~ 4175 2625
NoConn ~ 4175 3625
NoConn ~ 4175 3725
NoConn ~ 4175 3825
NoConn ~ 4175 3925
NoConn ~ 4175 4025
NoConn ~ 4175 4125
Wire Wire Line
	3425 2275 3425 2425
Text Notes 5375 4125 0    50   ~ 0
DAC
Text Notes 5375 4225 0    50   ~ 0
DAC
Wire Wire Line
	5375 3725 5575 3725
Wire Wire Line
	5375 3625 5575 3625
Wire Wire Line
	5375 3525 5575 3525
Wire Wire Line
	3425 2075 3425 1925
Wire Wire Line
	4175 2425 3425 2425
Text Label 5575 3325 0    39   ~ 0
~GRID
Wire Wire Line
	5575 3225 5375 3225
Text GLabel 5575 3625 2    39   Input ~ 0
SCL
Text GLabel 5575 2925 2    39   Input ~ 0
SDA
Wire Wire Line
	7000 2700 6900 2700
Wire Wire Line
	7000 2800 6900 2800
Text Label 6900 2600 2    39   ~ 0
EN
Text Label 6900 2700 2    39   ~ 0
TXD
Text Label 6900 2800 2    39   ~ 0
RXD
Text Label 6900 2900 2    39   ~ 0
ID
Wire Wire Line
	7000 2600 6900 2600
Wire Wire Line
	7000 3000 6950 3000
Wire Wire Line
	6950 3000 6950 2900
Text Label 8400 2600 2    39   ~ 0
LOAD
Text Label 8400 2800 2    39   ~ 0
DATA1
Wire Wire Line
	8400 2600 8500 2600
Wire Wire Line
	8400 2800 8500 2800
Connection ~ 4775 2225
$Comp
L power:+3.3V #PWR?
U 1 1 5F3411D1
P 4275 1925
AR Path="/5F10B8E7/5F3411D1" Ref="#PWR?"  Part="1" 
AR Path="/5F3411D1" Ref="#PWR04"  Part="1" 
F 0 "#PWR04" H 4275 1775 50  0001 C CNN
F 1 "+3.3V" H 4290 2090 39  0000 C CNN
F 2 "" H 4275 1925 50  0001 C CNN
F 3 "" H 4275 1925 50  0001 C CNN
	1    4275 1925
	1    0    0    -1  
$EndComp
Wire Wire Line
	4275 2225 4275 1925
Wire Wire Line
	4275 2225 4525 2225
$Comp
L power:+3.3V #PWR?
U 1 1 5F345C2E
P 3425 1925
AR Path="/5F10B8E7/5F345C2E" Ref="#PWR?"  Part="1" 
AR Path="/5F345C2E" Ref="#PWR02"  Part="1" 
F 0 "#PWR02" H 3425 1775 50  0001 C CNN
F 1 "+3.3V" H 3440 2090 39  0000 C CNN
F 2 "" H 3425 1925 50  0001 C CNN
F 3 "" H 3425 1925 50  0001 C CNN
	1    3425 1925
	1    0    0    -1  
$EndComp
$Comp
L Switch:SW_Push SW1
U 1 1 5F35791C
P 3125 2625
F 0 "SW1" V 3175 2875 39  0000 R CNN
F 1 "PTS815" V 3125 3025 39  0000 R CNN
F 2 "LEGOS:PTS815" H 3125 2825 50  0001 C CNN
F 3 "~" H 3125 2825 50  0001 C CNN
	1    3125 2625
	0    -1   -1   0   
$EndComp
$Comp
L power:GND #PWR01
U 1 1 5F358C82
P 3125 2825
F 0 "#PWR01" H 3125 2575 50  0001 C CNN
F 1 "GND" H 3130 2652 39  0000 C CNN
F 2 "" H 3125 2825 50  0001 C CNN
F 3 "" H 3125 2825 50  0001 C CNN
	1    3125 2825
	1    0    0    -1  
$EndComp
Wire Wire Line
	3425 2725 3425 2825
$Sheet
S 7000 2500 550  600 
U 5F10B8E7
F0 "Connectors" 39
F1 "sub_connectors.sch" 39
F2 "EN" O L 7000 2600 39 
F3 "TXD" O L 7000 2700 39 
F4 "RXD" I L 7000 2800 39 
F5 "IO0" B L 7000 2900 39 
F6 "ID" B L 7000 3000 39 
$EndSheet
$Sheet
S 8500 2500 550  950 
U 5F1207D0
F0 "Servers" 39
F1 "sub_servers.sch" 39
F2 "STATUS" I L 8500 2600 39 
F3 "SERVER2" I L 8500 2900 39 
F4 "SERVER3" I L 8500 3000 39 
F5 "SERVER1" I L 8500 2800 39 
F6 "SERVER4" I L 8500 3100 39 
F7 "SERVER5" I L 8500 3200 39 
F8 "SERVER6" I L 8500 3300 39 
$EndSheet
Text Label 8400 2900 2    39   ~ 0
DATA2
Wire Wire Line
	8400 2900 8500 2900
Text Label 8400 3000 2    39   ~ 0
DATA3
Wire Wire Line
	8400 3000 8500 3000
Text Label 8400 3100 2    39   ~ 0
DATA4
Wire Wire Line
	8400 3100 8500 3100
Text Label 8400 3200 2    39   ~ 0
DATA5
Wire Wire Line
	8400 3200 8500 3200
Text Label 8400 3300 2    39   ~ 0
DATA6
Wire Wire Line
	8400 3300 8500 3300
Text Label 5575 4325 0    39   ~ 0
DATA4
Wire Wire Line
	5575 4325 5375 4325
Text Label 5575 4225 0    39   ~ 0
DATA5
Wire Wire Line
	5575 4425 5375 4425
Text Label 5575 4125 0    39   ~ 0
DATA6
Wire Wire Line
	5575 4525 5375 4525
Text Label 5575 4425 0    39   ~ 0
LOAD
Text Label 5575 3025 0    39   ~ 0
DATA1
Wire Wire Line
	5575 4025 5375 4025
Text Label 5575 4525 0    39   ~ 0
DATA3
Wire Wire Line
	5575 4225 5375 4225
Wire Wire Line
	5375 4125 5575 4125
Wire Wire Line
	5375 3825 5575 3825
Wire Wire Line
	5375 3925 5575 3925
$Sheet
S 7000 3400 550  500 
U 5EF831DD
F0 "UPS" 39
F1 "sub_power_ups.sch" 39
F2 "~GRID" I L 7000 3650 39 
F3 "IN" I L 7000 3500 39 
F4 "OUT" I L 7000 3800 39 
F5 "LED1" I R 7550 3550 39 
F6 "LED2" I R 7550 3650 39 
F7 "LED3" I R 7550 3750 39 
$EndSheet
Wire Wire Line
	7000 4650 6900 4650
Wire Wire Line
	6900 4500 7000 4500
Wire Wire Line
	7000 3500 6900 3500
$Comp
L LEGOS:VBUS #PWR?
U 1 1 5F3678DB
P 6900 3500
AR Path="/5EF831DD/5F3678DB" Ref="#PWR?"  Part="1" 
AR Path="/5F3678DB" Ref="#PWR08"  Part="1" 
F 0 "#PWR08" H 6900 3350 50  0001 C CNN
F 1 "VBUS" H 6915 3673 39  0000 C CNN
F 2 "" H 6900 3500 50  0001 C CNN
F 3 "" H 6900 3500 50  0001 C CNN
	1    6900 3500
	1    0    0    -1  
$EndComp
$Sheet
S 7000 4250 550  500 
U 5F3641D4
F0 "Telemetry" 39
F1 "sub_telemetry.sch" 39
F2 "V+" I L 7000 4500 39 
F3 "V-" I L 7000 4650 39 
F4 "VCOM" I L 7000 4350 39 
F5 "~IRQ" O R 7550 4350 39 
F6 "A1" I R 7550 4500 39 
F7 "A0" I R 7550 4650 39 
$EndSheet
Wire Wire Line
	7000 3800 6900 3800
Wire Wire Line
	6900 3800 6900 4350
Wire Wire Line
	6900 4350 7000 4350
Wire Wire Line
	6900 4350 6900 4500
Connection ~ 6900 4350
$Comp
L power:+3.3V #PWR09
U 1 1 5F403BC0
P 6900 4650
F 0 "#PWR09" H 6900 4500 50  0001 C CNN
F 1 "+3.3V" H 6915 4823 39  0000 C CNN
F 2 "" H 6900 4650 50  0001 C CNN
F 3 "" H 6900 4650 50  0001 C CNN
	1    6900 4650
	-1   0    0    1   
$EndComp
Wire Wire Line
	6950 2900 7000 2900
Wire Wire Line
	6950 2900 6900 2900
Connection ~ 6950 2900
Text Label 6900 3650 2    39   ~ 0
~GRID
Wire Wire Line
	7000 3650 6900 3650
Text Label 7650 3550 0    39   ~ 0
LED1
Wire Wire Line
	7650 3550 7550 3550
Text Label 7650 3650 0    39   ~ 0
LED2
Wire Wire Line
	7650 3650 7550 3650
Text Label 7650 3750 0    39   ~ 0
LED3
Wire Wire Line
	7650 3750 7550 3750
Text Label 5575 3125 0    39   ~ 0
LED1
Wire Wire Line
	5575 2625 5375 2625
Text Label 5575 2825 0    39   ~ 0
LED3
Wire Wire Line
	5575 3025 5375 3025
$Comp
L Power_Supervisor:LM809 U4
U 1 1 5F3D95E9
P 2275 2425
F 0 "U4" H 2046 2463 39  0000 R CNN
F 1 "TLV803E" H 2046 2388 39  0000 R CNN
F 2 "Package_TO_SOT_SMD:SOT-23" H 2575 2525 50  0001 C CNN
F 3 "https://www.ti.com/lit/ds/symlink/tlv803e.pdf" H 2575 2525 50  0001 C CNN
	1    2275 2425
	1    0    0    -1  
$EndComp
Wire Wire Line
	3125 2425 2575 2425
Connection ~ 3125 2425
$Comp
L power:GND #PWR0101
U 1 1 5F3DAD4A
P 2275 2825
F 0 "#PWR0101" H 2275 2575 50  0001 C CNN
F 1 "GND" H 2280 2652 39  0000 C CNN
F 2 "" H 2275 2825 50  0001 C CNN
F 3 "" H 2275 2825 50  0001 C CNN
	1    2275 2825
	1    0    0    -1  
$EndComp
$Comp
L power:+3.3V #PWR?
U 1 1 5F3DCE15
P 2275 1925
AR Path="/5F10B8E7/5F3DCE15" Ref="#PWR?"  Part="1" 
AR Path="/5F3DCE15" Ref="#PWR0102"  Part="1" 
F 0 "#PWR0102" H 2275 1775 50  0001 C CNN
F 1 "+3.3V" H 2290 2090 39  0000 C CNN
F 2 "" H 2275 1925 50  0001 C CNN
F 3 "" H 2275 1925 50  0001 C CNN
	1    2275 1925
	1    0    0    -1  
$EndComp
Wire Wire Line
	2275 1925 2275 2025
$Comp
L power:GND #PWR0103
U 1 1 5F3FEEAC
P 7650 4650
F 0 "#PWR0103" H 7650 4400 50  0001 C CNN
F 1 "GND" V 7650 4450 39  0000 C CNN
F 2 "" H 7650 4650 50  0001 C CNN
F 3 "" H 7650 4650 50  0001 C CNN
	1    7650 4650
	0    -1   -1   0   
$EndComp
Wire Wire Line
	7650 4650 7550 4650
Wire Wire Line
	7650 4500 7550 4500
Wire Wire Line
	7650 4500 7650 4650
Connection ~ 7650 4650
Wire Wire Line
	7650 4350 7550 4350
Text Label 7650 4350 0    39   ~ 0
~IRQ
Text Label 5575 3525 0    39   ~ 0
~IRQ
$Comp
L RF_Module:ESP32-WROOM-32D U1
U 1 1 5EF42FBB
P 4775 3625
F 0 "U1" H 4225 4125 50  0000 C CNN
F 1 "ESP32-WROOM-32D" H 3875 4025 50  0000 C CNN
F 2 "RF_Module:ESP32-WROOM-32" H 4775 2125 50  0001 C CNN
F 3 "https://www.espressif.com/sites/default/files/documentation/esp32-wroom-32d_esp32-wroom-32u_datasheet_en.pdf" H 4475 3675 50  0001 C CNN
	1    4775 3625
	1    0    0    -1  
$EndComp
Wire Wire Line
	5575 3125 5375 3125
$Comp
L LEGOS:Micro_SD_Card_WE J3
U 1 1 5F4C240E
P 9550 4750
F 0 "J3" H 9500 5657 50  0000 C CNN
F 1 "Micro_SD_Card_WE" H 9500 5566 50  0000 C CNN
F 2 "LEGOS:WR-CRD_Wuerth_693071020811" H 11600 5450 50  0001 C CNN
F 3 "https://www.we-online.de/katalog/datasheet/693071020811.pdf" H 9550 4850 50  0001 C CNN
F 4 "693071020811" H 9500 5475 50  0000 C CNN "Mfr"
	1    9550 4750
	1    0    0    -1  
$EndComp
NoConn ~ 8650 4350
Text Label 8550 4450 2    39   ~ 0
~CS
Text Label 5575 4025 0    39   ~ 0
~CS
Wire Wire Line
	5375 3425 5575 3425
Text GLabel 5575 3825 2    39   Input ~ 0
CLK
Text GLabel 5575 3925 2    39   Input ~ 0
MOSI
Wire Wire Line
	5375 2825 5575 2825
Text GLabel 8550 4950 0    39   Input ~ 0
MISO
Wire Wire Line
	8650 4550 8550 4550
Wire Wire Line
	8650 4450 8550 4450
Text GLabel 8550 4550 0    39   Input ~ 0
MOSI
Wire Wire Line
	8550 4650 8650 4650
Wire Wire Line
	8550 4750 8650 4750
Wire Wire Line
	8550 4850 8650 4850
Wire Wire Line
	8550 4950 8650 4950
Wire Wire Line
	8550 5050 8650 5050
Wire Wire Line
	8550 5150 8650 5150
$Comp
L power:+3.3V #PWR0104
U 1 1 5F4D9EDA
P 8550 4650
F 0 "#PWR0104" H 8550 4500 50  0001 C CNN
F 1 "+3.3V" V 8550 4850 39  0000 C CNN
F 2 "" H 8550 4650 50  0001 C CNN
F 3 "" H 8550 4650 50  0001 C CNN
	1    8550 4650
	0    -1   -1   0   
$EndComp
Text GLabel 8550 4750 0    39   Input ~ 0
CLK
$Comp
L power:GND #PWR0105
U 1 1 5F4DB081
P 8550 4850
F 0 "#PWR0105" H 8550 4600 50  0001 C CNN
F 1 "GND" V 8550 4650 39  0000 C CNN
F 2 "" H 8550 4850 50  0001 C CNN
F 3 "" H 8550 4850 50  0001 C CNN
	1    8550 4850
	0    1    1    0   
$EndComp
NoConn ~ 8550 5050
NoConn ~ 8550 5150
$Comp
L power:GND #PWR0106
U 1 1 5F4E6938
P 10350 5250
F 0 "#PWR0106" H 10350 5000 50  0001 C CNN
F 1 "GND" H 10355 5077 50  0000 C CNN
F 2 "" H 10350 5250 50  0001 C CNN
F 3 "" H 10350 5250 50  0001 C CNN
	1    10350 5250
	1    0    0    -1  
$EndComp
Text GLabel 5575 3725 2    39   Input ~ 0
MISO
Wire Wire Line
	5575 2925 5375 2925
$Sheet
S 7000 1900 550  300 
U 5F5538A6
F0 "Mechanical" 39
F1 "sub_mechanical.sch" 39
$EndSheet
Text Label 5575 3225 0    39   ~ 0
DATA2
Wire Wire Line
	5575 3325 5375 3325
Text Label 5575 2625 0    39   ~ 0
LED2
$EndSCHEMATC
