EESchema Schematic File Version 4
EELAYER 30 0
EELAYER END
$Descr A4 11693 8268
encoding utf-8
Sheet 4 9
Title "Power Regulation - Slave"
Date "2020-08-20"
Rev "1.0"
Comp "Institute for Automation of Complex Power Systems - E.ON ERC - RWTH Aachen University"
Comment1 "Designer: D. Wienands, S. Melcher, L. Jeske, D. Moll"
Comment2 "Supervisor: C. Guarnieri Calò Carducci"
Comment3 ""
Comment4 ""
$EndDescr
Wire Wire Line
	10200 3800 10200 3950
$Comp
L power:GND #PWR032
U 1 1 5ED52544
P 10200 3950
F 0 "#PWR032" H 10200 3700 50  0001 C CNN
F 1 "GND" H 10205 3777 50  0000 C CNN
F 2 "" H 10200 3950 50  0001 C CNN
F 3 "" H 10200 3950 50  0001 C CNN
	1    10200 3950
	1    0    0    -1  
$EndComp
Wire Wire Line
	10200 3600 10200 3300
$Comp
L LEGOS:AD8400ARZ1 U4
U 1 1 5ECF02F9
P 7750 4225
F 0 "U4" H 7400 3775 50  0000 C CNN
F 1 "AD8400ARZ10" H 7400 3675 50  0000 C CNN
F 2 "Package_SO:SOIC-8_3.9x4.9mm_P1.27mm" H 7750 3625 50  0001 C CNN
F 3 "https://www.analog.com/media/en/technical-documentation/data-sheets/AD8400_8402_8403.pdf" H 7300 4625 50  0001 C CNN
	1    7750 4225
	1    0    0    -1  
$EndComp
$Comp
L power:GND #PWR031
U 1 1 5ECF02FF
P 7750 4825
F 0 "#PWR031" H 7750 4575 50  0001 C CNN
F 1 "GND" H 7755 4652 50  0000 C CNN
F 2 "" H 7750 4825 50  0001 C CNN
F 3 "" H 7750 4825 50  0001 C CNN
	1    7750 4825
	-1   0    0    -1  
$EndComp
Wire Wire Line
	7750 4725 7750 4825
Text HLabel 7250 4425 0    50   Input ~ 0
~CS
NoConn ~ 8250 4025
Wire Wire Line
	6850 4325 6850 4425
$Comp
L power:GND #PWR028
U 1 1 5ECFCB30
P 6850 4425
F 0 "#PWR028" H 6850 4175 50  0001 C CNN
F 1 "GND" H 6855 4252 50  0000 C CNN
F 2 "" H 6850 4425 50  0001 C CNN
F 3 "" H 6850 4425 50  0001 C CNN
	1    6850 4425
	1    0    0    -1  
$EndComp
$Comp
L Device:C_Small C5
U 1 1 5ECFCB29
P 6850 4225
F 0 "C5" H 6800 4175 39  0000 R CNN
F 1 "100n" H 6850 4275 39  0000 R CNN
F 2 "Capacitor_SMD:C_0603_1608Metric" H 6850 4225 50  0001 C CNN
F 3 "~" H 6850 4225 50  0001 C CNN
	1    6850 4225
	-1   0    0    1   
$EndComp
$Comp
L power:+5V #PWR030
U 1 1 5F0D91D6
P 7750 3825
F 0 "#PWR030" H 7750 3675 50  0001 C CNN
F 1 "+5V" H 7765 3998 50  0000 C CNN
F 2 "" H 7750 3825 50  0001 C CNN
F 3 "" H 7750 3825 50  0001 C CNN
	1    7750 3825
	1    0    0    -1  
$EndComp
Wire Wire Line
	7750 3825 6850 3825
Wire Wire Line
	6850 3825 6850 4125
Text GLabel 7250 4025 0    39   Input ~ 0
MOSI
Text GLabel 7250 4225 0    39   Input ~ 0
CLK
$Comp
L LEGOS:LT3081R U5
U 1 1 5F3F89C6
P 8600 3100
F 0 "U5" H 8600 3590 50  0000 C CNN
F 1 "LT3081R" H 8600 3499 50  0000 C CNN
F 2 "Package_TO_SOT_SMD:TO-263-7_TabPin4" H 8600 3100 50  0001 C CNN
F 3 "https://www.analog.com/media/en/technical-documentation/data-sheets/3081fc.pdf" H 8600 3100 50  0001 C CNN
	1    8600 3100
	1    0    0    -1  
$EndComp
Wire Wire Line
	7650 3150 7650 3250
$Comp
L power:GND #PWR029
U 1 1 5F41E135
P 7650 3250
F 0 "#PWR029" H 7650 3000 50  0001 C CNN
F 1 "GND" H 7655 3077 50  0000 C CNN
F 2 "" H 7650 3250 50  0001 C CNN
F 3 "" H 7650 3250 50  0001 C CNN
	1    7650 3250
	1    0    0    -1  
$EndComp
Wire Wire Line
	7650 2850 7650 2950
$Comp
L Device:CP_Small C6
U 1 1 5F425B4E
P 7650 3050
F 0 "C6" H 7500 3100 39  0000 L CNN
F 1 "100u" H 7425 3025 39  0000 L CNN
F 2 "Capacitor_Tantalum_SMD:CP_EIA-3528-21_Kemet-B" H 7650 3050 50  0001 C CNN
F 3 "https://eu.mouser.com/datasheet/2/212/1/KEM_T2050_T491_AUTO-1093567.pdf" H 7650 3050 50  0001 C CNN
F 4 "T491B107M006ATAUTO" H 7650 3050 50  0001 C CNN "Mfr"
	1    7650 3050
	1    0    0    -1  
$EndComp
Connection ~ 7650 2850
Wire Wire Line
	7650 2850 7800 2850
$Comp
L Device:R_Small R7
U 1 1 5F42CDE5
P 9600 3300
F 0 "R7" V 9725 3275 39  0000 L CNN
F 1 "2.49-400mW" V 9675 3175 39  0000 L CNN
F 2 "Resistor_SMD:R_0815_2038Metric" H 9600 3300 50  0001 C CNN
F 3 "https://www.mouser.de/datasheet/2/427/rcse3-1761771.pdf" H 9600 3300 50  0001 C CNN
F 4 "RCS08052R49FKEA" V 9600 3300 50  0001 C CNN "Mfr"
	1    9600 3300
	0    -1   -1   0   
$EndComp
Wire Wire Line
	9500 3300 9400 3300
NoConn ~ 9050 3500
Wire Wire Line
	8000 3500 8000 3575
Wire Wire Line
	8000 3575 8250 3575
Wire Wire Line
	8250 3575 8250 3500
Wire Wire Line
	8250 3575 9400 3575
Wire Wire Line
	9400 3575 9400 3300
Connection ~ 8250 3575
Wire Wire Line
	9850 4425 9850 4225
Wire Wire Line
	9850 3300 9700 3300
Wire Wire Line
	8500 3500 8500 4225
$Comp
L Device:C_Small C7
U 1 1 5ED52550
P 9175 4225
F 0 "C7" V 9025 4275 39  0000 R CNN
F 1 "30p" V 9075 4275 39  0000 R CNN
F 2 "Capacitor_SMD:C_0603_1608Metric" H 9175 4225 50  0001 C CNN
F 3 "~" H 9175 4225 50  0001 C CNN
	1    9175 4225
	0    -1   1    0   
$EndComp
Wire Wire Line
	9275 4225 9850 4225
Connection ~ 9850 4225
Wire Wire Line
	9850 4225 9850 3300
Wire Wire Line
	9075 4225 8500 4225
$Comp
L Device:CP_Small C8
U 1 1 5F434D08
P 10200 3700
F 0 "C8" H 10050 3750 39  0000 L CNN
F 1 "100u" H 9975 3675 39  0000 L CNN
F 2 "Capacitor_Tantalum_SMD:CP_EIA-3528-21_Kemet-B" H 10200 3700 50  0001 C CNN
F 3 "https://eu.mouser.com/datasheet/2/212/1/KEM_T2050_T491_AUTO-1093567.pdf" H 10200 3700 50  0001 C CNN
F 4 "T491B107M006ATAUTO" H 10200 3700 50  0001 C CNN "Mfr"
	1    10200 3700
	1    0    0    -1  
$EndComp
Wire Wire Line
	8500 4225 8250 4225
Connection ~ 8500 4225
Wire Wire Line
	8250 4425 9850 4425
Text HLabel 10500 3300 2    50   Output ~ 0
VOUT
Text HLabel 7150 2700 2    50   Input ~ 0
VIN
$Sheet
S 6500 2450 550  500 
U 5F4BF641
F0 "TelemetryExt" 39
F1 "sub_telemetry.sch" 39
F2 "VCOM" I R 7050 2550 39 
F3 "V+" I R 7050 2700 39 
F4 "V-" I R 7050 2850 39 
F5 "~IRQ" O L 6500 2550 39 
F6 "A1" I L 6500 2700 39 
F7 "A0" I L 6500 2850 39 
$EndSheet
Wire Wire Line
	7050 2700 7150 2700
Wire Wire Line
	10200 3300 9850 3300
Connection ~ 9850 3300
$Comp
L power:GND #PWR026
U 1 1 5F4CE682
P 6400 2850
F 0 "#PWR026" H 6400 2600 50  0001 C CNN
F 1 "GND" V 6400 2650 50  0000 C CNN
F 2 "" H 6400 2850 50  0001 C CNN
F 3 "" H 6400 2850 50  0001 C CNN
	1    6400 2850
	0    1    -1   0   
$EndComp
$Comp
L power:+3.3V #PWR?
U 1 1 5F4D12AF
P 6400 2700
AR Path="/5F011FA8/5F128218/5F4D12AF" Ref="#PWR?"  Part="1" 
AR Path="/5F46DFE3/5F4D12AF" Ref="#PWR?"  Part="1" 
AR Path="/5F011FA8/5F4BF641/5F4D12AF" Ref="#PWR?"  Part="1" 
AR Path="/5F011FA8/5F4D12AF" Ref="#PWR?"  Part="1" 
AR Path="/5F4D12AF" Ref="#PWR?"  Part="1" 
AR Path="/5F4B756B/5F4D12AF" Ref="#PWR027"  Part="1" 
F 0 "#PWR027" H 6400 2550 50  0001 C CNN
F 1 "+3.3V" V 6400 2950 50  0000 C CNN
F 2 "" H 6400 2700 50  0001 C CNN
F 3 "" H 6400 2700 50  0001 C CNN
	1    6400 2700
	0    -1   -1   0   
$EndComp
Wire Wire Line
	6400 2700 6500 2700
Wire Wire Line
	6400 2850 6500 2850
Wire Wire Line
	6400 2550 6500 2550
Wire Wire Line
	10500 3300 10200 3300
Connection ~ 10200 3300
Wire Wire Line
	7050 2850 7650 2850
Wire Wire Line
	7050 2550 9850 2550
Wire Wire Line
	9850 2550 9850 3300
Text HLabel 6400 2550 0    50   Input ~ 0
~IRQ
$Bitmap
Pos 3675 3875
Scale 1.000000
Data
89 50 4E 47 0D 0A 1A 0A 00 00 00 0D 49 48 44 52 00 00 02 BC 00 00 02 0D 08 02 00 00 00 53 4E 3B 
C4 00 00 00 03 73 42 49 54 08 08 08 DB E1 4F E0 00 00 00 09 70 48 59 73 00 00 0E 74 00 00 0E 74 
01 6B 24 B3 D6 00 00 20 00 49 44 41 54 78 9C EC DD 7B 5C 54 D5 DA 07 F0 15 30 DC 0C 14 15 14 85 
12 95 4B 92 26 90 92 E0 05 91 3C 6A 57 14 B5 E9 A4 86 5A A1 62 5E 90 2C 29 B9 94 A9 28 78 43 79 
29 B3 38 56 2A A1 1E CB F2 02 85 A9 8C 97 3C 4E 6A 08 9A 0A 9E 99 50 C1 01 1C 64 06 18 18 DE 3F 
F6 39 DB 39 C3 6D 80 D9 B3 2F F3 FB FE F1 7E 60 B3 67 F6 1A FA BC 87 9F EB 59 CF 5A 8F 35 35 35 
11 00 00 00 80 F6 58 B0 3D 00 00 00 00 E0 07 84 06 00 00 00 30 08 42 03 00 00 00 18 04 A1 01 00 
00 00 0C 82 D0 00 00 00 00 06 41 68 00 00 00 00 83 20 34 00 00 00 80 41 10 1A 00 00 00 C0 20 08 
0D 00 00 00 60 10 84 06 00 00 00 30 08 42 03 00 00 00 18 04 A1 01 00 00 00 0C 82 D0 00 00 00 00 
06 41 68 00 00 00 00 83 20 34 00 00 00 80 41 10 1A 00 00 00 C0 20 08 0D 00 8C A8 AF AF 6F 68 68 
60 7B 14 00 00 C6 84 D0 00 60 4C 57 AF 5E 15 8B C5 B6 B6 B6 36 36 36 22 91 C8 D5 D5 F5 FD F7 DF 
AF AD AD 65 7B 5C 6D D9 B3 67 4F 6B 3F 7A EB AD B7 9C 9B 09 0E 0E 7E EB AD B7 8A 8A 8A 4C 39 C8 
39 73 E6 38 3B 3B 8B C5 62 C3 5F A2 FB B9 3A F1 72 00 68 0E A1 01 C0 68 7E FA E9 27 7F 7F FF BD 
7B F7 D6 D5 D5 51 57 EE DE BD BB 7E FD FA A0 A0 20 A5 52 C9 EE D8 5A F4 AF 7F FD CB DF DF FF DD 
77 DF 6D ED 86 87 0F 1F DE 6F 46 22 91 EC DC B9 73 E4 C8 91 A6 CC 0D D5 D5 D5 F7 EF DF AF AE AE 
36 E4 E6 E6 9F AB 43 2F 07 80 D6 20 34 00 18 87 4C 26 8B 88 88 A8 AB AB EB DB B7 EF AE 5D BB CA 
CA CA 24 12 C9 0B 2F BC 40 08 91 4A A5 09 09 09 6C 0F B0 05 FF F7 7F FF 27 95 4A DB BD CD CE CE 
EE C7 FF 3A 78 F0 E0 82 05 0B 08 21 D5 D5 D5 6B D7 AE 65 7E 8C 9D D1 FC 73 2D 59 B2 E4 1F FF F8 
47 4C 4C 0C 5B 43 02 10 06 2B B6 07 00 20 10 EB D7 AF 57 AB D5 96 96 96 39 39 39 4F 3F FD 34 21 
C4 D9 D9 F9 F0 E1 C3 C3 87 0F FF E3 8F 3F 2E 5D BA 44 DD 76 E6 CC 99 7B F7 EE B9 BA BA 06 06 06 
52 57 CE 9D 3B 77 E7 CE 1D FA 4A 7E 7E 7E 79 79 B9 9F 9F DF 83 07 0F FE F1 8F 7F 3C F3 CC 33 33 
67 CE B4 B6 B6 6E ED 3A 21 E4 FB EF BF 97 48 24 76 76 76 A1 A1 A1 63 C6 8C A1 87 44 BD F3 80 01 
03 86 0D 1B B6 7F FF FE 53 A7 4E 79 79 79 4D 9F 3E BD 4F 9F 3E D4 4F 4B 4A 4A 08 21 75 75 75 FF 
FC E7 3F 07 0C 18 30 7C F8 F0 16 3F 9A 95 95 D5 94 29 53 E8 6F 5F 7D F5 D5 43 87 0E 95 96 96 9E 
3B 77 4E F7 B6 D6 86 41 D1 6A B5 DF 7D F7 DD 99 33 67 7C 7C 7C A6 4F 9F FE F0 E1 43 A9 54 6A 6B 
6B 3B 69 D2 24 43 7E 2D CD DD BB 77 2F 37 37 F7 DC B9 73 5A AD 36 30 30 30 34 34 B4 7F FF FE AD 
7D 2E 5B 5B 5B 07 07 07 5B 5B 5B DD 77 B8 71 E3 46 6E 6E EE 1F 7F FC E1 E3 E3 33 71 E2 44 2F 2F 
2F DD 9F B6 FD DB 03 30 53 4D 00 60 0C FD FA F5 23 84 84 84 84 E8 5D 2F 2C 2C D4 68 34 F4 B7 D4 
DC 43 78 78 38 7D 25 3C 3C 5C F7 4A 58 58 18 21 64 C9 92 25 76 76 76 84 10 91 48 A4 56 AB 5B BB 
5E 56 56 36 72 E4 48 DD FF 8F 9E 3C 79 32 75 3F FD CE AF BC F2 CA 33 CF 3C 43 DF E0 E4 E4 54 50 
50 40 FF 94 36 7F FE FC E6 1F EA B5 D7 5E 23 84 38 38 38 E8 5E 6C 6C 6C EC DE BD 3B 21 24 34 34 
94 BA D2 F6 30 A8 1B 02 02 02 E8 9F BA B8 B8 2C 5B B6 8C 10 D2 AF 5F 3F 03 7F 2D D4 B7 2F BC F0 
02 F5 ED C9 93 27 1D 1C 1C 74 9F 68 67 67 F7 CB 2F BF B4 F6 B9 F4 5E DE D4 D4 B4 6A D5 2A 4B 4B 
4B DD 3B 97 2C 59 A2 FB 31 DB FE ED 01 98 27 94 27 00 8C A0 BE BE BE B4 B4 94 10 32 78 F0 60 BD 
1F F9 F8 F8 58 59 75 78 4A 6F CB 96 2D 7D FA F4 99 36 6D DA CC 99 33 75 FF 7D AC 77 7D CE 9C 39 
E7 CF 9F 77 71 71 49 4F 4F DF B6 6D 9B 8B 8B CB 91 23 47 56 AD 5A A5 FB 56 87 0E 1D B2 B1 B1 F9 
F6 DB 6F 57 AE 5C 49 08 A9 AC AC 4C 49 49 21 84 84 84 84 78 7A 7A 12 42 6C 6C 6C 66 CF 9E 1D 14 
14 D4 DA 60 1A 1A 1A 76 EF DE BD 7B F7 EE CC CC CC F5 EB D7 8F 1B 37 EE C1 83 07 84 90 E9 D3 A7 
53 37 B4 3B 8C E5 CB 97 FF EB 5F FF 22 84 7C F8 E1 87 DF 7E FB ED D3 4F 3F BD 69 D3 A6 8E FE 4E 
74 CD 9B 37 AF BA BA 3A 28 28 68 EF DE BD 3B 77 EE EC DB B7 AF 5A AD A6 DE D3 90 CF 95 9A 9A FA 
E9 A7 9F 36 36 36 86 84 84 6C DA B4 89 0A 64 5B B6 6C 89 8F 8F D7 BB B3 B5 DF 1E 80 99 62 3B B5 
00 08 01 BD C2 6E D1 A2 45 6D DF 69 E0 4C 83 48 24 BA 7F FF BE EE 0B 9B 5F BF 76 ED 1A F5 D0 AF 
BF FE 9A BA F2 D5 57 5F 11 42 6C 6C 6C 1A 1B 1B E9 77 B6 B3 B3 AB AE AE A6 6E 18 3D 7A 34 21 E4 
A5 97 5E A2 BE 9D 3F 7F 3E 21 A4 77 EF DE AD 8D 96 9A 69 68 4E 24 12 AD 5E BD DA C0 61 D4 D5 D5 
51 FF A6 8F 8D 8D A5 6E D0 68 34 03 07 0E 24 5D 98 69 90 48 24 5F 7F FD 75 49 49 09 F5 ED DC B9 
73 09 21 7D FB F6 6D ED 73 E9 BE BC B1 B1 B1 77 EF DE E4 7F 27 1E DE 78 E3 0D EA 73 3D 78 F0 40 
F7 25 6D FC F6 00 CC 10 D6 34 00 18 81 85 C5 7F 26 ED E8 BE 89 2E 0A 0D 0D ED D5 AB 57 DB D7 E9 
B5 7E 72 B9 FC 8B 2F BE 20 84 FC FB DF FF A6 C6 70 E6 CC 99 E0 E0 60 EA A7 A3 46 8D 7A FC F1 C7 
A9 AF A9 7A BC 56 AB ED D0 60 44 22 91 58 2C 7E F0 E0 C1 E1 C3 87 1B 1B 1B DD DC DC 24 12 89 BB 
BB BB 81 C3 38 79 F2 64 63 63 23 21 64 EC D8 B1 D4 9D 56 56 56 A3 47 8F BE 75 EB 56 87 86 A1 6B 
D4 A8 51 3E 3E 3E B9 B9 B9 1B 36 6C 90 4A A5 D4 EA 0A 03 37 C6 38 73 E6 CC FD FB F7 09 21 54 B6 
A0 88 C5 E2 AF BF FE 5A A3 D1 9C 3E 7D 5A 77 01 47 D7 7F 7B 00 42 82 D0 00 60 04 F6 F6 F6 76 76 
76 6A B5 FA AF BF FE D2 FB D1 EE DD BB 6B 6A 6A 5E 7A E9 25 6A 99 5E 73 F5 F5 F5 CD 2F 3A 3A 3A 
B6 78 B3 EE 75 FA 85 EF BF FF BE DE 6D 54 F9 80 42 AD 81 A0 88 44 A2 56 3F 43 EB 6C 6D 6D 33 33 
33 09 21 47 8F 1E 9D 3C 79 B2 5C 2E 9F 3C 79 F2 A9 53 A7 9C 9C 9C 0C 19 06 7D 03 1D AD 08 21 ED 
96 6C 5A FC B5 D0 36 6E DC B8 6A D5 2A 8D 46 23 12 89 C6 8D 1B 37 70 E0 C0 3F FF FC D3 C0 8F 43 
FF 72 A8 65 A4 7A 5F EB 3D B7 EB BF 3D 00 21 C1 9A 06 00 E3 A0 66 B3 8F 1F 3F AE FB 0F 68 AD 56 
BB 66 CD 9A 05 0B 16 F8 FB FB EB DE AC FB AF D5 CA CA CA E6 EF A6 B7 46 AF C5 EB F4 4A C0 9B 37 
6F EA 4D 21 EA FE 5B D9 88 26 4D 9A 14 1B 1B 4B 08 29 28 28 78 E7 9D 77 0C 1C 06 DD 95 40 35 35 
50 6E DC B8 D1 FC FD DB FD B5 50 FE F8 E3 8F D8 D8 58 8D 46 F3 E9 A7 9F D6 D6 D6 E6 E4 E4 8C 1B 
37 8E FC 6F 08 68 03 3D 1E B9 5C 4E 5F 54 28 14 D4 17 CE CE CE 86 BC 09 80 79 42 68 00 30 8E 95 
2B 57 5A 5A 5A 36 36 36 4E 9A 34 89 9A 2D FF EB AF BF 22 22 22 A8 92 FF C2 85 0B A9 DB A8 3F 6C 
52 A9 94 9A 4B 2F 2A 2A D2 6B 5C 34 5C 70 70 30 95 21 A8 A2 00 21 64 E3 C6 8D C3 87 0F FF FB DF 
FF DE A1 1D AC 3B 54 52 F9 E4 93 4F 9E 7A EA 29 42 C8 77 DF 7D F7 FD F7 DF 1B 32 8C C1 83 07 53 
2B 13 D7 AC 59 73 F5 EA 55 AD 56 BB 71 E3 C6 93 27 4F EA BE 6D 87 7E 2D D7 AF 5F A7 BE 08 0F 0F 
A7 66 2F 2E 5F BE 4C 9A 15 0E 5A FB 5C 83 07 0F A6 3E C2 9A 35 6B EE DC B9 43 08 51 28 14 6B D6 
AC 21 84 0C 18 30 80 2E EB 00 40 73 08 0D 00 C6 31 6C D8 B0 AD 5B B7 12 42 FE FC F3 CF E7 9E 7B 
EE B1 C7 1E 73 73 73 3B 78 F0 20 21 C4 CF CF 8F 5A 7B 4F 08 A1 16 D3 FD FB DF FF 1E 3E 7C 78 44 
44 84 BF BF BF DE E6 01 86 73 76 76 5E BE 7C 39 21 E4 D3 4F 3F 9D 30 61 42 44 44 44 6C 6C EC A5 
4B 97 1E 7F FC 71 03 FB 35 06 0C 18 40 08 A9 AE AE EE D1 A3 47 64 64 A4 21 2F B1 B6 B6 A6 4A 15 
84 90 05 0B 16 3C 7C F8 D0 90 61 A4 A6 A6 12 42 4A 4B 4B 7D 7D 7D 2D 2D 2D 63 63 63 DD DC DC 74 
DF B6 43 BF 16 6A 1B 0C 42 C8 AB AF BE BA 70 E1 C2 67 9F 7D F6 FC F9 F3 84 90 9A 9A 1A 03 3F 57 
7A 7A BA A5 A5 E5 BF FF FD EF 27 9F 7C 72 DC B8 71 FD FB F7 BF 72 E5 8A 48 24 DA B5 6B 97 21 BF 
04 00 B3 85 D0 00 60 34 0B 17 2E 3C 72 E4 88 9F 9F 1F 7D C5 CE CE 6E C9 92 25 27 4F 9E A4 FF 04 
46 47 47 53 9D 8A 05 05 05 87 0F 1F 8E 8B 8B EB CA 81 08 C9 C9 C9 AB 56 AD A2 B6 28 D8 BF 7F BF 
48 24 5A BC 78 F1 F6 ED DB 0D 7C F9 1B 6F BC 41 FD 7D 7D F0 E0 81 EE 32 88 B6 8D 18 31 82 6A A7 
2C 2D 2D FD F0 C3 0F 0D 19 C6 8B 2F BE 78 E8 D0 A1 67 9E 79 46 24 12 79 7A 7A EE DF BF 3F 34 34 
94 10 42 AD 8A 20 1D FC B5 78 79 79 ED DC B9 D3 C6 C6 E6 DA B5 6B E9 E9 E9 22 91 28 2B 2B 8B 10 
52 5D 5D 7D F5 EA 55 43 3E D7 B8 71 E3 7E FD F5 D7 91 23 47 6A 34 9A 93 27 4F D6 D5 D5 F9 FA FA 
E6 E5 E5 8D 1F 3F DE C0 5F 02 80 79 7A AC A9 A9 89 ED 31 00 08 8D 4A A5 3A 77 EE 5C 9F 3E 7D 7C 
7C 7C 74 57 FF D1 CA CB CB 8B 8A 8A 46 8D 1A D5 89 2D 1C 9A D3 6A B5 97 2F 5F 56 AB D5 23 46 8C 
E8 E8 1B 6A B5 5A A9 54 EA E0 E0 A0 B7 1F A2 71 87 F1 FD F7 DF 77 EF DE 7D C4 88 11 F6 F6 F6 D4 
15 B1 58 BC 77 EF DE 97 5E 7A 89 AA 71 50 3A F4 6B 69 68 68 38 77 EE DC E0 C1 83 5B DC A2 D1 C0 
CF A5 54 2A A5 52 E9 90 21 43 B0 94 01 C0 10 08 0D 00 C0 38 1F 1F 9F 6B D7 AE 89 44 A2 5F 7F FD 
75 E8 D0 A1 27 4F 9E 7C E3 8D 37 2A 2B 2B 63 63 63 93 93 93 D9 1E 1D 00 18 8A 07 A1 A1 B1 B1 F1 
C2 85 0B 9E 9E 9E 3D 7B F6 6C FB 4E 8D 46 73 F1 E2 45 67 67 67 6A DF 18 00 E0 88 6F BE F9 86 DA 
3D 49 97 8B 8B CB EF BF FF EE EA EA CA CA 90 00 A0 13 B8 1E 1A 32 32 32 B6 6E DD 4A 2D A8 1E 3D 
7A F4 A6 4D 9B 5A EC 5F 57 A9 54 F1 F1 F1 3F FE F8 23 B5 87 4C BF 7E FD D6 AD 5B 47 9F 73 33 7C 
F8 70 B5 5A AD 7B FF 97 5F 7E D9 C6 A6 B9 00 60 74 FF FA D7 BF BE F8 E2 8B D2 D2 D2 86 86 06 6B 
6B EB 80 80 80 A8 A8 A8 16 37 B0 02 00 CE E2 74 68 38 7C F8 70 4C 4C CC 9A 35 6B A6 4E 9D 5A 58 
58 18 15 15 F5 CC 33 CF A4 A5 A5 35 BF 73 C5 8A 15 27 4E 9C 48 4E 4E 0E 09 09 B9 77 EF DE AA 55 
AB A4 52 E9 4F 3F FD D4 AF 5F BF F2 F2 F2 D1 A3 47 BF F9 E6 9B 43 86 0C A1 EF 0F 0A 0A 42 09 13 
00 00 A0 43 38 1D 1A 5E 7A E9 A5 7E FD FA 65 64 64 50 DF FE F0 C3 0F 2B 56 AC 38 76 EC 18 B5 2E 
9A A6 D1 68 9E 79 E6 99 25 4B 96 D0 BB CD 54 54 54 8C 1A 35 EA BD F7 DE 9B 37 6F 5E 6E 6E EE A2 
45 8B 4E 9F 3E 8D 94 00 00 00 D0 15 DC 6D B9 AC AB AB BB 7E FD 3A D5 97 45 99 34 69 12 21 44 22 
91 E8 DD A9 56 AB 37 6E DC F8 F2 CB 2F D3 57 A8 73 7B 95 4A 25 21 A4 A8 A8 C8 C1 C1 01 89 01 00 
00 A0 8B B8 1B 1A 7E FB ED 37 42 88 8B 8B 0B 7D 45 24 12 D9 DA DA 52 7D D8 BA 1C 1D 1D A7 4C 99 
A2 BB 9C EA 9B 6F BE 21 84 8C 19 33 86 10 72 FD FA 75 77 77 F7 39 73 E6 0C 19 32 64 C8 90 21 B3 
66 CD D2 DD CB 16 00 00 00 0C C4 DD 03 AB A8 25 8D 7A 27 C4 58 5A 5A 6A 34 9A B6 5F 78 E9 D2 A5 
CD 9B 37 3F FF FC F3 CF 3E FB 2C F5 6D 55 55 55 54 54 D4 DC B9 73 CB CB CB B7 6D DB F6 FA EB AF 
1F 3C 78 B0 C5 DE 6E 42 C8 AC 59 B3 A8 DD E5 00 00 00 8C 62 E4 C8 91 BB 77 EF 66 7B 14 46 C0 DD 
D0 D0 39 17 2E 5C 88 8A 8A F2 F2 F2 A2 9B BF 3F FA E8 23 57 57 57 5F 5F 5F EA 5B 7F 7F FF C9 93 
27 7F F5 D5 57 F4 B6 BE 7A CE 9F 3F 4F 1D 16 00 9D E0 ED ED 8D DF 5E A7 E1 B7 D7 15 F8 ED 75 05 
7E 7B 5D 61 C8 6F CF DB DB DB 34 83 61 1A 77 CB 13 D4 B6 BB 7A F3 0A 8D 8D 8D 6D 9C 4E 7B E8 D0 
A1 C8 C8 48 3F 3F BF 5D BB 76 D1 1B CF 85 85 85 D1 89 81 10 32 70 E0 40 4F 4F 4F 54 28 00 00 00 
3A 8A BB A1 81 3A 4A B8 AA AA 8A BE A2 D1 68 6A 6B 6B 87 0E 1D DA E2 FD 3B 76 EC 78 EF BD F7 C2 
C3 C3 3F FF FC 73 3A 31 54 55 55 9D 3A 75 AA BC BC 5C EF E6 D6 CE 1D 06 00 00 80 D6 70 37 34 88 
44 A2 21 43 86 E4 E4 E4 D0 57 8E 1E 3D 4A 08 A1 B7 6C D2 F5 ED B7 DF 6E D9 B2 65 F9 F2 E5 49 49 
49 BA D7 2B 2A 2A E6 CF 9F BF 6F DF 3E FA 4A 69 69 E9 AD 5B B7 74 F7 6C 00 00 00 00 43 70 37 34 
10 42 E6 CD 9B F7 F3 CF 3F 67 66 66 6A B5 DA 2B 57 AE 24 27 27 4F 98 30 81 DA A4 41 22 91 44 47 
47 17 14 14 10 42 EE DC B9 B3 76 ED DA 41 83 06 F5 ED DB F7 90 0E A9 54 3A 70 E0 C0 D0 D0 D0 5D 
BB 76 E5 E5 E5 11 42 6E DC B8 B1 68 D1 22 67 67 E7 E6 3B DA 82 51 44 47 47 B3 3D 04 1E C3 6F AF 
2B F0 DB EB 0A FC F6 BA C2 AC 7E 7B 9C DE DC 89 10 92 9E 9E 9E 96 96 46 6D 23 3D 76 EC D8 94 94 
14 6A 1B E9 EC EC EC B8 B8 B8 CF 3E FB 6C DC B8 71 07 0F 1E 7C FF FD F7 9B BF 76 FA F4 E9 9F 7C 
F2 89 52 A9 4C 4A 4A FA E9 A7 9F A8 76 8C 80 80 80 F5 EB D7 BB BB BB B7 F6 44 2C 08 02 00 00 E3 
12 CC 5F 16 AE 87 06 D3 13 CC 7F 5A 00 00 E0 08 C1 FC 65 E1 74 79 02 00 00 00 B8 03 A1 01 00 00 
00 0C 82 D0 00 00 00 00 06 41 68 00 00 00 00 83 20 34 00 00 00 80 41 10 1A 00 00 00 98 35 EF F9 
46 B6 87 60 1C 08 0D 00 00 00 4C D1 AA E4 CA 7C B1 FF 20 2D DB 03 31 0E 84 06 00 00 00 46 68 EE 
9F AD CA 1D 23 EA 1D B8 E8 FF 5A 3D 6A 91 5F 84 76 34 36 00 00 00 17 A8 AF 6D AE 93 ED 77 08 DA 
23 EA FD 1C 21 E9 6C 0F C7 38 10 1A 00 00 00 8C 49 AB 92 3F 94 C6 12 42 7A 84 9D 62 7B 2C 46 86 
F2 04 00 00 80 D1 68 55 72 A5 44 2C EA 1D E8 18 BC 87 ED B1 18 1F 66 1A 00 00 00 8C A3 4E 96 AD 
BE B6 A5 DB F0 0D A2 DE CF B1 3D 16 46 20 34 00 00 00 18 81 32 5F AC 55 CB 1D 83 F6 58 D8 BB B1 
3D 16 A6 A0 3C 01 00 00 D0 25 5A 95 BC 2A 77 8C A5 BD 5B 8F B0 53 02 4E 0C 04 33 0D 00 00 00 5D 
51 27 CB AE 91 C6 FE B7 4B 42 E0 10 1A 00 00 00 3A A9 46 1A AB 51 9C 35 93 C4 40 10 1A 00 00 00 
3A 81 EA AB A4 4A 12 6C 8F C5 74 B0 A6 01 00 00 A0 63 A8 AD 1E 6D 9E 98 D6 CD 6F 03 DB 63 31 29 
CC 34 00 00 00 74 C0 FF 6E F5 68 5E 10 1A 00 00 00 0C 22 E0 AD 1E 0D 84 F2 04 00 00 40 FB E8 D3 
A7 04 B9 D5 A3 81 30 D3 00 00 00 D0 0E 73 2E 49 E8 42 68 00 00 00 68 95 79 76 49 B4 06 E5 09 00 
00 80 96 D1 25 09 73 EB 92 68 0D 66 1A 00 00 00 5A 80 92 44 73 08 0D 00 00 00 FF 03 5D 12 AD 41 
79 02 00 00 E0 11 74 49 B4 01 33 0D 00 00 00 FF 81 92 44 DB 10 1A 00 00 00 50 92 30 08 CA 13 00 
00 60 EE B4 2A B9 52 22 46 49 A2 5D 98 69 00 00 00 B3 46 95 24 BA 0D DF 80 92 44 BB 10 1A 00 00 
C0 7C 29 F3 C5 5A B5 DC 31 68 8F 85 BD 1B DB 63 E1 01 94 27 00 00 C0 1C 69 55 F2 AA DC 31 D4 56 
8F 48 0C 06 C2 4C 03 00 00 98 9D 3A 59 76 8D 34 16 5D 12 1D 85 D0 00 00 00 E6 A5 46 1A AB 51 9C 
45 62 E8 04 84 06 00 00 30 17 38 7D AA 8B B0 A6 01 00 00 CC 02 B5 D5 A3 CD 13 D3 70 FA 54 A7 61 
A6 01 00 00 84 0F 5B 3D 1A 05 42 03 00 00 08 19 B6 7A 34 22 94 27 00 00 40 B0 70 FA 94 71 61 A6 
01 00 00 84 09 25 09 A3 43 68 00 00 00 A1 41 49 82 21 28 4F 00 00 80 A0 A0 24 C1 1C CC 34 00 00 
80 70 A0 24 C1 28 84 06 00 00 10 02 94 24 4C 00 E5 09 00 00 E0 3D 94 24 4C 03 33 0D 00 00 C0 6F 
28 49 98 0C 42 03 00 00 F0 15 4A 12 26 86 F2 04 00 00 F0 92 56 25 57 4A C4 28 49 98 12 66 1A 00 
00 80 7F A8 92 44 B7 E1 1B 50 92 30 25 84 06 00 00 E0 19 65 BE 58 AB 96 3B 06 ED B1 B0 77 63 7B 
2C E6 05 E5 09 00 00 E0 0D AD 4A 5E 95 3B C6 D2 DE AD 47 D8 29 24 06 D3 C3 4C 03 00 00 F0 43 9D 
2C BB 46 1A 8B 2E 09 16 21 34 00 00 00 0F D4 48 63 35 8A B3 98 60 60 17 CA 13 00 00 C0 69 5A 95 
5C 99 2F 26 84 20 31 B0 0E A1 01 00 00 B8 8B DA EA D1 E6 89 69 DD FC 36 B0 3D 16 40 79 02 00 00 
B8 0A 5B 3D 72 0D 42 03 00 00 70 0E B6 7A E4 26 94 27 00 00 80 5B 70 FA 14 67 61 A6 01 00 00 38 
04 25 09 2E 43 68 00 00 00 4E 40 49 82 FB 50 9E 00 00 00 F6 A1 24 C1 0B 98 69 00 00 00 96 A1 24 
C1 17 08 0D 00 00 C0 1A 94 24 F8 05 E5 09 00 00 60 07 4A 12 BC 83 99 06 00 00 60 01 4A 12 7C 84 
D0 00 00 00 26 85 92 04 7F A1 3C 01 00 00 A6 83 92 04 AF 61 A6 01 00 00 4C 04 25 09 BE 43 68 00 
00 00 C6 51 25 09 AD 5A EE 18 B4 07 C7 5B F3 17 42 03 00 00 30 4B AB 92 2B 25 62 1B F7 69 76 DE 
28 49 F0 1B 42 03 00 00 30 A8 4E 96 5D 23 8D 45 49 42 18 F8 1D 1A 1A 1B 1B 2F 5C B8 E0 E9 E9 D9 
B3 67 CF B6 EF D4 68 34 17 2F 5E 74 76 76 1E 38 70 A0 69 C6 06 00 00 CA 7C B1 56 2D EF 11 76 0A 
25 09 61 E0 71 68 C8 C8 C8 D8 BA 75 6B 43 43 03 21 64 F4 E8 D1 9B 36 6D 72 74 74 6C 7E 9B 4A A5 
8A 8F 8F FF F1 C7 1F 1B 1B 1B 09 21 FD FA F5 5B B7 6E 5D 60 60 A0 A9 87 0B 00 60 4E A8 45 0C 96 
F6 6E E8 92 10 12 BE B6 5C 1E 3E 7C 38 35 35 35 31 31 B1 B0 B0 F0 C0 81 03 D7 AF 5F 5F B5 6A 55 
8B 77 AE 5E BD 3A 2F 2F 2F 2D 2D AD B0 B0 F0 C4 89 13 03 06 0C 78 E7 9D 77 4A 4B 4B 4D 3C 60 00 
00 F3 51 27 CB AE CA 1D 63 F3 C4 B4 6E 7E 1B D8 1E 0B FB 34 65 B2 A5 6E B5 9A 32 19 DB 03 31 02 
BE 86 86 8C 8C 8C 90 90 90 88 88 08 0B 0B 0B 5F 5F DF F7 DE 7B 2F 27 27 A7 A4 A4 44 EF 36 8D 46 
F3 D3 4F 3F BD F5 D6 5B A1 A1 A1 16 16 16 AE AE AE 29 29 29 6A B5 FA C8 91 23 6C 8C 1A 00 40 F8 
D4 D7 36 AB AF 6D 71 08 DA 63 E3 1E C1 F6 58 D8 A7 C8 4A 91 C7 47 DC AB B7 10 B9 B8 B3 3D 16 23 
E0 65 68 A8 AB AB BB 7E FD 7A 68 68 28 7D 65 D2 A4 49 84 10 89 44 A2 77 A7 5A AD DE B8 71 E3 CB 
2F BF 4C 5F E9 DE BD 3B 21 44 A9 54 9A 64 A4 00 00 66 44 AB 92 2B F3 C5 9A FB E7 7A 84 9D C2 B2 
47 4D 99 AC 78 41 A0 AA 40 E2 91 7E 6E 4F 99 35 DB C3 31 0E 5E AE 69 F8 ED B7 DF 08 21 2E 2E 2E 
F4 15 91 48 64 6B 6B 7B F5 EA 55 BD 3B 1D 1D 1D A7 4C 99 A2 7B E5 9B 6F BE 21 84 8C 19 33 A6 8D 
F7 F7 F6 F6 A6 BF 8E 8E 8E 5E BC 78 71 D7 C7 0C 00 20 6C 9A FB 67 AB 25 62 3B EF 25 76 DE 4B D9 
1E 0B CB 34 65 B2 DC E4 15 0E D7 F3 37 CB 6D AF D4 54 91 BD DE ED BF 86 27 78 19 1A A8 25 8D 22 
91 48 F7 A2 A5 A5 A5 46 A3 69 FB 85 97 2E 5D DA BC 79 F3 F3 CF 3F FF EC B3 CF B6 71 DB B5 6B D7 
BA 3E 48 00 00 F3 81 AD 1E 69 AA 02 89 3C 3E 62 E4 8C 98 5E 1B F7 8D FE EF 45 DD 7F 8B F2 1A 2F 
43 43 E7 5C B8 70 21 2A 2A CA CB CB 2B 39 39 99 ED B1 00 00 08 04 4E 9F A2 69 CA 64 77 B7 2F 6D 
28 93 BB 25 66 DB FB 06 B1 3D 1C 46 F0 72 4D 83 AD AD 2D 21 44 6F 5E A1 B1 B1 51 6F EE 41 D7 A1 
43 87 22 23 23 FD FC FC 76 ED DA 65 6F 6F CF F8 10 01 00 CC 00 4E 9F A2 29 B2 52 8A 17 06 DA FB 
06 79 A4 9F 13 6A 62 20 3C 9D 69 F0 F7 F7 27 84 54 55 55 D1 57 34 1A 4D 6D 6D ED D0 A1 43 5B BC 
7F C7 8E 1D 5B B6 6C 99 39 73 66 52 52 92 89 86 08 00 20 74 28 49 50 A8 09 06 42 88 C7 8E 73 C2 
68 91 68 03 2F 43 83 48 24 1A 32 64 48 4E 4E 4E 78 78 38 75 E5 E8 D1 A3 84 90 16 B7 6C FA F6 DB 
6F B7 6C D9 B2 7C F9 F2 77 DE 79 C7 A4 A3 04 00 10 28 94 24 68 8A AC 14 65 5E 96 E3 F8 19 BD 66 
C4 B0 3D 16 53 E0 65 79 82 10 32 6F DE BC 9F 7F FE 39 33 33 53 AB D5 5E B9 72 25 39 39 79 C2 84 
09 03 06 0C 20 84 48 24 92 E8 E8 E8 82 82 02 42 C8 9D 3B 77 D6 AE 5D 3B 68 D0 A0 BE 7D FB 1E D2 
21 95 4A 59 FE 00 00 00 FC 84 92 04 45 55 20 29 5E 10 A8 29 93 79 A4 9F 33 93 C4 40 78 3A D3 40 
08 79 F1 C5 17 65 32 59 72 72 F2 A7 9F 7E 4A 08 19 3B 76 EC BA 75 EB A8 1F 95 96 96 E6 E4 E4 4C 
9F 3E 9D 10 72 F6 EC D9 FA FA FA 9B 37 6F BE F7 DE 7B BA 2F 9F 3E 7D BA 9F 9F 9F E9 87 0D 00 C0 
6B 28 49 10 42 34 65 32 E5 89 2C 65 5E 56 9F E8 4D 02 5E BE D0 A2 C7 9A 9A 9A D8 1E 03 B7 78 7B 
7B A3 E5 12 00 40 0F 5D 92 30 F3 09 06 65 5E D6 DD ED 4B 7B CD 88 E9 D0 EC 82 60 FE B2 F0 75 A6 
01 00 00 4C 06 1B 37 11 F3 E8 A8 6C 17 42 03 00 00 B4 05 25 09 42 88 22 2B 45 91 95 D2 6B 46 4C 
AF 44 73 59 BE D0 22 84 06 00 00 68 19 55 92 D0 AA E5 8E 41 7B 2C EC DD D8 1E 0E 3B 34 65 32 79 
7C 84 95 8B 9B 39 74 54 B6 0B A1 01 00 00 5A A0 55 C9 95 12 B1 8D FB 34 3B 6F F3 5D C4 40 75 54 
F6 9A 11 E3 38 7E 06 DB 63 E1 04 BE B6 5C 02 00 00 73 EA 64 D9 55 B9 63 BA 0D DF 60 B6 8B 18 54 
05 92 EB 11 FD 08 21 1E E9 E7 90 18 68 98 69 00 00 80 FF A1 CC 17 6B D5 F2 1E 61 A7 CC B3 24 81 
05 8F 6D C0 4C 03 00 00 FC 87 56 25 57 E6 8B 2D ED DD CC 36 31 98 C9 11 12 9D 86 99 06 00 00 20 
84 90 3A 59 76 8D 34 B6 9B DF 06 1B F7 08 B6 C7 C2 02 7A 82 01 0B 1E DB 80 D0 00 00 00 A4 46 1A 
AB 51 9C 35 DB BE CA 47 47 48 98 77 47 65 BB 10 1A 00 00 CC 9A 99 9F 3E A5 2A 90 DC 4B 5B 66 E5 
E2 E6 91 7E 8E ED B1 F0 00 42 03 00 80 F9 32 E7 AD 1E CD F9 08 89 4E C3 42 48 00 00 33 A5 BE B6 
B9 E6 F7 58 87 A0 3D 66 98 18 54 05 92 E2 85 81 84 10 2C 78 EC 10 CC 34 00 00 98 1D 73 2E 49 A0 
A3 B2 2B 30 D3 00 00 60 5E 34 F7 CF 56 E5 8E 11 F5 0E 34 C3 F3 2A D1 51 D9 45 98 69 00 00 30 23 
66 7B FA 14 35 C1 40 08 41 47 65 57 20 34 00 00 98 05 73 2E 49 3C EA A8 9C 81 8E CA 2E 41 68 00 
00 10 3E B3 ED 92 A0 3A 2A ED 7C 47 A1 A3 D2 28 10 1A 00 00 04 CE 3C 4B 12 E8 A8 64 02 16 42 02 
00 08 16 75 96 84 E6 FE B9 1E 61 A7 CC 2A 31 28 F3 B2 D0 51 C9 04 CC 34 00 00 08 93 79 96 24 D0 
51 C9 28 84 06 00 00 01 32 CF 92 84 22 2B 45 91 95 D2 6B 46 0C 8E 90 60 08 42 03 00 80 A0 50 5D 
12 5A B5 DC AC BA 24 34 65 32 79 7C 84 95 8B 1B 3A 2A 19 85 D0 00 00 20 1C 5A 95 5C 29 11 DB B8 
4F B3 F3 36 97 8D 9B B0 E0 D1 94 B0 10 12 00 40 20 EA 64 D9 55 B9 63 BA 0D DF 60 3E 8B 18 70 84 
84 89 61 A6 01 00 40 08 94 F9 62 AA 24 61 61 EF C6 F6 58 4C 01 0B 1E 59 81 99 06 00 00 7E D3 AA 
E4 55 B9 63 2C ED DD CC 27 31 E0 08 09 B6 60 A6 01 00 80 C7 EA 64 D9 35 D2 58 F3 E9 92 A0 27 18 
B0 E0 91 15 08 0D 00 00 7C 55 23 8D D5 28 CE 9A 4F 62 78 74 84 04 3A 2A 59 82 D0 00 00 C0 3F 54 
5F 25 55 92 60 7B 2C A6 40 1D 21 61 E5 E2 86 23 24 D8 85 D0 00 00 C0 33 66 B5 D5 23 3A 2A 39 05 
0B 21 01 00 F8 44 7D 6D 73 CD EF B1 0E 41 7B CC 21 31 A0 A3 92 6B 30 D3 00 00 C0 0F 54 49 82 10 
62 0E 25 09 74 54 72 13 66 1A 00 00 78 40 73 FF 6C 55 EE 18 51 EF 40 C7 60 E1 6F F5 88 8E 4A CE 
C2 4C 03 00 00 D7 99 CF E9 53 D4 04 03 21 04 1D 95 DC 84 D0 00 00 C0 5D 66 55 92 78 D4 51 39 03 
1D 95 1C 85 D0 00 00 C0 51 E6 D3 25 41 75 54 DA F9 8E 42 47 25 C7 21 34 00 00 70 91 99 94 24 34 
65 32 45 56 8A BA E0 0C 3A 2A 79 01 A1 01 00 80 5B CC A7 24 A1 C8 4A 51 64 A5 F4 9A 11 D3 37 7A 
33 DB 63 01 83 20 34 00 00 70 88 99 94 24 D0 51 C9 53 08 0D 00 00 5C 61 26 25 09 7A 82 01 47 48 
F0 0E 42 03 00 00 FB CC A4 24 A1 29 93 C9 E3 23 AC 5C DC BC B2 4B D9 1E 0B 74 06 42 03 00 00 CB 
B4 2A B9 52 22 B6 71 9F 26 E0 92 04 8E 90 10 06 EC 08 09 00 C0 A6 3A 59 B6 52 22 EE 36 7C 83 80 
13 03 8E 90 10 0C CC 34 00 00 B0 46 99 2F D6 AA E5 8E 41 7B 2C EC DD D8 1E 0B 23 B0 E0 51 60 30 
D3 00 00 C0 02 AD 4A 5E 95 3B C6 D2 DE AD 47 D8 29 A1 26 06 1C 21 21 3C 98 69 00 00 30 B5 3A 59 
76 8D 34 56 C0 5D 12 38 42 42 A8 10 1A 00 00 4C AA 46 1A AB 51 9C 15 70 62 C0 11 12 02 86 D0 00 
00 60 22 54 5F 25 55 92 60 7B 2C 8C A0 8E 90 B0 72 71 C3 11 12 42 85 D0 00 00 60 0A D4 56 8F DD 
FC 36 D8 B8 47 B0 3D 16 E3 43 47 A5 99 C0 42 48 00 00 C6 A9 AF 6D AE F9 3D D6 21 68 8F 20 13 83 
32 2F 0B 1D 95 66 02 33 0D 00 00 0C 12 F6 56 8F E8 A8 34 37 98 69 00 00 60 8A E6 FE D9 AA DC 31 
A2 DE 81 8E C1 7B D8 1E 8B F1 A1 A3 D2 0C 61 A6 01 00 80 11 02 3E 7D 0A 1D 95 66 0B A1 01 00 C0 
C8 84 5D 92 40 47 A5 39 43 68 00 00 30 26 AA 4B C2 CE 7B 89 F0 CE 92 A0 3A 2A ED 7C 47 A1 A3 D2 
6C 21 34 00 00 18 8D 50 4B 12 F4 82 47 74 54 9A 39 84 06 00 00 23 10 70 49 42 91 95 A2 C8 4A E9 
35 23 A6 57 22 EA 11 9D A4 B1 EF C5 F6 10 8C 03 A1 01 00 A0 AB 84 5A 92 A0 27 18 B0 E0 B1 D3 4A 
2A 6A BF FA ED 8E FC B9 65 25 15 B5 03 7A DA B2 3D 9C AE 42 CB 25 00 40 97 D0 1B 37 09 2C 31 E8 
76 54 22 31 74 42 49 45 6D C2 B1 62 8F 35 12 42 88 C7 2F 1F 0A 20 31 10 CC 34 00 00 74 9A 50 4B 
12 9A 32 99 3C 3E C2 CA C5 CD 2B BB 94 ED B1 F0 12 35 BB 90 78 BC 38 7E A2 47 53 4A 28 21 44 30 
DB 74 20 34 00 00 74 86 56 25 57 4A C4 36 EE D3 84 34 C1 80 23 24 BA 48 37 2E 14 C7 05 09 63 76 
41 17 42 03 00 40 87 51 5D 12 DD 86 6F 10 52 97 84 AA 40 22 8F 8F E8 35 23 06 1D 95 9D 20 F8 B8 
40 41 68 00 00 E8 18 65 BE 58 AB 96 3B 06 ED B1 B0 77 63 7B 2C C6 81 23 24 BA C2 4C E2 02 05 0B 
21 01 00 0C A5 55 C9 AB 72 C7 58 DA BB F5 08 3B 25 98 C4 80 23 24 BA 82 5E EA 58 1C 17 94 F0 37 
0F 61 27 06 82 99 06 00 00 03 D5 C9 B2 6B A4 B1 42 DA B8 09 47 48 74 45 C2 B1 E2 C4 E3 C5 21 83 
7A 08 7E 76 41 17 42 03 00 40 FB 6A A4 B1 1A C5 59 21 25 06 1C 21 D1 69 E6 19 17 28 08 0D 00 00 
6D A1 FA 2A A9 92 04 DB 63 31 0E EA 08 09 2B 17 37 2C 78 EC 28 73 8E 0B 14 84 06 00 80 56 51 5B 
3D 76 F3 DB 60 E3 1E C1 F6 58 8C 00 1D 95 9D 86 B8 40 41 68 00 00 68 99 C0 4E 9F 52 E6 65 DD DD 
BE 14 1D 95 1D 95 70 AC 38 F3 C2 9D 01 4E B6 66 1E 17 28 08 0D 00 00 FA 04 B6 D5 23 3A 2A 3B 87 
8A 0B 84 90 2F 5F 7B 2A 64 90 13 DB C3 E1 04 84 06 00 80 FF 21 B0 D3 A7 70 46 65 27 20 2E B4 86 
07 A1 A1 B1 B1 F1 C2 85 0B 9E 9E 9E 3D 7B F6 34 E4 FE 3F FF FC B3 57 AF 5E 06 DE 0C 00 A0 4B 48 
25 09 74 54 76 02 E2 42 DB B8 1E 1A 32 32 32 B6 6E DD DA D0 D0 40 08 19 3D 7A F4 A6 4D 9B 1C 1D 
1D DB B8 BF B4 B4 54 2C 16 AF 5B B7 2E 2C 2C 8C BE 38 7C F8 70 B5 5A AD 7B DB 97 5F 7E 19 14 84 
39 3A 00 78 44 60 25 09 74 54 76 14 B5 AB 23 41 5C 68 13 A7 43 C3 E1 C3 87 53 53 53 D7 AC 59 33 
75 EA D4 C2 C2 C2 A8 A8 A8 55 AB 56 A5 A5 A5 B5 76 FF 8D 1B 37 22 23 23 AB AB AB 75 2F 96 97 97 
AB D5 EA 37 DF 7C 73 C8 90 21 F4 45 4F 4F 4F 06 C7 0D 00 7C 23 A4 92 04 75 84 84 63 C8 0C 2C 78 
34 D0 89 9B 95 91 7B 0B 09 E2 82 01 38 1D 1A 32 32 32 42 42 42 22 22 22 08 21 BE BE BE EF BD F7 
DE 8A 15 2B 4A 4A 4A 06 0C 18 A0 77 A7 46 A3 C9 C8 C8 C8 C8 C8 F0 F1 F1 29 2B 2B D3 FD D1 A5 4B 
97 08 21 F3 E7 CF 77 76 76 36 D5 C0 01 80 4F 04 53 92 C0 82 C7 8E 42 5C E8 28 13 9D 3D 71 FF FE 
FD DB B7 6F DF B8 71 43 26 93 55 55 55 19 F2 92 BA BA BA EB D7 AF 87 86 86 D2 57 26 4D 9A 44 08 
91 48 24 CD 6F AE A9 A9 C9 CC CC 5C BE 7C F9 E7 9F 7F AE F7 A3 A2 A2 22 07 07 07 24 06 00 68 4E 
AB 92 2B F3 C5 9A FB E7 7A 84 9D E2 7B 62 C0 11 12 1D 72 E2 66 A5 C7 1A 49 E4 DE 42 EA 94 29 24 
06 03 31 3B D3 70 E9 D2 A5 D8 D8 D8 DB B7 6F EB 5D B7 B3 B3 1B 3D 7A 74 42 42 42 EF DE BD 5B 7B 
ED 6F BF FD 46 08 71 71 71 A1 AF 88 44 22 5B 5B DB AB 57 AF 36 BF B9 5B B7 6E 27 4F 9E B4 B3 B3 
6B 9E 48 AE 5F BF EE EE EE 3E 67 CE 1C EA 0D 03 02 02 3E FE F8 E3 E6 73 15 00 60 6E 04 53 92 A0 
27 18 B0 E0 D1 10 F4 EC 42 FC 44 8F 37 47 B8 B2 3D 1C 9E 61 2A 34 9C 3F 7F 7E D1 A2 45 4A A5 D2 
C5 C5 25 34 34 F4 DD 77 DF B5 B3 B3 B3 B4 B4 6C 6C 6C 2C 2E 2E 4E 4D 4D 3D 7D FA 74 70 70 F0 B0 
61 C3 BE FC F2 CB C7 1F 7F BC F9 3B 34 36 36 12 42 44 22 91 EE 45 4B 4B 4B 8D 46 D3 FC 66 91 48 
A4 77 27 ED D2 A5 4B 55 55 55 51 51 51 73 E7 CE 2D 2F 2F DF B6 6D DB EB AF BF 7E F0 E0 C1 3E 7D 
FA B4 36 78 6F 6F 6F FA EB E8 E8 E8 C5 8B 17 1B F8 A9 01 80 2F 04 53 92 78 B4 E0 11 1D 95 ED 31 
65 5C D8 B6 6D 5B 1B 2B F0 F8 8B 91 D0 B0 70 E1 C2 9F 7F FE 79 C9 92 25 B3 67 CF 6E 1E 08 06 0C 
18 30 7E FC 78 42 48 69 69 E9 B2 65 CB 02 02 02 12 12 12 C4 62 31 13 23 21 84 7C F4 D1 47 AE AE 
AE BE BE BE D4 B7 FE FE FE 93 27 4F FE EA AB AF 56 AE 5C D9 DA 4B AE 5D BB C6 D0 60 00 80 75 82 
E9 92 D0 94 C9 E4 F1 11 38 42 C2 10 25 15 B5 91 7B AF 96 54 D6 9A 6C 76 61 F1 E2 C5 BA FF E0 D4 
FD B7 28 AF 19 3F 34 A8 54 AA FE FD FB 1B F2 77 B7 5F BF 7E FB F6 ED AB A8 A8 88 8B 8B 6B 1E 1A 
6C 6D 6D 09 21 7A F3 0A 8D 8D 8D AD CD 28 B4 46 B7 F7 92 10 32 70 E0 40 4F 4F CF 92 92 92 0E BD 
09 00 08 83 56 25 57 4A C4 36 EE D3 78 5D 92 C0 11 12 86 A3 E3 C2 9C 67 5D F3 FE E6 C1 F6 70 78 
CF F8 A1 C1 DE DE 3E 2E 2E CE F0 FB 7B F6 EC 99 9E 9E DE FC BA BF BF 3F 21 44 77 8D 82 46 A3 A9 
AD AD 1D 3A 74 A8 E1 6F 5E 55 55 75 E5 C5 8D 18 5C 00 00 20 00 49 44 41 54 CA 15 1F 1F 1F BD 85 
90 96 96 96 86 BF 09 00 08 03 55 92 E8 36 7C 03 AF 4B 12 54 47 25 8E 90 68 17 E2 02 13 4C D4 3D 
A1 67 FF FE FD C1 C1 C1 6D DF 23 12 89 86 0C 19 92 93 93 43 5F 39 7A F4 28 21 24 30 30 D0 F0 07 
55 54 54 CC 9F 3F 7F DF BE 7D F4 95 D2 D2 D2 5B B7 6E E9 EE D9 00 00 E6 40 99 2F AE 93 ED 77 E4 
F3 22 06 4D 99 4C 16 3F ED 5E DA 32 B7 C4 6C 6C D9 D4 86 92 8A DA F1 3B 2E 8E 4F BF 38 6E 90 53 
71 5C 50 02 12 83 F1 98 34 34 94 97 97 47 47 47 7B 7B 7B AF 5A B5 AA B2 B2 B2 DD FB E7 CD 9B F7 
F3 CF 3F 67 66 66 6A B5 DA 2B 57 AE 24 27 27 4F 98 30 81 6A 7C 90 48 24 D1 D1 D1 05 05 05 6D BF 
C3 C0 81 03 43 43 43 77 ED DA 95 97 97 47 08 B9 71 E3 C6 A2 45 8B 9C 9D 9D DF 78 E3 0D 63 7C 20 
00 E0 01 AD 4A 5E 95 3B C6 D2 DE AD 47 D8 29 0B 7B 37 B6 87 D3 49 E8 A8 34 04 E2 02 D3 4C B4 B9 
D3 AF BF FE BA 7A F5 EA BB 77 EF 12 42 9C 9C 9C 16 2E 5C 38 73 E6 CC 76 5F F5 E2 8B 2F CA 64 B2 
E4 E4 E4 4F 3F FD 94 10 32 76 EC D8 75 EB D6 51 3F 2A 2D 2D CD C9 C9 99 3E 7D 7A BB 6F B2 7E FD 
FA A4 A4 A4 45 8B 16 51 ED 18 01 01 01 5F 7F FD 75 DB 7B 51 03 80 60 D4 C9 B2 6B A4 B1 BC EE 92 
C0 11 12 86 28 A9 A8 4D 3C 5E 7C E2 66 25 8A 11 8C 7A AC A9 A9 89 B9 77 AF AA AA 4A 4D 4D DD BF 
7F 3F 75 78 04 21 E4 D8 B1 63 1C DF 23 C1 DB DB 1B DD 13 00 C2 50 23 8D D5 28 CE 3A 06 ED E1 F5 
04 03 8E 90 68 9B 6E 5C E0 EC D4 82 60 FE B2 30 35 D3 50 50 50 B0 64 C9 12 99 4C 46 08 E9 DF BF 
7F 52 52 92 BB BB FB C4 89 13 5D 5D B1 93 06 00 30 8E EA AB A4 4A 12 6C 8F A5 93 54 05 92 7B 69 
CB EC 7C 47 61 C1 63 6B 74 E3 42 71 1C 4A 36 A6 C0 48 68 18 33 66 4C 59 59 99 A3 A3 E3 5B 6F BD 
F5 F6 DB 6F 53 B5 80 E6 FB 42 02 00 30 81 DA EA B1 9B DF 06 1B F7 08 B6 C7 D2 19 E8 A8 6C 17 E2 
02 5B 18 09 0D 6A B5 DA DA DA 3A 24 24 E4 F5 D7 5F C7 EA 01 00 30 25 BE 6F F5 A8 CC CB BA BB 7D 
29 3A 2A 5B 83 B8 C0 2E 46 42 C3 0F 3F FC F0 F1 C7 1F 7F FF FD F7 DF 7F FF BD 83 83 C3 DF FF FE 
F7 79 F3 E6 31 F1 20 00 00 1A DF B7 7A C4 19 95 6D 2B A9 A8 FD EA B7 3B 99 17 EE 20 2E B0 88 D9 
85 90 A7 4F 9F 5E BD 7A F5 5F 7F FD 45 08 E9 DF BF FF 5F 7F FD 25 95 4A ED ED ED 99 7B 62 D7 09 
66 B9 0A 80 59 E1 FB E9 53 8A AC 14 45 56 4A AF 19 31 58 F0 D8 9C 6E 5C E0 EC 52 C7 B6 09 E6 2F 
0B B3 2D 97 A3 47 8F FE E5 97 5F AA AA AA 76 EE DC F9 F5 D7 5F 13 42 FC FC FC 06 0D 1A B4 75 EB 
D6 C1 83 07 33 FA 68 00 30 1F BC 2E 49 3C 3A 42 02 1D 95 CD 60 76 81 6B 98 9D 69 D0 73 FB F6 ED 
77 DF 7D B7 A8 A8 88 10 62 6D 6D 7D E5 CA 15 93 3D DA 70 82 C9 83 00 E6 80 2E 49 38 06 EF 61 7B 
2C 9D 41 75 54 F6 9A 11 E3 38 7E 06 DB 63 E1 16 01 CC 2E E8 12 CC 5F 16 93 EE 08 F9 E4 93 4F 1E 
3A 74 E8 F2 E5 CB 49 49 49 58 20 09 00 5D A4 B9 7F B6 2A 77 8C A8 77 20 1F 13 83 AA 40 72 3D A2 
1F 21 C4 23 FD 1C 12 83 AE 92 8A DA 84 63 C5 E3 D3 2F 12 42 B0 AB 23 D7 98 74 A6 A1 35 E5 E5 E5 
7A 07 4A B1 48 30 79 10 40 D8 F8 7B FA 14 BD E0 11 1D 95 7A A8 D9 85 C4 E3 C5 F1 13 3D 04 96 15 
04 F3 97 C5 F8 33 0D 2A 95 6A C8 90 21 99 99 99 86 DC FC F0 E1 C3 E8 E8 68 43 B6 94 06 00 A0 68 
55 72 65 BE 58 73 FF 5C 8F B0 53 BC 4B 0C 38 42 A2 45 D4 EC 82 C7 1A 09 21 A4 29 25 54 60 89 41 
48 8C 1F 1A EC ED ED 8F 1C 39 92 9E 9E FE CC 33 CF 7C F0 C1 07 A5 A5 A5 CD EF 51 A9 54 E7 CF 9F 
9F 38 71 62 40 40 80 5A AD FE E5 97 5F 8C 3E 0C 00 10 24 FE 96 24 A8 33 2A 95 79 59 1E 3B CE A1 
45 82 86 B8 C0 2F 8C 74 4F 3C F9 E4 93 67 CF 9E 3D 74 E8 D0 C7 1F 7F 7C E0 C0 01 42 48 AF 5E BD 
6C 6C 6C 2C 2D 2D B5 5A AD 52 A9 AC AE AE 26 84 B8 BB BB E7 E5 E5 F5 EB D7 8F 89 31 00 80 F0 F0 
B7 4B E2 D1 11 12 89 88 0B FF A1 5B 8C 68 4A 09 65 7B 38 60 10 06 5B 2E 5F 79 E5 95 57 5E 79 E5 
F6 ED DB DB B6 6D BB 78 F1 62 75 75 75 53 53 93 8D 8D 4D EF DE BD 63 62 62 5E 78 E1 05 AC 85 04 
00 03 F1 77 E3 26 EA 08 09 2B 17 37 EC F0 48 43 5C E0 2F C6 8F C6 7E F2 C9 27 37 6E DC C8 F4 53 
00 40 C0 78 BA 71 13 8E 90 68 0E 71 81 EF 4C DA 72 09 00 D0 51 EA 6B 9B 6B 7E 8F 75 08 DA C3 AF 
C4 A0 2A 90 14 2F 0C 24 84 60 C1 23 45 77 ED 02 1A 29 F9 8B F1 99 06 00 80 CE A1 4A 12 5A B5 DC 
31 68 8F 85 BD 1B DB C3 31 14 8E 90 D0 A3 3B BB 50 1C 17 34 A0 A7 2D DB 23 82 CE C3 4C 03 00 70 
91 56 25 57 4A C4 A2 DE 81 3D C2 4E F1 28 31 A0 A3 52 57 F3 D9 05 24 06 BE C3 4C 03 00 70 4E 9D 
2C BB 46 1A CB AF 2E 09 6A 82 81 10 82 23 24 28 09 C7 8A 31 BB 20 3C 08 0D 00 C0 2D CA 7C B1 56 
2D E7 DD 04 C3 7F 3A 2A B1 01 C3 7F E3 42 C8 A0 1E 88 0B C2 83 D0 00 00 5C 41 2D 62 B0 B4 77 E3 
D1 C6 4D 54 47 A5 9D EF 28 74 54 12 C4 05 33 C0 EC 9A 86 5B B7 6E BD F1 C6 1B CD AF 17 14 14 8C 
1B 37 4E AB D5 32 FA 74 00 E0 91 3A 59 76 55 EE 18 9B 27 A6 75 F3 DB C0 F6 58 0C A2 29 93 29 B2 
52 EE A5 2D EB 13 BD A9 6F F4 66 B6 87 C3 B2 84 63 C5 8F C5 FC F2 EB CD CA E2 B8 A0 BC 85 FE 48 
0C 42 C5 C8 4C 43 63 63 23 FD 45 51 51 11 FD 2D 45 AB D5 5E BE 7C F9 EE DD BB 75 75 75 76 76 76 
4C 0C 00 00 F8 85 77 5B 3D 2A F3 B2 EE 6E 5F DA 6B 46 0C 26 18 30 BB 60 56 18 09 0D D7 AF 5F 7F 
F5 D5 57 E9 6F 87 0C 19 D2 FC 1E 07 07 07 24 06 00 E0 DD 56 8F E8 A8 A4 25 1C 2B CE BC 70 67 80 
93 2D E2 82 F9 60 24 34 3C F5 D4 53 B3 67 CF 2E 2A 2A 22 84 9C 3F 7F 7E E4 C8 91 BA 3F 7D E6 99 
67 26 4C 98 F0 F4 D3 4F 33 F1 68 00 E0 11 DE 6D F5 A8 C8 4A 51 64 A5 F4 9A 11 63 E6 47 48 50 71 
81 10 F2 E5 6B 4F 85 0C 72 62 7B 38 60 3A 4C 2D 84 8C 8B 8B 23 84 DC BA 75 6B D5 AA 55 BB 77 EF 
66 E8 29 00 C0 5F FC 2A 49 68 CA 64 F2 F8 08 2B 17 37 33 EF A8 44 5C 30 73 CC 76 4F 0C 1C 38 70 
EF DE BD 8C 3E 02 00 78 87 5F 25 09 1C 21 41 41 5C 00 62 82 96 CB AA AA AA 77 DE 79 A7 BC BC 5C 
EF BA 85 85 45 6E 6E 2E D3 4F 07 00 AE E1 57 49 42 55 20 91 C7 47 98 F9 82 47 6A 13 68 82 B8 00 
4C 87 86 C6 C6 C6 C0 C0 40 42 88 93 93 93 8D 8D 8D EE 8F 9A 9A 9A 18 7D 34 00 70 10 8F 4A 12 58 
F0 48 08 39 71 B3 32 72 6F 21 41 5C 80 FF 62 36 34 FC FA EB AF 84 90 EC EC EC A1 43 87 32 FA 20 
00 E0 38 7E 95 24 B0 E0 11 71 01 5A C4 6C 68 C8 CE CE 76 72 72 42 62 00 30 73 3C 2A 49 D0 13 0C 
66 BB E0 91 8E 0B F1 13 3D DE 1C E1 CA F6 70 80 5B 98 0D 0D 8B 17 2F 7E ED B5 D7 18 7D 04 00 70 
1C 8F 4A 12 8F 8E 90 30 CB 09 06 C4 05 68 17 B3 A1 E1 A9 A7 9E B2 B6 B6 CE C8 C8 78 E7 9D 77 18 
7D 10 00 70 10 8F 4A 12 D4 11 12 56 2E 6E E6 B9 E0 11 71 01 0C C4 6C 68 B8 75 EB 96 BB BB 7B 6A 
6A 6A 7A 7A BA 93 93 D3 63 8F 3D 46 FF 08 DD 13 00 C2 C6 97 92 84 99 77 54 96 54 D4 46 EE BD 5A 
52 59 8B B8 00 86 60 BC E5 52 A1 50 F4 ED DB 97 10 A2 77 3C 15 BA 27 00 04 8C 2F 25 09 73 EE A8 
A4 E3 C2 9C 67 5D F3 FE E6 C1 F6 70 80 1F 18 DF DC 89 6A A0 00 00 33 41 95 24 B4 6A B9 63 D0 1E 
0B 7B 37 B6 87 D3 2A 73 EE A8 44 5C 80 4E 63 7C A6 81 A2 D5 6A CB CB CB 1B 1B 1B FB F5 EB A7 52 
A9 EC ED ED 4D F3 5C 00 30 25 AD 4A AE 94 88 6D DC A7 D9 79 EF 61 7B 2C 6D 31 DB 8E 4A C4 05 E8 
22 53 84 86 77 DF 7D F7 D8 B1 63 84 10 77 77 F7 DC DC DC B1 63 C7 86 84 84 6C DC B8 D1 04 8F 06 
00 93 A9 93 65 D7 48 63 39 5E 92 A0 26 18 08 21 E6 D6 51 89 B8 00 46 C1 78 68 78 E5 95 57 8A 8A 
8A 26 4C 98 A0 50 28 14 0A 05 21 C4 CF CF EF 87 1F 7E 10 89 44 6B D7 AE 65 FA E9 00 60 1A CA 7C 
B1 56 2D EF 11 76 8A CB 25 89 47 1D 95 33 CC 68 82 A1 A4 A2 36 F1 78 F1 89 9B 95 88 0B D0 75 16 
8C BE FB ED DB B7 8B 8A 8A 0E 1F 3E BC 63 C7 0E FA E2 E7 9F 7F BE 74 E9 D2 03 07 0E E8 2D 8D 04 
00 3E D2 AA E4 CA 7C B1 A5 BD 1B 97 13 83 AA 40 52 BC 20 50 53 26 F3 48 3F 67 3E 89 A1 A4 A2 36 
72 6F E1 F8 F4 8B 4F 3A D9 16 C7 05 25 20 31 40 97 31 3B D3 F0 E5 97 5F F6 ED DB D7 D3 D3 53 EF 
FA DF FF FE F7 CD 9B 37 57 54 54 F4 EE DD 9B D1 01 00 00 A3 A8 92 44 37 BF 0D 36 EE 11 6C 8F A5 
65 9A 32 99 22 2B 45 5D 70 C6 AC 3A 2A 75 67 17 8A E3 CC E5 53 83 09 30 1B 1A 2C 2C 2C 5A 9C 4E 
A0 2E 5A 59 99 68 19 26 00 30 A1 46 1A AB 51 9C E5 F2 22 06 7A C1 63 DF E8 CD 6C 8F C5 44 10 17 
80 51 CC FE D9 9E 33 67 CE 37 DF 7C 73 F1 E2 45 7F 7F 7F DD EB 49 49 49 D6 D6 D6 3D 7A F4 60 F4 
E9 00 C0 10 EE 6F F5 68 86 1D 95 88 0B 60 02 CC 86 86 27 9F 7C D2 D7 D7 57 2C 16 3F FF FC F3 D4 
95 D3 A7 4F AF 5E BD FA AF BF FE 5A BE 7C 39 A3 8F 06 00 86 70 7F AB 47 73 EB A8 2C A9 A8 FD EA 
B7 3B 99 17 EE 20 2E 00 D3 18 2F 10 1C 38 70 60 C1 82 05 39 39 39 D4 B7 F3 E6 CD 23 84 BC FF FE 
FB 91 91 91 4C 3F 1A 00 8C 8E E3 5B 3D 6A CA 64 F2 F8 08 2B 17 37 AF EC 52 B6 C7 62 0A 88 0B 60 
62 8C 87 06 AD 56 9B 9E 9E 5E 57 57 57 56 56 A6 D1 68 6C 6D 6D FB F5 EB C7 F4 43 01 C0 E8 38 5E 
92 30 B7 23 24 10 17 80 15 CC B6 5C 4A A5 D2 A7 9E 7A EA C6 8D 1B 36 36 36 EE EE EE 03 07 0E 44 
62 00 E0 23 CD FD B3 55 B9 63 44 BD 03 1D 83 B9 B8 D5 A3 AA 40 52 BC 30 90 10 E2 91 7E 4E F0 89 
A1 A4 A2 36 E1 58 F1 F8 F4 8B 84 10 34 52 82 89 31 3B D3 B0 77 EF 5E 42 48 FF FE FD 19 7D 0A 00 
30 8A CB 25 09 B3 5A F0 88 D9 05 60 1D B3 33 0D 71 71 71 84 90 2F BE F8 82 D1 A7 00 00 43 A8 8D 
9B 34 F7 CF F5 08 3B C5 C1 C4 A0 C8 4A 29 5E 18 68 EF 1B 24 F8 09 06 6A 76 C1 63 8D 84 60 76 01 
58 C5 EC 4C C3 FD FB F7 7D 7C 7C B6 6D DB 96 91 91 D1 B3 67 4F 4B 4B 4B FA 47 16 16 16 B9 B9 B9 
8C 3E 1D 00 BA 82 CB 5D 12 F4 04 83 E0 8F 90 A0 66 17 12 8F 17 C7 4F F4 68 4A 09 65 7B 38 60 EE 
18 5F 08 79 FF FE 7D 6A DB C7 86 86 86 86 86 06 FA BA 85 05 B3 93 1C 00 D0 15 5C 2E 49 3C 3A 42 
42 D0 1D 95 88 0B C0 41 CC 86 86 81 03 07 9E 3A 75 0A F9 00 80 47 B8 DC 25 A1 2A 90 DC 4B 5B 66 
E5 E2 E6 91 7E 8E ED B1 30 08 71 01 38 CB 44 DD 13 8C 3E 05 00 8C 85 B3 5D 12 D4 11 12 F7 D2 96 
F5 89 DE E4 9E B8 9F ED E1 30 45 77 ED 42 53 4A 28 D6 2E 00 D7 A0 7B 02 00 FE 83 B3 25 09 65 5E 
D6 DD ED 4B 7B CD 88 11 F0 04 03 66 17 80 17 D0 3D 01 00 DC ED 92 D0 94 C9 64 F1 D3 14 59 29 6E 
89 D9 42 3D D2 1A 9D 11 C0 23 E8 9E 00 30 77 5A 95 5C 29 11 DB B8 4F E3 5A 97 84 E0 8F 90 D0 9D 
5D 28 8E 0B 1A D0 D3 96 ED 11 01 B4 03 DD 13 00 66 AD 4E 96 AD BE B6 A5 DB F0 0D 5C 9B 60 B8 BB 
7D 29 21 44 A8 1D 95 88 0B C0 53 8C 77 4F E4 E7 E7 33 FA 08 00 E8 34 65 BE 58 AB 96 3B 06 ED B1 
B0 77 63 7B 2C 8F 3C EA A8 14 68 3D 22 E1 58 31 E2 02 F0 14 E3 33 0D 00 C0 41 54 49 42 D4 EB 39 
4E 75 49 50 1D 95 76 BE A3 84 BA E0 91 8A 0B 6F 8E 70 45 5C 00 9E 62 36 34 DC BA 75 EB ED B7 DF 
6E F1 47 16 16 16 C7 8F 1F 67 F4 E9 00 D0 A2 3A 59 76 8D 34 96 53 5D 12 54 47 A5 BA E0 8C 50 CF 
A8 A4 E2 42 C8 A0 1E 88 0B C0 6B 8C CF 34 3C 7C F8 50 F7 DB FA FA FA 9A 9A 1A 42 C8 A0 41 83 98 
7E 34 00 34 57 23 8D D5 28 CE 72 2A 31 D0 0B 1E FB 46 6F 66 7B 2C C6 87 B8 00 42 C2 F8 9A 86 B3 
67 CF EA 5D 7C F8 F0 E1 D8 B1 63 A7 4F 9F CE E8 A3 01 40 0F B5 D5 A3 A5 BD 1B 77 B6 7A 14 F6 11 
12 88 0B 20 3C 2C B4 30 3C FE F8 E3 D9 D9 D9 EB D6 AD 33 FD A3 01 CC 16 BD D5 63 37 BF 0D 6C 8F 
E5 3F 74 CF A8 14 58 62 A0 F6 5D F8 F5 66 65 71 5C 50 DE 42 7F 24 06 10 0C 76 16 42 3A 3A 3A 12 
9D 6E 4C 00 60 14 D7 B6 7A D4 94 C9 E4 F1 11 56 2E 6E 5E D9 A5 6C 8F C5 C8 12 8E 15 67 5E B8 43 
08 F9 F2 B5 A7 42 06 39 B1 3D 1C 00 23 63 27 34 50 DB 4B DB DA 22 7D 03 30 8B 6B A7 4F 69 CA 64 
CA 13 59 CA BC 2C E1 2D 78 44 5C 00 73 60 EA EE 09 AD 56 AB D1 68 CA CA CA FC FC FC 1E 7F FC 71 
46 9F 0E 60 E6 34 F7 CF 56 4B C4 76 DE 4B 38 B2 D5 A3 AA 40 22 8F 8F 10 DE 11 12 88 0B 60 3E 18 
9F 69 50 AB D5 7A 57 AC AD AD C5 62 71 42 42 02 D3 8F 06 30 67 9C 2A 49 D0 0B 1E DD 12 B3 85 34 
C1 40 ED EA 48 10 17 C0 6C 60 47 48 00 A1 E1 5A 49 42 90 47 48 9C B8 59 19 B9 B7 90 20 2E 80 99 
C1 8E 90 00 82 C2 A9 92 84 20 8F 90 40 5C 00 73 66 EA D0 A0 56 AB ED EC EC 4C FC 50 00 33 C1 A9 
92 84 F0 8E 90 A0 E3 42 FC 44 8F 37 47 B8 B2 3D 1C 00 16 30 18 1A 56 AE 5C 79 FE FC F9 BC BC 3C 
FA CA ED DB B7 27 4E 9C 38 72 E4 C8 DD BB 77 33 F7 5C 00 33 C4 A9 92 04 75 84 84 95 8B 9B 60 16 
3C 22 2E 00 50 98 0A 0D 41 41 41 0A 85 A2 77 EF DE 5A AD 96 3E 05 DB C2 C2 A2 7F FF FE E7 CF 9F 
F7 F5 F5 2D 28 28 60 E8 D1 00 E6 86 3B 25 09 E1 75 54 22 2E 00 E8 62 64 47 C8 55 AB 56 29 14 8A 
E4 E4 E4 FC FC 7C 3A 31 10 42 DC DD DD 7F F9 E5 97 6D DB B6 35 34 34 2C 5C B8 90 89 47 03 98 1B 
F5 B5 CD 35 BF C7 3A 04 ED 61 3D 31 28 F3 B2 8A 17 06 12 42 3C D2 CF 09 20 31 94 54 D4 8E DF 71 
31 72 6F 21 75 86 35 12 03 00 61 68 A6 E1 E8 D1 A3 C3 86 0D 7B E5 95 57 5A FC E9 C4 89 13 27 4D 
9A 74 F4 E8 D1 AE 3F A8 B1 B1 F1 C2 85 0B 9E 9E 9E 3D 7B F6 34 E4 FE 3F FF FC B3 57 AF 5E 06 DE 
0C C0 71 DC 29 49 08 AC A3 B2 A4 A2 36 72 EF D5 92 CA DA 39 CF BA E6 FD CD 83 ED E1 00 70 88 F1 
67 1A 34 1A 4D 4D 4D 4D 52 52 52 1B F7 AC 58 B1 82 10 52 55 55 D5 95 07 65 64 64 0C 1B 36 6C F6 
EC D9 A3 46 8D 9A 37 6F 9E 52 A9 6C FB FE D2 D2 52 B1 58 7C F1 E2 C5 AE 3C 14 80 23 B4 2A B9 52 
22 16 F5 0E 74 0C DE C3 EE 48 74 8F 90 E0 7B 62 A0 66 17 C6 A7 5F 1C 37 C8 A9 38 2E 28 01 89 01 
E0 7F 19 7F A6 41 AB D5 B6 7B 8F A5 A5 A5 81 77 B6 E6 F0 E1 C3 A9 A9 A9 6B D6 AC 99 3A 75 6A 61 
61 61 54 54 D4 AA 55 AB D2 D2 D2 5A BB FF C6 8D 1B 91 91 91 D5 D5 D5 9D 7E 22 00 77 D4 C9 B2 D5 
D7 B6 74 1B BE 81 DD 2E 09 21 75 54 62 76 01 C0 10 C6 9F 69 B0 B1 B1 B1 B5 B5 DD B7 6F 5F 1B F7 
9C 38 71 82 10 D2 BD 7B F7 4E 3F 25 23 23 23 24 24 24 22 22 C2 C2 C2 C2 D7 D7 F7 BD F7 DE CB C9 
C9 29 29 29 69 7E A7 46 A3 49 4B 4B 0B 0F 0F EF DB B7 6F A7 1F 07 C0 1D CA 7C B1 FA DA 16 47 B6 
FB 2A 15 59 29 F2 F8 08 7B DF 20 F7 C4 FD BC 4E 0C 98 5D 00 30 1C 23 0B 21 C7 8D 1B B7 67 CF 9E 
C6 C6 C6 D6 6E 58 BB 76 AD 8B 8B 0B 35 DF D0 09 75 75 75 D7 AF 5F 0F 0D 0D A5 AF 4C 9A 34 89 10 
22 91 48 9A DF 5C 53 53 93 99 99 B9 7C F9 F2 CF 3F FF BC 73 8F 03 E0 08 AD 4A 5E 95 3B C6 D2 DE 
AD 47 D8 29 0B 7B 37 B6 86 A1 2A 90 14 2F 08 D4 94 C9 3C D2 CF F1 7A 0F 86 92 8A DA C8 BD 85 88 
0B 00 86 63 64 21 E4 86 0D 1B 8E 1D 3B 36 6C D8 B0 03 07 0E 78 7B 7B EB FE E8 CE 9D 3B E1 E1 E1 
F5 F5 F5 5B B7 6E ED F4 FB FF F6 DB 6F 84 10 17 17 17 FA 8A 48 24 B2 B5 B5 BD 7A F5 6A F3 9B BB 
75 EB 76 F2 E4 49 3B 3B 3B C3 97 50 E8 8E 39 3A 3A 7A F1 E2 C5 9D 1E 2A 80 B1 D4 C9 B2 6B A4 B1 
EC 6E DC 44 2F 78 E4 7B 47 65 49 45 6D E2 F1 E2 13 37 2B E7 3C EB 5A 1C C7 E3 0F 02 9C B5 6D DB 
B6 36 2A E6 FC C5 48 68 B0 B1 B1 D9 BD 7B F7 AC 59 B3 5E 7E F9 65 5B 5B 5B 67 67 67 5B 5B DB DA 
DA DA 8A 8A 8A 9A 9A 1A 42 48 52 52 92 9F 9F 5F A7 DF 9F 9A C3 10 89 44 BA 17 2D 2D 2D 35 1A 4D 
F3 9B 45 22 91 DE 9D ED BA 76 ED 5A A7 C7 06 C0 84 1A 69 AC 46 71 96 DD C4 20 8C 23 24 10 17 C0 
34 16 2F 5E AC FB 0F 4E BD 7F 3F F3 17 53 9B 3B 8D 1C 39 F2 8F 3F FE 48 4C 4C 3C 76 EC 98 4C 26 
A3 2E 3A 39 39 4D 99 32 25 2E 2E 0E 3B 49 03 18 88 EA AB A4 4A 12 6C 8D 81 9E 60 E0 F5 82 47 C4 
05 80 AE 63 70 1B 69 91 48 F4 C9 27 9F 7C F2 C9 27 46 7F 67 5B 5B 5B 42 88 DE BC 42 63 63 63 47 
67 14 00 38 8E DA EA B1 9B DF 06 1B F7 08 B6 C6 F0 E8 08 09 DE 4E 30 20 2E 00 18 0B 2F 4F B9 F4 
F7 F7 27 FF BB CD 83 46 A3 A9 AD AD 1D 3A 74 28 7B 83 02 30 32 D6 4F 9F D2 94 C9 E4 F1 11 BC 3E 
42 A2 A4 A2 F6 AB DF EE 64 5E B8 83 B8 00 60 14 BC 0C 0D 22 91 68 C8 90 21 39 39 39 E1 E1 E1 D4 
15 6A 7F C9 C0 C0 40 56 C7 05 60 1C AC 6F F5 28 80 23 24 10 17 00 98 C0 48 CB A5 09 CC 9B 37 EF 
E7 9F 7F CE CC CC D4 6A B5 57 AE 5C 49 4E 4E 9E 30 61 C2 80 01 03 08 21 12 89 24 3A 3A 1A 07 62 
01 4F 69 EE 9F AD CA 1D C3 E2 56 8F AA 02 09 AF 8F 90 28 A9 A8 4D 38 56 3C 3E FD 22 21 04 8D 94 
00 C6 C5 CB 99 06 42 C8 8B 2F BE 28 93 C9 92 93 93 3F FD F4 53 42 C8 D8 B1 63 D7 AD 5B 47 FD A8 
B4 B4 34 27 27 67 FA F4 E9 AC 0E 10 A0 33 D8 2D 49 F0 FD 08 09 CC 2E 00 30 ED B1 A6 A6 26 B6 C7 
C0 2D DE DE DE 68 B9 04 D3 A3 4B 12 6C 4D 30 3C EA A8 E4 E1 7E 4D BA 71 01 53 0B C0 41 82 F9 CB 
C2 D7 99 06 00 21 A1 BA 24 EC BC 97 B0 72 BC 35 AF 8F 90 A0 E2 42 E2 F1 62 EA 00 6B B6 87 03 20 
70 08 0D 00 2C 63 B7 24 F1 A8 A3 92 6F 13 0C BA 71 A1 29 25 B4 FD 17 00 40 97 21 34 00 B0 86 DD 
2E 09 55 81 E4 5E DA 32 3E 76 54 22 2E 00 B0 05 A1 01 80 1D 2C 96 24 F8 DB 51 89 B8 00 C0 2E 84 
06 00 16 B0 58 92 50 E6 65 DD DD BE B4 D7 8C 18 7E 4D 30 20 2E 00 70 01 42 03 80 49 B1 58 92 E0 
69 47 25 E2 02 00 77 F0 75 73 27 00 3E D2 AA E4 4A 89 98 95 8D 9B 14 59 29 C5 0B 03 ED 7D 83 78 
B4 65 13 B5 4D 93 C7 1A 09 C1 36 4D 00 DC 80 99 06 00 13 A1 4A 12 DD 86 6F 30 71 49 82 8F 1D 95 
7A 8D 94 03 7A DA B2 3D 22 00 20 04 A1 01 C0 34 94 F9 62 AD 5A EE 18 B4 C7 C2 DE CD 94 CF A5 3A 
2A 7B CD 88 71 1C 3F C3 94 CF ED 34 C4 05 00 2E 43 79 02 80 59 5A 95 BC 2A 77 8C A5 BD 5B 8F B0 
53 A6 4C 0C AA 02 C9 F5 88 7E 84 10 8F F4 73 7C 49 0C 7A C5 08 24 06 00 AE C1 4C 03 00 83 EA 64 
D9 35 D2 58 13 77 49 F0 71 C1 63 C2 B1 E2 C4 E3 C5 21 83 7A 60 76 01 80 CB 10 1A 00 98 52 23 8D 
D5 28 CE 9A 78 82 E1 D1 11 12 89 FC D8 E1 11 71 01 80 47 10 1A 00 8C 8F EA AB A4 4A 12 26 7B 28 
3D C1 C0 97 05 8F 88 0B 00 BC 83 D0 00 60 64 D4 56 8F DD FC 36 D8 B8 47 98 EC A1 8F 8E 90 E0 C3 
04 03 E2 02 00 4F 21 34 00 18 93 E9 B7 7A E4 D7 11 12 09 C7 8A 33 2F DC 19 E0 64 8B B8 00 C0 47 
08 0D 00 C6 61 FA AD 1E F9 75 84 04 1D 17 F2 16 F8 23 2E 00 F0 14 42 03 80 11 98 FE F4 29 55 81 
44 1E 1F C1 8B 23 24 A8 B8 40 08 F9 F2 B5 A7 42 06 39 B1 3D 1C 00 E8 3C 84 06 80 AE 32 71 49 82 
47 1D 95 88 0B 00 02 83 D0 00 D0 79 A6 2F 49 F0 A5 A3 12 71 01 40 90 10 1A 00 3A C9 C4 25 09 BE 
1C 21 71 E2 66 65 E4 DE 42 82 B8 00 20 44 08 0D 00 9D 61 E2 92 C4 A3 8E CA 19 DC 9D 60 40 5C 00 
10 3C 84 06 80 8E 31 71 49 82 EA A8 B4 F3 1D C5 E5 05 8F 74 5C 88 9F E8 F1 E6 08 57 B6 87 03 00 
4C 41 68 00 E8 00 53 96 24 78 D1 51 89 B8 00 60 56 10 1A 00 0C 65 CA 92 84 32 2F EB EE F6 A5 5C 
EE A8 44 5C 00 30 43 08 0D 00 ED 33 65 49 82 FB 1D 95 25 15 B5 91 7B AF 96 54 D6 22 2E 00 98 1B 
84 06 80 76 68 55 F2 AA DC 31 A6 29 49 70 BC A3 12 71 01 C0 CC 21 34 00 B4 C5 64 25 09 4D 99 4C 
1E 1F 61 E5 E2 C6 CD 8E 4A 3A 2E CC 79 D6 35 EF 6F 1E 6C 0F 07 00 D8 81 D0 00 D0 2A 65 BE 58 AB 
96 3B 06 ED B1 B0 77 63 EE 29 1C 5F F0 88 B8 00 00 34 84 06 80 16 68 55 72 A5 44 2C EA F5 9C 63 
F0 1E 46 1F C4 E5 23 24 10 17 00 40 0F 42 03 80 BE 3A 59 76 8D 34 96 E9 92 04 97 17 3C 96 54 D4 
26 1E 2F 3E 71 B3 12 71 01 00 74 21 34 00 FC 8F 1A 69 AC 46 71 B6 47 D8 29 46 4B 12 9C 5D F0 A8 
1B 17 8A E3 B8 15 65 00 80 75 08 0D 00 FF 41 F5 55 5A DA BB 31 DA 57 49 4F 30 70 6D C1 23 E2 02 
00 B4 0B A1 01 80 90 FF 6E F5 D8 CD 6F 83 8D 7B 04 73 4F 79 74 84 04 97 26 18 10 17 00 C0 40 08 
0D 00 A6 E8 AB A4 8E 90 B0 72 71 E3 D4 82 47 C4 05 00 E8 10 84 06 30 6B 26 D8 EA 91 9B 1D 95 25 
15 B5 5F FD 76 27 F3 C2 1D C4 05 00 30 9C 05 DB 03 00 60 8D E6 FE D9 AA DC 31 A2 DE 81 CC F5 55 
AA 0A 24 C5 0B 03 09 21 1E E9 E7 38 92 18 4A 2A 6A 13 8E 15 8F 4F BF 48 08 29 8E 0B 4A 40 73 04 
00 18 0C 33 0D 60 A6 98 2E 49 70 B0 A3 12 B3 0B 00 D0 45 08 0D 60 76 4C 50 92 E0 5A 47 25 E2 02 
00 18 05 42 03 98 17 AA 4B 82 B9 D3 A7 A8 09 06 42 08 47 3A 2A 11 17 00 C0 88 10 1A C0 8C 30 5D 
92 78 D4 51 39 83 FD 09 06 2A 2E 24 1E 2F 8E 9F E8 81 B8 00 00 46 81 D0 00 66 81 E9 92 04 D5 51 
69 E7 3B 8A 0B 1D 95 BA 71 A1 29 25 94 ED E1 00 80 70 20 34 80 F0 31 5A 92 D0 94 C9 14 59 29 EA 
82 33 5C E8 A8 44 5C 00 00 46 21 34 80 C0 31 5A 92 50 E6 65 DD DD BE B4 D7 8C 98 BE D1 9B 8D FE 
E6 1D 82 B8 00 00 26 80 D0 00 82 C5 68 49 82 3B 1D 95 88 0B 00 60 32 D8 DC 09 84 89 D1 8D 9B 14 
59 29 C5 0B 03 ED 7D 83 D8 DD B2 89 DA A6 C9 63 8D 84 10 D2 94 12 8A 6D 9A 00 80 69 98 69 00 01 
62 AE 24 A1 29 93 C9 E3 23 AC 5C DC BC B2 4B 8D FB CE 1D A2 D7 19 31 A0 A7 2D 8B 83 01 00 F3 81 
D0 00 82 42 95 24 B4 6A B9 63 D0 1E 0B 7B 37 23 BE 33 47 8E 90 40 5C 00 00 16 A1 3C 01 C2 A1 55 
C9 95 12 B1 A8 77 60 8F B0 53 C6 4D 0C 5C 38 42 42 B7 18 41 9D 19 81 C4 00 00 26 86 99 06 10 88 
3A 59 76 8D 34 D6 E8 25 09 8E 2C 78 4C 38 56 8C D9 05 00 60 1D 42 03 08 81 32 5F AC 55 CB 8D 3E 
C1 C0 85 23 24 A8 B8 10 32 A8 07 E2 02 00 B0 0E A1 01 F8 8D 5A C4 60 69 EF 66 DC 2E 09 7A 82 81 
C5 23 24 10 17 00 80 6B 10 1A 80 C7 A8 92 44 37 BF 0D 36 EE 11 46 7C DB 47 47 48 B0 34 C1 80 B8 
00 00 DC 84 D0 00 7C 55 23 8D D5 28 CE 1A 77 11 03 75 84 84 95 8B 1B 5B 47 48 20 2E 00 00 97 21 
34 00 FF 30 B1 D5 23 EB 1D 95 09 C7 8A 33 2F DC 19 E0 64 8B B8 00 00 9C 85 D0 00 3C C3 C4 E9 53 
F4 11 12 AC 4C 30 D0 71 21 6F 81 3F E2 02 00 70 19 42 03 F0 89 D1 B7 7A 64 B7 A3 92 8A 0B 84 90 
2F 5F 7B 2A 64 90 93 89 9F 0E 00 D0 51 08 0D C0 0F 4C 94 24 58 EC A8 44 5C 00 00 3E 42 68 00 1E 
30 7A 49 82 9A 60 20 84 98 BE A3 12 71 01 00 F8 0B A1 01 B8 CE E8 25 89 47 1D 95 33 4C 3A C1 70 
E2 66 65 E4 DE 42 82 B8 00 00 BC 85 D0 00 DC 65 F4 92 04 D5 51 69 E7 3B CA C4 0B 1E 11 17 00 40 
18 10 1A 80 A3 8C 5B 92 D0 94 C9 14 59 29 EA 82 33 26 EE A8 A4 E3 42 FC 44 8F 37 47 B8 9A EC B9 
00 00 4C 40 68 00 2E 32 6E 49 82 5E F0 D8 37 7A 73 D7 DF CD 40 88 0B 00 20 3C 08 0D C0 2D C6 2D 
49 B0 72 84 04 E2 02 00 08 15 42 03 70 88 71 4B 12 A6 EF A8 2C A9 A8 8D DC 7B B5 A4 B2 16 71 01 
00 04 09 A1 01 B8 C2 88 25 09 4D 99 4C 1E 1F 61 E5 E2 E6 95 5D 6A 94 B1 B5 0B 71 01 00 CC 01 42 
03 B0 8F 2A 49 68 D5 F2 AE 97 24 4C 7F 84 04 1D 17 E6 3C EB 9A F7 37 0F 13 3C 11 00 80 2D 08 0D 
C0 32 AD 4A AE 94 88 6D DC A7 D9 79 EF E9 E2 5B A9 0A 24 F2 F8 08 93 1D 21 81 B8 00 00 E6 06 A1 
01 D8 54 27 CB AE 91 C6 76 BD 24 61 E2 23 24 10 17 00 C0 3C 21 34 00 6B 94 F9 62 AA 24 61 61 EF 
D6 95 F7 31 E5 82 C7 92 8A DA C4 E3 C5 27 6E 56 22 2E 00 80 19 42 68 00 16 50 8B 18 2C ED DD 1C 
83 BB 54 92 30 E5 11 12 BA 71 A1 38 CE D4 E7 61 02 00 70 01 42 03 98 1A 55 92 E8 E6 B7 C1 C6 3D 
A2 2B EF 63 B2 23 24 10 17 00 00 28 3C 08 0D 8D 8D 8D 17 2E 5C F0 F4 F4 EC D9 B3 A7 B1 EE 04 B6 
D4 48 63 35 8A B3 5D 5C C4 40 1D 21 61 E5 E2 C6 F4 82 47 C4 05 00 00 5D 5C 0F 0D 19 19 19 5B B7 
6E 6D 68 68 20 84 8C 1E 3D 7A D3 A6 4D 8E 8E 8E 1D BD 73 F8 F0 E1 6A B5 5A F7 E6 2F BF FC 32 28 
08 7F 03 4C CA 28 5B 3D 9A AC A3 12 71 01 00 A0 39 4E 87 86 C3 87 0F A7 A6 A6 AE 59 B3 66 EA D4 
A9 85 85 85 51 51 51 AB 56 AD 4A 4B 4B EB D0 9D E5 E5 E5 6A B5 FA CD 37 DF 1C 32 64 08 7D BF A7 
A7 A7 E9 3E 06 18 69 AB 47 65 5E D6 DD ED 4B 99 EE A8 2C A9 A8 FD EA B7 3B 99 17 EE 20 2E 00 00 
E8 E1 74 68 C8 C8 C8 08 09 09 89 88 88 20 84 F8 FA FA BE F7 DE 7B 2B 56 AC 28 29 29 19 30 60 80 
E1 77 5E BA 74 89 10 32 7F FE 7C 67 67 67 93 7F 02 20 C4 18 5B 3D 9A A6 A3 12 71 01 00 A0 6D 16 
6C 0F A0 55 75 75 75 D7 AF 5F 0F 0D 0D A5 AF 4C 9A 34 89 10 22 91 48 3A 74 67 51 51 91 83 83 03 
12 03 2B B4 2A B9 32 5F AC B9 7F AE 47 D8 A9 4E 27 06 45 56 4A F1 C2 40 7B DF 20 8F F4 73 0C 25 
86 92 8A DA 84 63 C5 E3 D3 2F 12 42 8A E3 82 12 D0 4B 09 00 D0 12 EE CE 34 FC F6 DB 6F 84 10 17 
17 17 FA 8A 48 24 B2 B5 B5 BD 7A F5 6A 87 EE BC 7E FD BA BB BB FB 9C 39 73 A8 DB 02 02 02 3E FE 
F8 E3 E6 73 15 60 74 5D 2F 49 98 A0 A3 12 B3 0B 00 00 86 E3 6E 68 68 6C 6C 24 84 88 44 22 DD 8B 
96 96 96 1A 8D A6 43 77 5E BA 74 A9 AA AA 2A 2A 2A 6A EE DC B9 E5 E5 E5 DB B6 6D 7B FD F5 D7 0F 
1E 3C D8 A7 4F 9F D6 1E ED ED ED 4D 7F 1D 1D 1D BD 78 F1 E2 2E 7F 1A B3 D3 F5 92 04 D3 1D 95 88 
0B 00 C0 9C 6D DB B6 B5 B8 02 8F EF B8 1B 1A 8C E5 A3 8F 3E 72 75 75 F5 F5 F5 A5 BE F5 F7 F7 9F 
3C 79 F2 57 5F 7D B5 72 E5 CA D6 5E 72 ED DA 35 53 8D 4E 80 BA DE 25 41 75 54 DA F9 8E 62 68 C1 
23 E2 02 00 30 6D F1 E2 C5 BA FF E0 D4 FD B7 28 AF 71 37 34 D8 DA DA 12 42 F4 E6 15 1A 1B 1B F5 
66 14 DA BD 33 2C 2C 4C F7 FA C0 81 03 3D 3D 3D 4B 4A 4A 18 18 32 74 B5 24 41 2F 78 64 A8 A3 92 
8A 0B 89 C7 8B E3 27 7A 20 2E 00 00 74 14 77 43 83 BF BF 3F 21 A4 AA AA 8A BE A2 D1 68 6A 6B 6B 
87 0E 1D 6A F8 9D 55 55 55 57 AE 5C F1 F1 F1 D1 5B 08 69 69 69 C9 E0 D0 CD 55 17 4B 12 8C 1E 21 
A1 1B 17 9A 52 42 DB 7F 01 00 00 34 C3 DD EE 09 91 48 34 64 C8 90 9C 9C 1C FA CA D1 A3 47 09 21 
81 81 81 86 DF 59 51 51 31 7F FE FC 7D FB F6 D1 3F 2A 2D 2D BD 75 EB 96 EE 9E 0D D0 75 5D EC 92 
D0 94 C9 64 F1 D3 94 79 59 1E 3B CE 19 7D 05 03 D5 19 E1 B1 46 42 08 69 4A 09 45 67 04 00 40 A7 
71 37 34 10 42 E6 CD 9B F7 F3 CF 3F 67 66 66 6A B5 DA 2B 57 AE 24 27 27 4F 98 30 81 6A 7C 90 48 
24 D1 D1 D1 05 05 05 6D DF 39 70 E0 C0 D0 D0 D0 5D BB 76 E5 E5 E5 11 42 6E DC B8 B1 68 D1 22 67 
67 E7 37 DE 78 83 C5 CF 25 30 9A FB 67 AB 72 C7 88 7A 07 76 EE F4 29 45 56 8A 3C 3E 82 EA A8 34 
6E 8B 04 E2 02 00 80 71 71 B7 3C 41 08 79 F1 C5 17 65 32 59 72 72 F2 A7 9F 7E 4A 08 19 3B 76 EC 
BA 75 EB A8 1F 95 96 96 E6 E4 E4 4C 9F 3E BD DD 3B D7 AF 5F 9F 94 94 B4 68 D1 22 AA C9 22 20 20 
E0 EB AF BF 6E 6D 2F 6A E8 A8 AE 94 24 34 65 32 79 7C 04 13 47 48 A0 18 01 C2 36 6B D6 AC F3 E7 
CF B3 3D 0A 20 84 90 91 23 47 EE DE BD 9B ED 51 98 CE 63 4D 4D 4D 6C 8F 81 5B BC BD BD D1 3D 61 
08 BA 4B A2 13 13 0C CC 1D 21 A1 1B 17 DE 1C E1 3A A0 A7 AD 11 DF 1C 80 23 F0 3F 53 DC 61 E0 7F 
0B C1 FC 27 E3 74 79 02 38 4B AB 92 2B 25 E2 CE 95 24 54 05 92 E2 85 81 84 10 E3 EE F0 A8 5B 8C 
A0 76 75 44 62 00 00 30 2E 4E 97 27 80 9B EA 64 D9 EA 6B 5B BA 0D DF D0 D1 92 04 43 47 48 E8 35 
52 22 2B 00 00 30 04 A1 01 3A 46 99 2F D6 AA E5 8E 41 7B 2C EC DD 3A F4 42 86 3A 2A 13 8E 15 23 
2E 00 00 98 06 42 03 18 EA 3F 25 89 5E CF 75 B4 24 C1 D0 11 12 54 5C 08 19 D4 03 71 01 00 C0 34 
10 1A C0 20 75 B2 EC 1A 69 6C 27 BA 24 98 38 42 02 71 01 00 80 15 08 0D D0 BE 1A 69 AC 46 71 B6 
A3 89 81 3A 42 C2 B8 1D 95 88 0B 00 00 2C 42 68 80 B6 50 7D 95 96 F6 6E 1D 3A 7D 8A 89 8E 4A C4 
05 00 5E 4B 4C 4C BC 74 E9 12 FD AD 85 85 45 F7 EE DD A3 A2 A2 46 8C 18 D1 F6 0B A7 4E 9D 1A 17 
17 17 10 10 60 AC 91 7C F1 C5 17 3F FE F8 63 43 43 43 40 40 40 4C 4C CC E3 8F 3F 4E 3D 65 E5 CA 
95 CD 77 1C 06 3D 68 B9 84 56 51 5B 3D DA 3C 31 AD 9B DF 06 C3 5F A5 CC CB 32 6E 47 25 D5 48 F9 
EB CD CA E2 B8 A0 BC 85 FE 48 0C 00 7C 74 FA F4 69 85 42 F1 C2 7F 3D F7 DC 73 7F FC F1 C7 C8 91 
23 CF 9C 39 D3 F6 0B 0F 1E 3C 78 EF DE 3D 63 0D 63 ED DA B5 B1 B1 B1 61 61 61 B3 66 CD DA B7 6F 
5F 78 78 38 FD 94 3B 77 EE 18 EB 29 02 86 99 06 68 59 27 B6 7A 34 7A 47 65 C2 B1 E2 CC 0B 77 08 
21 79 0B 90 15 00 78 CF CB CB 6B DE BC 79 F4 B7 2B 56 AC 78 FA E9 A7 D3 D2 63 B9 47 A3 00 00 20 
00 49 44 41 54 D2 46 8D 1A 65 B2 31 6C DD BA F5 C3 0F 3F 5C B8 70 21 21 C4 D3 D3 D3 CF CF EF F7 
DF 7F 1F 3E 7C B8 C9 06 C0 77 08 0D A0 8F DE EA B1 43 25 09 E3 76 54 D2 71 E1 CB D7 9E 0A 19 E4 
D4 F5 37 04 00 0E 7A E2 89 27 AA AB AB A9 AF 6F DF BE BD 7A F5 EA 9F 7E FA A9 AE AE 6E F0 E0 C1 
CB 96 2D 9B 35 6B 16 F5 A3 AB 57 AF AE 5F BF 5E 2A 95 06 04 04 24 27 27 37 AF 68 DC BA 75 2B 35 
35 55 EF A2 AD AD ED C6 8D 1B F5 2E 5A 58 58 D4 D5 D5 51 5F 5B 59 59 D1 FF 97 F6 F0 E1 C3 45 8B 
16 79 79 79 C5 C5 C5 19 E3 23 0A 0D 42 03 FC 0F CD FD B3 D5 12 B1 9D F7 12 3B EF A5 86 BE C4 A8 
1D 95 88 0B 00 1D 45 AD F8 61 7B 14 FA E2 27 7A B4 71 4A 5C 43 43 C3 EE DD BB 8F 1C 39 92 92 92 
42 08 D1 6A B5 A1 A1 A1 7E 7E 7E 39 39 39 F6 F6 F6 3B 76 EC 98 3D 7B 76 70 70 F0 C0 81 03 09 21 
49 49 49 19 19 19 63 C7 8E 5D B3 66 CD 84 09 13 0A 0B 0B FB F7 EF AF FB 6E F5 F5 F5 0A 85 42 EF 
11 B6 B6 2D 4C 4F 6E DC B8 71 C1 82 05 DD BA 75 73 75 75 8D 8F 8F 9F 3D 7B F6 D3 4F 3F 4D FF 54 
A5 52 BD F0 C2 0B 84 90 ED DB B7 77 E1 A3 0B 5A 13 FC 2F 2F 2F 2F B6 87 C0 1A 55 D1 A6 CA 9C D1 
F5 E5 67 0C 7F C9 FD 7D 1B 6F 45 8D 7C F0 CB BE AE 3F 3D FE E8 AD 01 9F E4 0F F8 24 3F EF 46 45 
D7 DF 0D 40 C0 F8 F8 3F 53 61 61 61 7A 7F 7D BA 77 EF 9E 94 94 44 FD B4 A2 A2 22 26 26 A6 AC AC 
8C FA 96 3A 5F F0 C7 1F 7F 6C 6A 6A 22 84 6C D8 B0 81 7E 1F 4F 4F CF D5 AB 57 77 7A 18 67 CF 9E 
F5 F3 F3 F3 F5 F5 1D 3D 7A B4 8B 8B CB AE 5D BB A8 EB 84 90 6F BF FD 36 34 34 34 2C 2C 4C AD 56 
1B FE 86 06 FE B7 E0 E3 7F B2 16 61 A6 01 08 E9 54 49 42 55 20 91 C7 47 F4 9A 11 D3 F5 8E CA 13 
37 2B 23 F7 16 12 CC 2E 00 08 DA E4 C9 93 97 2F 5F AE D5 6A A5 52 E9 DA B5 6B 37 6D DA 14 19 19 
49 FD C8 C9 C9 69 E3 C6 8D C7 8F 1F 2F 2A 2A 92 4A A5 45 45 45 BA 2F D4 5D 73 10 10 10 50 50 50 
A0 F7 CE 95 95 95 CD 17 54 5A 59 59 4D 9C 38 51 F7 4A 79 79 F9 F3 CF 3F 1F 13 13 13 1F 1F 4F 08 
39 75 EA D4 F8 F1 E3 5D 5D 5D 27 4D 9A 44 08 59 BA 74 69 59 59 D9 96 2D 5B 5A 9C A2 00 0A 42 03 
74 B8 24 61 C4 05 8F 88 0B 00 E6 A3 7F FF FE D4 7C C3 C4 89 13 BB 77 EF 3E 77 EE 5C 7B 7B FB 99 
33 67 12 42 54 2A D5 E8 D1 A3 CB CB CB 43 42 42 FC FC FC E6 CE 9D 3B 76 EC 58 FA 85 22 91 88 FE 
DA CA CA 4A A3 D1 E8 BD F3 D5 AB 57 A7 4E 9D AA 77 D1 C1 C1 A1 BC BC 5C F7 CA 89 13 27 54 2A D5 
47 1F 7D 44 7D 3B 66 CC 98 29 53 A6 7C F3 CD 37 54 68 08 08 08 08 0B 0B FB F0 C3 0F C3 C3 C3 DD 
DD 8D B6 77 AD C0 20 34 98 BB 8E 76 49 18 6B C1 23 1D 17 A8 33 AC BB F2 56 00 C0 3B 51 51 51 FF 
FC E7 3F 17 2C 58 10 12 12 D2 A7 4F 9F 83 07 0F 5E BE 7C F9 DE BD 7B BD 7A F5 22 84 FC F5 D7 5F 
BA 37 DF BD 7B 97 FE BA B0 B0 50 37 4F 50 82 83 83 6B 6B 6B DB 7D 28 15 3E 54 2A 15 B5 37 03 21 
A4 A1 A1 C1 C2 E2 3F 5B 0F BC FD F6 DB AF BE FA EA FE FD FB 67 CF 9E 9D 97 97 D7 85 0F 27 64 D8 
A7 C1 7C 69 55 72 65 BE 58 73 FF 5C 8F B0 53 86 24 06 4D 99 4C 16 3F 4D 99 97 E5 B1 E3 5C 57 F6 
84 3E 71 B3 D2 63 8D 24 72 6F 21 75 CA 14 12 03 80 79 FA FC F3 CF EB EB EB 97 2E 5D 4A FE DB C2 
40 ED C7 A0 54 2A 17 2D 5A 44 08 69 68 68 A0 EE FC F8 E3 8F A9 1F A5 A5 A5 5D BE 7C F9 ED B7 DF 
EE DC 13 27 4E 9C E8 EC EC BC 68 D1 A2 FA FA 7A 42 C8 77 DF 7D 77 E4 C8 91 B9 73 E7 EA DE F3 C5 
17 5F 9C 39 73 26 2D 2D AD F3 1F 4C D0 30 D3 60 A6 3A 5A 92 78 74 84 44 17 26 18 30 BB 00 00 34 
77 77 F7 A4 A4 A4 98 98 18 B1 58 1C 1E 1E 3E 65 CA 94 61 C3 86 39 39 39 59 59 59 7D F0 C1 07 37 
6E DC 28 2C 2C 7C F9 E5 97 09 21 81 81 81 83 06 0D D2 6A B5 0E 0E 0E 07 0E 1C F0 F1 F1 E9 DC 13 
ED ED ED 8F 1D 3B F6 C6 1B 6F 3C FE F8 E3 56 56 56 D6 D6 D6 BB 76 ED 1A 37 6E 9C EE 3D 3E 3E 3E 
71 71 71 EF BF FF FE 94 29 53 A8 DE 0D D0 F5 58 53 53 13 DB 63 E0 16 6F 6F EF 6B D7 AE B1 3D 0A 
66 51 25 89 6E C3 37 18 38 C1 20 8F 8F B0 72 71 73 4F DC DF E9 27 96 54 D4 46 EE BD 5A 52 59 8B 
B8 00 D0 75 42 FD 9F A9 FA FA FA 07 0F 1E 38 3B 3B 37 FF 51 43 43 83 42 A1 70 76 76 A6 AB 09 5D 
71 EF DE BD CA CA 4A 2F 2F AF AE BF 9B 81 FF 2D 04 F3 9F 0C 33 0D E6 A5 43 5D 12 46 39 42 02 71 
01 00 0C 64 6D 6D DD 62 62 20 84 58 59 59 F5 E9 D3 C7 58 0F EA D3 A7 8F 11 DF CD AC 20 34 98 11 
AD 4A AE 94 88 6D DC A7 19 52 92 E8 7A 47 25 1D 17 E6 3C EB 9A D7 FA 1E 2F 00 00 C0 17 08 0D E6 
C2 F0 92 44 D7 3B 2A 11 17 00 00 04 09 A1 C1 2C 28 F3 C5 5A B5 DC 31 68 8F 85 BD 5B DB 77 76 B1 
A3 12 71 01 00 40 C0 10 1A 04 8E 2A 49 88 7A 3D E7 18 BC A7 ED 3B BB 78 84 44 49 45 6D E2 F1 E2 
13 37 2B 11 17 00 00 84 0A A1 41 C8 EA 64 D9 35 D2 58 43 36 6E 7A D4 51 D9 F1 0D 18 74 E3 42 71 
9C 11 4E C4 06 00 00 6E 42 68 10 AC 1A 69 AC 46 71 B6 DD C4 A0 2A 90 DC 4B 5B 66 E7 3B AA 13 0B 
1E 11 17 00 00 CC 0A 42 83 00 51 7D 95 96 F6 6E 6D F7 55 76 A5 A3 12 71 01 00 C0 0C 21 34 08 0D 
B5 D5 63 37 BF 0D 36 EE 11 6D DC A6 CC CB BA BB 7D 69 27 3A 2A 11 17 00 00 CC 16 42 83 A0 18 72 
FA 54 A7 3B 2A 4B 2A 6A BF FA ED 4E E6 85 3B 88 0B 00 D0 51 89 89 89 97 2E 5D A2 BF B5 B0 B0 E8 
DE BD 7B 54 54 D4 88 11 23 DA 7E E1 D4 A9 53 E3 E2 E2 02 02 02 8C 3B 9E 6F BE F9 46 A1 50 BC FB 
EE BB F4 95 03 07 0E 7C FB ED B7 F5 F5 F5 C1 C1 C1 B1 B1 B1 D4 66 91 53 A7 4E 5D B9 72 65 60 60 
A0 71 9F CE 5F 38 B0 4A 20 0C 3C 7D 4A 91 95 52 BC 30 D0 DE 37 C8 23 FD 9C E1 89 A1 A4 A2 36 E1 
58 F1 F8 F4 8B 84 90 E2 B8 A0 04 34 47 00 40 07 9D 3E 7D 5A A1 50 BC F0 5F CF 3D F7 DC 1F 7F FC 
31 72 E4 C8 33 67 CE B4 FD C2 83 07 0F 52 A7 55 19 D1 D1 A3 47 23 23 23 AF 5C B9 42 5F C9 CC CC 
7C F3 CD 37 43 43 43 67 CE 9C F9 D9 67 9F 45 46 46 D2 4F BF 73 E7 8E 71 9F CE 6B 98 69 10 02 43 
4E 9F A2 8F 90 E8 50 47 25 66 17 00 C0 58 BC BC BC E6 CD 9B 47 7F BB 62 C5 8A A7 9F 7E 3A 2D 2D 
6D D4 A8 51 26 1B 83 52 A9 4C 4A 4A DA BA 75 AB DE 36 D2 1F 7E F8 61 52 52 D2 C2 85 0B 09 21 7E 
7E 7E BE BE BE 71 71 71 5E 5E 5E 26 1B 18 5F 20 34 F0 5E BB 25 09 7A C1 63 AF 19 31 8E E3 67 18 
F8 B6 88 0B 00 C0 B4 27 9E 78 A2 BA BA 9A FA FA F6 ED DB AB 57 AF FE E9 A7 9F EA EA EA 06 0F 1E 
BC 6C D9 B2 59 B3 66 51 3F BA 7A F5 EA FA F5 EB A5 52 69 40 40 40 72 72 72 F3 8A C6 AD 5B B7 52 
53 53 F5 2E DA DA DA 6E DC B8 51 EF E2 91 23 47 F2 F3 F3 2F 5C B8 90 90 90 40 5F FC FD F7 DF E5 
72 79 78 78 38 F5 ED 90 21 43 FA F5 EB 77 FC F8 71 DD D0 F0 F0 E1 C3 45 8B 16 79 79 79 C5 C5 C5 
75 F5 63 F3 19 42 03 8F 19 72 FA 54 27 8E 90 40 5C 00 E0 17 6A 23 57 B6 47 A1 AF D7 8C 98 36 F6 
7D 69 68 68 D8 BD 7B F7 91 23 47 52 52 52 08 21 5A AD 36 34 34 D4 CF CF 2F 27 27 C7 DE DE 7E C7 
8E 1D B3 67 CF 0E 0E 0E A6 0E A7 4E 4A 4A CA C8 C8 18 3B 76 EC 9A 35 6B 26 4C 98 50 58 58 D8 BF 
7F 7F DD 77 AB AF AF 57 28 14 7A 8F B0 B5 B5 6D FE DC 69 D3 A6 CD 9C 39 53 EF 62 49 49 09 21 E4 
C9 27 9F A4 AF F8 F9 F9 E9 16 2F 54 2A D5 0B 2F BC 40 08 D9 BE 7D BB 41 1F 5E B8 10 1A F8 AA DD 
92 44 27 16 3C 22 2E 00 F0 51 DB 7F 9E B9 63 E7 CE 9D 3B 77 EE A4 BF ED DE BD 7B 52 52 D2 F2 E5 
CB 09 21 0F 1E 3C 08 0F 0F 5F B9 72 25 75 CA 65 6A 6A EA 96 2D 5B 8A 8A 8A A8 D0 B0 7A F5 6A B1 
58 4C 08 D9 B1 63 47 6E 6E EE 67 9F 7D 96 98 98 A8 FB CE 3E 3E 3E 7B F6 B4 B3 E9 2D C5 CA AA 85 
BF 7A 75 75 75 36 36 36 7A 17 6B 6B 6B A9 2F D4 6A F5 4B 2F BD 64 6D 6D FD C3 0F 3F B4 18 44 CC 
0A 42 03 2F B5 5B 92 E8 E8 11 12 54 5C 48 3C 5E 1C 3F D1 03 71 01 00 98 30 79 F2 E4 E5 CB 97 6B 
B5 5A A9 54 BA 76 ED DA 4D 9B 36 D1 EB 0D 9D 9C 9C 36 6E DC 78 FC F8 F1 A2 A2 22 A9 54 5A 54 54 
A4 FB C2 E1 C3 87 D3 5F 07 04 04 14 14 14 E8 BD 73 65 65 65 F3 05 95 56 56 56 13 27 4E 34 64 60 
16 16 16 0D 0D 0D CD 5F 4E 7D B1 74 E9 D2 B2 B2 B2 2D 5B B6 20 31 10 84 06 DE 69 B7 24 41 4F 30 
18 B8 E0 51 37 2E 34 A5 84 1A 79 B8 00 00 FF D5 BF 7F FF B0 B0 30 42 C8 C4 89 13 BB 77 EF 3E 77 
EE 5C 7B 7B 7B AA 58 A0 52 A9 46 8F 1E 5D 5E 5E 1E 12 12 E2 E7 E7 37 77 EE DC B1 63 C7 D2 2F 14 
89 44 F4 D7 56 56 56 1A 8D 46 EF 9D AF 5E BD 3A 75 EA 54 BD 8B 0E 0E 0E E5 E5 E5 86 0C AC 5B B7 
6E 8D 8D 8D F5 F5 F5 D6 D6 D6 D4 95 BB 77 EF D2 2B 27 02 02 02 C2 C2 C2 3E FC F0 C3 F0 F0 70 77 
F7 0E 9F CB 23 30 68 B9 E4 13 CD FD B3 55 B9 63 44 BD 03 5B 3B 7D 4A 91 95 22 8F 8F A0 3A 2A DB 
4D 0C 54 23 A5 C7 1A 09 21 A4 29 25 14 8D 94 00 60 32 51 51 51 7F FB DB DF 16 2C 58 40 B5 53 1E 
3C 78 F0 F2 E5 CB BF FF FE FB EE DD BB 97 2F 5F 4E 55 25 68 77 EF DE A5 BF 2E 2C 2C 7C E2 89 27 
F4 DE 2D 38 38 B8 B6 19 03 13 03 21 24 2C 2C CC D2 D2 F2 97 5F 7E A1 BE 55 A9 54 BF FF FE 3B BD 
37 C3 DB 6F BF BD 7C F9 F2 A1 43 87 CE 9E 3D BB 73 1F 56 48 10 1A 78 43 7D 6D 73 CD EF B1 0E 41 
7B 5A 5C C4 A0 2A 90 14 2F 08 54 15 48 3C D2 CF B5 5B DD 44 5C 00 00 D6 7D FE F9 E7 F5 F5 F5 4B 
97 2E 25 FF AD 05 50 01 42 A9 54 2E 5A B4 88 10 42 97 0C 3E FE F8 63 EA 47 69 69 69 97 2F 5F 7E 
FB ED B7 8D 3B 12 6B 6B EB 59 B3 66 7D F8 E1 87 95 95 95 5A AD 76 D9 B2 65 4F 3E F9 A4 5E 69 E3 
8B 2F BE 38 73 E6 4C 5A 5A 9A 71 1F CD 3B 28 4F F0 40 DB 25 89 0E 1D 21 81 62 04 00 70 84 BB BB 
7B 52 52 52 4C 4C 8C 58 2C 0E 0F 0F 9F 32 65 CA B0 61 C3 9C 9C 9C AC AC AC 3E F8 E0 83 1B 37 6E 
14 16 16 BE FC F2 CB 84 90 C0 C0 C0 41 83 06 69 B5 5A 07 07 87 03 07 0E F8 F8 F8 18 7D 30 A9 A9 
A9 62 B1 B8 4F 9F 3E 56 56 56 AE AE AE 07 0F 1E A4 76 84 A4 F9 F8 F8 C4 C5 C5 BD FF FE FB 53 A6 
4C D1 9B 08 31 2B 8F 35 35 35 B1 3D 06 6E F1 F6 F6 BE 76 ED 1A DB A3 78 44 AB 92 2B 25 62 1B F7 
69 AD 4D 30 50 1D 95 86 CC 2E D0 71 E1 CD 11 AE 03 7A 62 45 0F 00 5F 71 ED 7F A6 8C A5 BE BE FE 
C1 83 07 54 03 85 9E 86 86 06 85 42 E1 EC EC AC F7 B7 DC B8 2A 2B 2B 6B 6B 6B 5D 5D 5D 0D 7F 89 
81 FF 2D 04 F3 9F 0C 33 0D 9C 46 75 49 74 1B BE A1 79 97 84 E1 1D 95 7A 9D 11 88 0B 00 C0 4D D6 
D6 D6 2D 26 06 42 88 95 95 95 DE 1E 8E 4C 70 72 72 62 FA 11 7C 87 D0 C0 5D CA 7C B1 56 2D 77 0C 
DA 63 61 EF A6 F7 23 03 3B 2A 11 17 00 00 C0 88 10 1A B8 88 2A 49 88 7A 3D D7 BC 4B 82 9A 60 20 
84 B4 DB 51 99 70 AC 18 71 01 00 00 8C 08 A1 81 73 EA 64 D9 35 D2 D8 16 37 6E 52 64 A5 28 F3 B2 
1C C7 CF 68 7B 05 03 E2 02 00 00 30 01 A1 81 5B 6A A4 B1 1A C5 D9 1E 61 A7 F4 4A 12 AA 02 C9 BD 
B4 65 76 BE A3 DA 3E 42 82 8A 0B 21 83 7A 20 2E 00 00 80 D1 21 34 70 05 D5 57 69 69 EF A6 D7 57 
A9 29 93 29 B2 52 D4 05 67 DA EE A8 44 5C 00 00 00 A6 21 34 70 02 75 FA 54 37 BF 0D 36 EE 11 BA 
D7 95 79 59 77 B7 2F ED 35 23 A6 6F F4 E6 D6 5E 8B B8 00 00 00 A6 81 D0 C0 BE 16 4F 9F 32 A4 A3 
12 71 01 00 00 4C 09 A1 81 4D AD 6D F5 D8 6E 47 65 C2 B1 E2 CC 0B 77 06 38 D9 22 2E 00 00 2F 24 
26 26 5E BA 74 89 FE D6 C2 C2 A2 7B F7 EE 51 51 51 F4 B9 50 AD 99 3A 75 6A 5C 5C 5C 40 40 80 71 
C7 F3 CD 37 DF 28 14 8A 77 DF 7D 97 BE B2 79 F3 E6 93 27 4F 36 34 34 0C 1C 38 F0 83 0F 3E A0 B6 
85 98 3A 75 EA CA 95 2B E9 73 28 00 A1 81 35 54 49 C2 CE 7B 89 EE 56 8F 9A 32 99 3C 3E C2 CA C5 
CD 2B BB B4 C5 57 51 71 81 10 F2 E5 6B 4F 85 0C C2 3E 24 00 C0 0F A7 4F 9F AE AF AF A7 CF 7C AA 
AC AC FC EE BB EF 46 8E 1C 29 91 48 46 8D 1A D5 C6 0B 0F 1E 3C 38 7F FE 7C E3 0E E6 E8 D1 A3 91 
91 91 73 E6 CC A1 AF CC 9A 35 EB C4 89 13 1F 7D F4 91 93 93 D3 8E 1D 3B FC FD FD FF F8 E3 0F 27 
27 A7 83 07 0F E2 9C 2A 5D 08 0D EC 68 5E 92 68 F7 08 09 C4 05 00 E0 35 2F 2F AF 79 F3 E6 D1 DF 
AE 58 B1 E2 E9 A7 9F 4E 4B 4B 6B 3B 34 18 97 52 A9 4C 4A 4A DA BA 75 AB EE FE 92 32 99 EC EB AF 
BF 3E 79 F2 E4 98 31 63 08 21 AF BC F2 8A 8B 8B CB BE 7D FB A2 A2 A2 4C 36 30 BE 40 68 30 B5 16 
4B 12 F4 11 12 2D 76 54 22 2E 00 80 20 3D F1 C4 13 D5 D5 D5 D4 D7 B7 6F DF 5E BD 7A F5 4F 3F FD 
54 57 57 37 78 F0 E0 65 CB 96 CD 9A 35 8B FA D1 D5 AB 57 D7 AF 5F 2F 95 4A 03 02 02 92 93 93 9B 
57 34 6E DD BA 95 9A 9A AA 77 D1 D6 D6 76 E3 C6 8D 7A 17 8F 1C 39 92 9F 9F 7F E1 C2 85 84 84 04 
FA A2 B5 B5 F5 3F FE F1 8F E0 E0 60 FA DB 7E FD FA DD B9 73 47 F7 85 0F 1F 3E 5C B4 68 91 97 97 
57 5C 5C 5C 97 3E 33 CF 21 34 98 54 F3 92 44 DB 0B 1E 4F DC AC 8C DC 5B 48 10 17 00 40 58 1A 1A 
1A 76 EF DE 7D E4 C8 91 94 94 14 42 88 56 AB 0D 0D 0D F5 F3 F3 CB C9 C9 B1 B7 B7 DF B1 63 C7 EC 
D9 B3 83 83 83 A9 F3 24 93 92 92 32 32 32 C6 8E 1D BB 66 CD 9A 09 13 26 14 16 16 F6 EF DF 5F F7 
DD EA EB EB 15 0A 85 DE 23 6C 6D 5B 58 EF 35 6D DA B4 99 33 67 EA 5D EC D3 A7 0F 1D 50 08 21 BF 
FE FA 6B 61 61 E1 A4 49 93 E8 2B 2A 95 EA 85 17 5E 20 84 6C DF BE BD 4B 1F 9B FF 10 1A 4C A7 79 
49 A2 8D 05 8F 88 0B 00 60 20 F5 B5 CD EA 6B 5B D8 1E 85 3E BD 05 5B 84 90 9D 3B 77 EE DC B9 93 
FE B6 7B F7 EE 49 49 49 CB 97 2F 27 84 3C 78 F0 20 3C 3C 7C E5 CA 95 D4 81 55 A9 A9 A9 5B B6 6C 
29 2A 2A A2 42 C3 EA D5 AB C5 62 31 21 64 C7 8E 1D B9 B9 B9 9F 7D F6 59 62 62 A2 EE 3B FB F8 F8 
EC D9 A3 BF E9 7E 8B AC AC DA F9 AB 77 FD FA F5 19 33 66 CC 9F 3F 9F 2E 9A A8 D5 EA 97 5E 7A C9 
DA DA FA 87 1F 7E 68 31 88 98 15 84 06 53 68 5E 92 A0 27 18 9A 1F 21 41 C7 05 EA 0C 6B D3 8F 16 
00 F8 C5 CE 7B A9 DE 9F 67 6E 9A 3C 79 F2 F2 E5 CB B5 5A AD 54 2A 5D BB 76 ED A6 4D 9B 22 23 23 
A9 1F 39 39 39 6D DC B8 F1 F8 F1 E3 45 45 45 52 A9 B4 A8 A8 48 F7 85 C3 87 0F A7 BF 0E 08 08 28 
28 28 D0 7B E7 CA CA CA 33 67 CE E8 5D B4 B2 B2 9A 38 F1 FF DB BB F7 A0 26 CE 7E 0F E0 3F 09 C1 
04 2B E2 0D 8F B5 4E A5 95 A8 20 72 AD 70 68 60 18 C5 1E A5 2D C5 7A E9 0B ED 48 45 EB E0 C0 8C 
8E B1 62 45 3A 5E A6 3D 2D AF 16 2D 1C C1 E2 8D 7A 41 A4 A8 6D A9 52 19 EB AB 54 94 22 65 50 81 
02 1E 44 11 14 28 08 C8 3D D9 EC F9 63 DF B3 C6 00 4B 10 30 90 7C 3F 7F C9 B3 9B F0 F0 F5 51 BE 
B3 BB D9 7D AB 4F 33 BC 76 ED 9A BF BF BF 8F 8F 4F 42 42 02 3F B8 7E FD FA 9A 9A 9A BD 7B F7 A2 
31 10 4A C3 0B D0 F5 94 C4 D3 47 48 3C 7B 80 01 75 01 00 0C D8 94 29 53 7C 7C 7C 88 E8 AD B7 DE 
1A 33 66 4C 70 70 B0 B9 B9 39 77 B2 A0 B5 B5 55 2E 97 D7 D6 D6 7A 7B 7B 3B 39 39 05 07 07 7B 79 
79 F1 2F 14 8B C5 FC 9F 4D 4D 4D 95 4A A5 D6 3B 17 16 16 BE FF FE FB 5A 83 A3 47 8F AE AD AD D5 
7D 7A 49 49 49 2B 57 AE 54 28 14 5F 7C F1 85 E6 B8 8B 8B 8B 8F 8F CF D6 AD 5B 17 2F 5E 3C 75 AA 
D0 63 02 8D 01 4A C3 E0 D2 3A 25 C1 3D 42 C2 D4 EA 15 AD 0B 1E 51 17 00 C0 A8 84 84 84 9C 3D 7B 
76 ED DA B5 DE DE DE 93 26 4D 3A 73 E6 CC CD 9B 37 AB AB AB C7 8F 1F 4F 44 95 95 95 9A 3B 3F 7A 
F4 88 FF 73 51 51 91 66 9F E0 BC F9 E6 9B ED ED ED FD 99 4F 52 52 52 60 60 E0 A1 43 87 F8 83 1F 
BC 35 6B D6 F8 FB FB A7 A6 A6 AE 58 B1 E2 D2 A5 4B FD F9 2E 06 00 A5 61 B0 68 9D 92 E8 E9 13 95 
E5 F5 ED 2B 4F 16 96 3F 6E 47 5D 00 00 A3 92 90 90 30 6B D6 AC F5 EB D7 27 25 25 71 97 1A 70 A5 
A1 A9 A9 29 34 34 94 88 54 2A 15 B7 E7 CE 9D 3B B9 6E 11 1B 1B 7B F3 E6 CD 63 C7 8E 0D EC 4C EE 
DD BB B7 6A D5 AA 65 CB 96 4D 9A 34 E9 DC B9 73 DC E0 B4 69 D3 6C 6D 6D F9 7D 0E 1E 3C E8 E8 E8 
18 1B 1B 1B 16 16 36 B0 DF 7D 78 41 69 18 14 5A A7 24 F8 47 48 68 1E 60 40 5D 00 00 63 36 75 EA 
D4 1D 3B 76 28 14 8A 80 80 80 C5 8B 17 FB FA FA CE 99 33 67 EC D8 B1 A6 A6 A6 9F 7D F6 D9 9D 3B 
77 8A 8A 8A FC FC FC 88 C8 CD CD ED F5 D7 5F 57 AB D5 A3 47 8F 3E 7D FA F4 CC 99 33 07 76 26 C7 
8E 1D 6B 6B 6B 4B 49 49 49 49 49 E1 07 43 43 43 63 63 63 F9 2F 67 CE 9C 19 11 11 B1 79 F3 66 5F 
5F 5F EE F2 4C E3 34 82 65 59 7D CF 61 68 99 31 63 46 71 71 71 7F DE 81 3B 25 31 CA F1 9F E2 09 
EE FC 05 8F 9A 07 18 F8 BA 10 E4 3A 79 DB 7F 59 0F C4 AC 01 C0 88 F4 FF BF A9 A1 A9 B3 B3 B3 B1 
B1 91 FB 00 85 16 95 4A 55 57 57 37 71 E2 44 13 13 93 17 3F 31 01 3A FE 5D 18 CC 5F 19 8E 34 0C 
24 EE 94 84 BA ED 81 85 47 92 89 F9 2B 5D 3F 51 A9 59 17 2E A1 2E 00 00 68 30 33 33 EB B6 31 10 
91 A9 A9 A9 E6 3D 1C 41 5F 50 1A 06 8C BA F5 41 53 56 80 78 BC BB C5 9B 49 CA 9A 8A CA AF 97 10 
11 FF 89 4A D4 05 00 00 18 EE 50 1A 06 46 47 C5 0F 2D 79 9F 72 9F 92 78 FA 89 CA E5 0A 22 2A AF 
6F DF 7E E1 EE BF FE F7 31 EA 02 00 00 0C 6B 28 0D 03 A0 E9 6A 80 BA ED 81 A5 4F 66 FB DD FB 0F 
22 DD A4 76 FF C9 5D F0 A8 59 17 EE 46 74 F3 0C 2A 00 00 80 61 04 A5 A1 5F B8 8B 18 44 E6 AF 48 
6D A2 6A 0E ED 6A 2B B8 C6 5D F0 88 BA 00 00 00 86 07 A5 E1 F9 71 A7 24 46 39 FD B3 F9 DA BD CA 
2F DC C6 2F 57 FC 47 D8 9E F2 FA F6 ED 27 8B 50 17 00 60 F0 CC 9D 3B 77 C6 8C 19 FA 9E 05 10 11 
CD 9D 3B 57 DF 53 78 A1 50 1A 9E 13 F7 B9 4A A9 4D 54 CD 81 24 EE 19 95 35 93 9D 37 A2 2E 00 C0 
E0 3B 7A F4 A8 BE A7 00 46 0A A5 A1 CF F8 5B 3D 32 F5 FE 15 F1 EB C6 2F 57 3C 59 17 1A 95 F3 30 
F1 EC 9F A8 0B 00 00 60 C0 50 1A FA 86 BB D5 A3 E9 D8 25 75 27 32 4D AD 3A CD BE 2B 8B C9 79 98 
18 87 BA 00 00 00 86 0F A5 A1 0F DA 8A F7 34 E7 EE 61 1A DE 68 3C 9F D9 1E F8 DF C9 AD D6 A8 0B 
00 00 60 3C 50 1A 74 C2 9D 92 68 2B C8 6A BC A0 7C E2 E3 F8 B3 7F 54 E2 95 87 41 AE 84 BA 00 00 
00 C6 03 A5 A1 77 DC 29 89 D6 7C 55 69 C1 D8 74 8F F0 53 75 D6 41 D6 A8 0B 00 00 60 74 50 1A 7A 
C1 9D 92 68 BE AA FA A6 DD 3F CD 3E 30 C8 6E F2 5D DC D5 11 00 00 8C D2 D0 7A 5C D8 E0 61 18 26 
3B 3B BB BE BE 5E F7 97 A8 5B 1F 34 5D 0D 68 BA 1C FD EB B9 D7 3D 4D 77 8F 5F AE B8 1B E1 81 87 
52 0A 8B 89 89 D1 F7 14 86 31 A4 D7 1F 48 AF 3F 90 5E 7F 18 55 7A 46 F1 68 EC FD FB F7 7F FB ED 
B7 2A 95 8A 88 E4 72 79 74 74 B4 85 85 45 4F 3B 73 0F 30 E5 4E 49 94 16 8C 3D 76 C7 63 FC 72 05 
BA 82 8E 0C E6 F1 AF 7A 81 F4 FA 03 E9 F5 07 D2 EB 0F 5D D2 33 98 84 0D FF 48 43 5A 5A DA 37 DF 
7C B3 7D FB F6 A2 A2 A2 D3 A7 4F 97 94 94 6C D9 B2 45 F8 25 6D C5 7B 1A 2E FC 23 E3 F2 F4 F3 CE 
A9 31 07 63 D1 18 00 00 00 C8 18 AE 69 D8 BF 7F BF B7 B7 F7 D2 A5 4B 89 C8 CE CE 6E D3 A6 4D 1B 
37 6E 2C 2F 2F 9F 36 6D 5A B7 FB FF 4F 88 B2 E8 EA B1 EA 09 FB 3E D8 ED FB 42 27 0A 00 00 30 B4 
19 F8 91 86 8E 8E 8E 92 92 92 79 F3 E6 F1 23 0B 17 2E 24 A2 AC AC AC 6E F7 57 B7 3E 38 77 43 E4 
1C 7C 63 91 1F 1A 03 00 00 C0 33 0C FC 48 43 4E 4E 0E 11 59 59 59 F1 23 62 B1 58 22 91 14 16 16 
76 BB BF 89 F9 2B B5 26 EE 78 12 4C 7F 20 BD FE 40 7A FD 81 F4 FA 03 E9 F5 47 AF E9 19 CC 73 AD 
0C BC 34 30 0C 43 44 62 B1 58 73 50 24 12 29 95 CA 9E 5E 82 27 C1 00 00 00 74 CB C0 4F 4F 00 00 
00 C0 40 31 F0 D2 20 91 48 88 48 EB B8 02 C3 30 5A C7 1E 00 00 00 A0 57 06 5E 1A 9C 9D 9D 89 A8 
A1 A1 81 1F 51 2A 95 ED ED ED F6 F6 F6 FA 9B 14 00 00 C0 B0 64 E0 A5 41 2C 16 DB DA DA 66 64 64 
F0 23 E9 E9 E9 44 E4 E6 E6 A6 BF 49 01 00 00 0C 4B 06 5E 1A 88 68 D5 AA 55 17 2F 5E 4C 4C 4C 54 
AB D5 B7 6E DD 8A 8A 8A 9A 3F 7F 7E 4F 37 69 00 00 00 80 9E 18 C5 6D A4 E3 E2 E2 62 63 63 B9 DB 
48 7B 79 79 ED DE BD 5B E0 36 D2 00 00 00 D0 2D A3 28 0D 00 00 00 D0 7F 86 7F 7A 02 00 00 00 06 
04 4A 03 00 00 00 E8 04 A5 01 00 00 00 74 82 D2 F0 14 C3 30 D9 D9 D9 F5 F5 F5 FA 9E 88 21 40 98 
3D 29 2D 2D ED 1A 8B 70 5C 08 93 D7 6D 7A C2 90 1E 11 29 95 CA EC EC EC B2 B2 B2 AE 9B B0 F6 7A 
25 90 9E 30 C3 4C 8F 05 96 65 59 36 3E 3E DE D6 D6 56 26 93 C9 64 B2 E0 E0 E0 C6 C6 46 7D CF 68 
A8 73 70 70 90 3D EB EA D5 AB DC 26 84 D9 93 CA CA 4A 17 17 97 8C 8C 0C CD 41 E1 B8 10 26 AF DB 
F4 04 D6 21 8B F4 58 B6 A5 A5 65 E3 C6 8D B3 66 CD E2 42 F0 F6 F6 BE 7E FD 3A BF 15 6B 4F 98 70 
7A C6 B9 F6 50 1A 58 96 65 7F FE F9 67 99 4C 96 92 92 C2 30 CC ED DB B7 E5 72 79 68 68 A8 BE 27 
35 A4 D5 D4 D4 C8 64 B2 2F BF FC F2 AC 86 9A 9A 1A 16 61 F6 AC B4 B4 54 2E 97 CB 64 32 CD 5F 7B 
C2 71 21 4C 5E B7 E9 09 AC 43 16 E9 B1 2C CB B2 0A 85 C2 C5 C5 E5 E2 C5 8B 0C C3 54 55 55 7D FC 
F1 C7 0E 0E 0E 95 95 95 2C D6 9E 0E 04 D2 33 DA B5 87 D2 C0 B2 2C FB CE 3B EF AC 59 B3 86 FF F2 
A7 9F 7E 92 C9 64 77 EF DE D5 DF 8C 86 BA 8C 8C 0C 99 4C C6 FF 0B D1 84 30 BB EA EC EC 8C 89 89 
99 3D 7B F6 D2 A5 4B B5 7E ED 09 C7 85 30 59 C1 F4 04 D6 21 8B F4 58 B6 B3 B3 73 D6 AC 59 F1 F1 
F1 FC 48 5D 5D 9D 4C 26 3B 70 E0 00 8B B5 D7 1B E1 F4 8C 76 ED E1 9A 06 EA E8 E8 28 29 29 99 37 
6F 1E 3F B2 70 E1 42 22 CA CA CA D2 DF A4 86 BA BF FE FA 6B F4 E8 D1 13 27 4E D4 1A 47 98 DD 6A 
69 69 49 4C 4C DC B0 61 43 42 42 82 E6 B8 70 5C 08 93 D3 53 7A D4 F3 3A 24 A4 47 44 44 6D 6D 6D 
BB 76 ED F2 F3 F3 E3 47 C6 8C 19 43 44 4D 4D 4D 58 7B BD 12 48 8F 8C 78 ED 99 EA 7B 02 FA 97 93 
93 43 44 56 56 56 FC 88 58 2C 96 48 24 85 85 85 FA 9B D4 50 57 52 52 32 75 EA D4 A0 A0 20 2E 3D 
17 17 97 9D 3B 77 4E 9B 36 0D 61 76 6B D4 A8 51 57 AE 5C 91 4A A5 9A CF 4E A3 DE D6 1E C2 E4 F4 
94 1E F5 BC 0E 09 E9 11 11 91 85 85 85 AF AF AF E6 C8 F1 E3 C7 89 C8 D3 D3 13 6B AF 57 02 E9 91 
11 AF 3D 1C 69 20 86 61 88 48 EB 61 D9 22 91 48 EB 81 DA A0 29 3F 3F BF AC AC CC DD DD 3D 2E 2E 
6E C7 8E 1D F7 EF DF 0F 0C 0C AC AE AE 46 98 DD 12 8B C5 52 A9 B4 EB B8 70 5C 08 93 D3 53 7A D4 
F3 3A 24 A4 D7 9D FC FC FC 3D 7B F6 2C 58 B0 C0 D5 D5 15 6B AF AF 34 D3 23 23 5E 7B 38 D2 00 CF 
23 32 32 72 F2 E4 C9 76 76 76 DC 97 CE CE CE 8B 16 2D 3A 72 E4 88 BB BB BB 7E 27 06 46 A5 A7 75 
18 1E 1E AE DF 89 0D 41 37 6E DC 08 09 09 91 C9 64 51 51 51 FA 9E CB F0 D3 35 3D A3 5D 7B 38 D2 
40 12 89 84 88 B4 3A 20 C3 30 5A 3D 11 34 F9 F8 F8 F0 FF 5A 88 E8 B5 D7 5E B3 B1 B1 29 2F 2F 47 
98 7D 22 1C 17 C2 EC 55 4F EB 90 90 DE B3 7E FC F1 C7 95 2B 57 3A 39 39 1D 3A 74 C8 DC DC 9C B0 
F6 FA A2 6B 7A 64 C4 6B 0F A5 81 9C 9D 9D 89 48 F3 74 A9 52 A9 6C 6F 6F B7 B7 B7 D7 DF A4 86 B4 
86 86 86 CC CC CC DA DA 5A AD 71 91 48 84 30 FB 44 38 2E 84 29 4C 60 1D 12 D2 D3 B0 6F DF BE 4D 
9B 36 2D 5E BC 38 21 21 81 FF 9D 87 B5 A7 A3 6E D3 33 E6 B5 87 D2 40 62 B1 D8 D6 D6 36 23 23 83 
1F 49 4F 4F 27 22 37 37 37 FD 4D 6A 48 AB AF AF 5F BD 7A 75 72 72 32 3F 52 55 55 55 56 56 66 6B 
6B 8B 30 FB 44 38 2E 84 29 4C 60 1D 12 D2 FB 7F 27 4E 9C D8 BB 77 EF 86 0D 1B 76 EC D8 A1 39 8E 
B5 A7 8B 9E D2 33 EA B5 A7 EF CF 7C 0E 09 DC 8D 38 8E 1C 39 C2 30 CC CD 9B 37 E5 72 F9 DA B5 6B 
F5 3D A9 21 2D 24 24 C4 C9 C9 E9 B7 DF 7E 63 59 B6 B4 B4 D4 DF DF DF CB CB 8B BB E5 19 C2 14 F0 
F8 F1 E3 6E 6F EE D4 53 5C 08 53 53 D7 F4 04 D6 21 8B F4 58 B6 AA AA 6A F6 EC D9 8B 16 2D 3A FB 
AC 3F FF FC 93 C5 DA EB 8D 70 7A 46 BB F6 50 1A FE 6D DF BE 7D FC 2D 3F 57 AF 5E 6D 30 B7 FC 1C 
24 8D 8D 8D 0A 85 82 BF BB 6A 40 40 C0 FD FB F7 F9 AD 08 B3 27 5D 7F ED B1 BD C5 85 30 79 5D D3 
13 5E 87 AC D1 A7 77 FA F4 69 59 77 22 22 22 B8 1D B0 F6 04 08 A7 67 B4 6B 6F 04 CB B2 FA 3E D8 
31 54 70 F7 FB B4 B6 B6 B6 B0 B0 D0 F7 5C 86 07 A5 52 79 FB F6 6D 1B 1B 9B 97 5E 7A 49 6B 13 C2 
EC 13 E1 B8 10 A6 30 81 75 48 48 AF 37 58 7B FD 61 84 6B 0F A5 01 00 00 00 74 82 0B 21 01 00 00 
40 27 28 0D 00 00 00 A0 13 94 06 00 00 00 D0 09 4A 03 00 00 00 E8 04 A5 01 00 00 00 74 82 D2 00 
00 00 00 3A 41 69 00 00 00 00 9D A0 34 00 00 00 80 4E 50 1A 00 E0 29 A5 52 C9 30 8C BE 67 01 00 
43 14 4A 03 00 50 45 45 C5 E7 9F 7F EE EC EC 3C 7B F6 6C 5B 5B 5B 77 77 F7 5D BB 76 B5 B6 B6 3E 
F7 1B 2E 5C B8 30 3C 3C 7C 00 67 08 00 43 81 A9 BE 27 00 00 7A 96 95 95 15 16 16 26 12 89 96 2D 
5B 66 6F 6F CF 30 CC C5 8B 17 13 12 12 32 33 33 93 92 92 CC CD CD 9F E3 3D 1B 1A 1A 5A 5A 5A 06 
7C AA 00 A0 5F 28 0D 00 46 AD B6 B6 76 DD BA 75 96 96 96 C9 C9 C9 13 27 4E E4 06 DF 7B EF BD A4 
A4 A4 6D DB B6 45 47 47 47 44 44 E8 77 86 00 30 74 A0 34 00 18 B5 03 07 0E 34 35 35 ED DD BB 97 
6F 0C 9C 80 80 80 94 94 94 92 92 12 CD C1 4B 97 2E E5 E6 E6 8A C5 62 67 67 67 4F 4F 4F CD 4D 1D 
1D 1D 17 2E 5C C8 CB CB 73 70 70 F0 F5 F5 ED F6 7B FD FE FB EF B9 B9 B9 44 E4 E2 E2 22 97 CB 07 
FA 47 01 80 41 87 A7 5C 02 18 35 4F 4F 4F A5 52 79 FD FA 75 E1 DD FE FE FB EF 4F 3E F9 A4 B0 B0 
D0 D1 D1 B1 B3 B3 B3 B0 B0 D0 C9 C9 E9 BB EF BE E3 9E F9 5B 55 55 B5 62 C5 8A AA AA 2A 37 37 B7 
3B 77 EE 8C 1B 37 AE A2 A2 C2 C3 C3 23 36 36 96 7B 79 73 73 73 48 48 48 4E 4E 8E A3 A3 A3 48 24 
CA CD CD 75 77 77 8F 8B 8B 7B BE 73 1F 00 A0 2F B8 10 12 C0 78 31 0C 53 53 53 E3 EA EA DA EB 9E 
0A 85 E2 DE BD 7B A7 4E 9D 4A 4E 4E 3E 73 E6 CC F7 DF 7F 5F 50 50 B0 75 EB 56 6E 6B 78 78 78 6B 
6B EB F9 F3 E7 0F 1F 3E 7C F9 F2 65 3B 3B 3B AD 0B 1A B6 6F DF 9E 9F 9F 7F FC F8 F1 E4 E4 E4 13 
27 4E 9C 3A 75 2A 3F 3F FF AB AF BE 1A 94 9F 0A 00 06 0D 4A 03 80 F1 EA E8 E8 20 22 33 33 33 E1 
DD CA CA CA AE 5F BF BE 7A F5 6A 07 07 07 6E C4 CD CD 2D 30 30 F0 D7 5F 7F AD AE AE AE A8 A8 F8 
E3 8F 3F 82 82 82 5E 7D F5 55 22 32 31 31 89 8C 8C 34 35 7D 7A EA B3 A9 A9 E9 97 5F 7E F9 E0 83 
0F F8 76 E2 E0 E0 E0 EF EF 9F 9A 9A 8A 8F 77 02 0C 2F B8 A6 01 C0 78 8D 1C 39 92 88 3A 3B 3B 85 
77 E3 AE 6C B0 B3 B3 D3 1C 7C E3 8D 37 8E 1C 39 52 58 58 C8 FD E2 97 C9 64 FC 26 A9 54 AA 79 F4 
22 37 37 97 61 98 E2 E2 62 FE C8 04 11 95 97 97 AB 54 AA DC DC DC B9 73 E7 0E C4 8F 02 00 2F 02 
4A 03 80 F1 12 89 44 53 A6 4C B9 75 EB 56 B7 5B 8B 8A 8A 1E 3D 7A E4 E5 E5 A5 54 2A 89 48 2C 16 
6B BD 96 88 18 86 E1 3A 87 D6 56 89 44 C2 FF 99 6B 15 4A A5 B2 A1 A1 81 1F B4 B4 B4 5C B0 60 C1 
A8 51 A3 06 EC 87 01 80 C1 87 D2 00 60 D4 E6 CF 9F CF 5D A0 A0 75 20 81 88 A2 A2 A2 B2 B3 B3 AF 
5C B9 22 95 4A 89 A8 B9 B9 59 73 2B 77 D5 C2 C8 91 23 B9 BA A0 75 27 A8 86 86 06 FE E3 18 DC F1 
8C 0F 3F FC F0 DD 77 DF 1D B4 9F 03 00 5E 04 5C D3 00 60 D4 56 AC 58 61 66 66 16 19 19 A9 F5 5B 
FF C2 85 0B 59 59 59 6F BF FD F6 84 09 13 DC DD DD 45 22 51 5A 5A 9A E6 0E A9 A9 A9 12 89 C4 C3 
C3 43 2E 97 4B 24 92 F4 F4 74 7E D3 C3 87 0F 35 8F 5E 78 78 78 48 A5 D2 1F 7E F8 41 F3 E5 5B B6 
6C F1 F4 F4 6C 6B 6B 1B 9C 1F 0B 00 06 85 68 DB B6 6D FA 9E 03 00 E8 CD 98 31 63 AC AC AC 4E 9E 
3C 99 96 96 A6 56 AB 9B 9B 9B CB CA CA 8E 1E 3D FA F5 D7 5F BF FC F2 CB 31 31 31 52 A9 D4 CC CC 
4C A5 52 9D 3C 79 B2 B5 B5 D5 C6 C6 A6 A9 A9 69 F7 EE DD E7 CF 9F 5F BF 7E BD AB AB AB 89 89 09 
11 1D 3D 7A 54 AD 56 CB 64 B2 92 92 12 85 42 51 5F 5F 6F 6D 6D CD DD B0 C1 C4 C4 64 C4 88 11 29 
29 29 55 55 55 D3 A7 4F 57 A9 54 89 89 89 87 0F 1F F6 F3 F3 5B B0 60 81 BE 03 00 80 3E C0 7D 1A 
00 80 32 33 33 A3 A3 A3 0B 0A 0A B8 2F 4D 4D 4D FD FC FC 3E FD F4 D3 71 E3 C6 F1 FB C4 C5 C5 C5 
C7 C7 B7 B7 B7 13 D1 D8 B1 63 C3 C2 C2 3E FA E8 23 7E 6B 6C 6C 6C 5C 5C 9C 4A A5 22 A2 25 4B 96 
D4 D5 D5 89 C5 62 FE 3E 0D 44 74 F0 E0 C1 B8 B8 B8 27 4F 9E 70 EF 1F 18 18 B8 79 F3 66 EE C2 08 
00 18 2E 50 1A 00 E0 DF 94 4A 65 5E 5E 9E 54 2A B5 B3 B3 E3 8E 1F 68 51 AB D5 C5 C5 C5 26 26 26 
36 36 36 5D 77 ED 18 37 4C 00 00 00 64 49 44 41 54 60 18 26 2F 2F 6F FA F4 E9 96 96 96 DD BE BF 
5A AD 2E 2B 2B 7B F2 E4 C9 9C 39 73 50 17 00 86 23 94 06 00 00 00 D0 09 2E 84 04 00 00 00 9D A0 
34 00 00 00 80 4E 50 1A 00 00 00 40 27 28 0D 00 00 00 A0 13 94 06 00 00 00 D0 09 4A 03 00 00 00 
E8 04 A5 01 00 00 00 74 82 D2 00 00 00 00 3A F9 3F EA 30 0C 0B 2C 92 CE 26 00 00 00 00 49 45 4E 
44 AE 42 60 82 
EndData
$EndBitmap
$EndSCHEMATC
