EESchema Schematic File Version 4
EELAYER 30 0
EELAYER END
$Descr A4 11693 8268
encoding utf-8
Sheet 2 7
Title "Charging Station"
Date "2020-06-04"
Rev "1.0"
Comp "Institute for Automation of Complex Power Systems - E.ON ERC - RWTH Aachen University"
Comment1 "Designer: D. Wienands, S. Melcher, L. Jeske, D. Moll"
Comment2 "Supervisor: C. Guarnieri Calò Carducci"
Comment3 ""
Comment4 ""
$EndDescr
$Comp
L Device:LED_Dual_ACAC D1
U 1 1 5EDCF9DA
P 5850 3700
AR Path="/5EDC7347/5EDCF9DA" Ref="D1"  Part="1" 
AR Path="/5EF8D4D7/5EDCF9DA" Ref="D?"  Part="1" 
AR Path="/5EF91F99/5EDCF9DA" Ref="D2"  Part="1" 
AR Path="/5F54F38E/5EDCF9DA" Ref="D?"  Part="1" 
F 0 "D2" V 5804 3988 39  0000 L CNN
F 1 "SML-LX0606IGC-TR " V 5895 3988 39  0000 L CNN
F 2 "LEGOS:SMLLX0606IGCTR" H 5880 3700 50  0001 C CNN
F 3 "https://www.mouser.de/datasheet/2/244/SML-LX0606IGC-TR-1135393.pdf" H 5880 3700 50  0001 C CNN
	1    5850 3700
	0    1    1    0   
$EndComp
$Comp
L power:GND #PWR017
U 1 1 5EDCFA12
P 5750 4600
AR Path="/5EDC7347/5EDCFA12" Ref="#PWR017"  Part="1" 
AR Path="/5EF8D4D7/5EDCFA12" Ref="#PWR?"  Part="1" 
AR Path="/5EF91F99/5EDCFA12" Ref="#PWR023"  Part="1" 
AR Path="/5F54F38E/5EDCFA12" Ref="#PWR?"  Part="1" 
F 0 "#PWR023" H 5750 4350 50  0001 C CNN
F 1 "GND" H 5755 4427 39  0000 C CNN
F 2 "" H 5750 4600 50  0001 C CNN
F 3 "" H 5750 4600 50  0001 C CNN
	1    5750 4600
	1    0    0    -1  
$EndComp
$Comp
L power:GND #PWR018
U 1 1 5EDCFA18
P 5950 4600
AR Path="/5EDC7347/5EDCFA18" Ref="#PWR018"  Part="1" 
AR Path="/5EF8D4D7/5EDCFA18" Ref="#PWR?"  Part="1" 
AR Path="/5EF91F99/5EDCFA18" Ref="#PWR024"  Part="1" 
AR Path="/5F54F38E/5EDCFA18" Ref="#PWR?"  Part="1" 
F 0 "#PWR024" H 5950 4350 50  0001 C CNN
F 1 "GND" H 5955 4427 39  0000 C CNN
F 2 "" H 5950 4600 50  0001 C CNN
F 3 "" H 5950 4600 50  0001 C CNN
	1    5950 4600
	1    0    0    -1  
$EndComp
Wire Wire Line
	5950 4000 5950 4150
$Comp
L Device:R_Small R7
U 1 1 5EDCFA26
P 6350 4500
AR Path="/5EDC7347/5EDCFA26" Ref="R7"  Part="1" 
AR Path="/5EF8D4D7/5EDCFA26" Ref="R?"  Part="1" 
AR Path="/5EF91F99/5EDCFA26" Ref="R11"  Part="1" 
AR Path="/5F54F38E/5EDCFA26" Ref="R?"  Part="1" 
F 0 "R11" H 6400 4450 39  0000 L CNN
F 1 "10k" H 6400 4500 39  0000 L CNN
F 2 "Resistor_SMD:R_0603_1608Metric" H 6350 4500 50  0001 C CNN
F 3 "~" H 6350 4500 50  0001 C CNN
	1    6350 4500
	1    0    0    1   
$EndComp
Wire Wire Line
	6250 4350 6350 4350
Wire Wire Line
	6350 4350 6350 4400
$Comp
L power:GND #PWR021
U 1 1 5EDCFA36
P 6350 4600
AR Path="/5EDC7347/5EDCFA36" Ref="#PWR021"  Part="1" 
AR Path="/5EF8D4D7/5EDCFA36" Ref="#PWR?"  Part="1" 
AR Path="/5EF91F99/5EDCFA36" Ref="#PWR027"  Part="1" 
AR Path="/5F54F38E/5EDCFA36" Ref="#PWR?"  Part="1" 
F 0 "#PWR027" H 6350 4350 50  0001 C CNN
F 1 "GND" H 6355 4427 39  0000 C CNN
F 2 "" H 6350 4600 50  0001 C CNN
F 3 "" H 6350 4600 50  0001 C CNN
	1    6350 4600
	1    0    0    -1  
$EndComp
Wire Wire Line
	5950 4550 5950 4600
Wire Wire Line
	6350 4350 6450 4350
Connection ~ 6350 4350
Text HLabel 6450 4350 2    39   Input ~ 0
LED_R
$Comp
L Device:R_Small R6
U 1 1 5EF6064F
P 5950 3050
AR Path="/5EDC7347/5EF6064F" Ref="R6"  Part="1" 
AR Path="/5EF8D4D7/5EF6064F" Ref="R?"  Part="1" 
AR Path="/5EF91F99/5EF6064F" Ref="R10"  Part="1" 
AR Path="/5F54F38E/5EF6064F" Ref="R?"  Part="1" 
F 0 "R10" H 6000 3000 39  0000 L CNN
F 1 "150" H 6000 3050 39  0000 L CNN
F 2 "Resistor_SMD:R_0603_1608Metric" H 5950 3050 50  0001 C CNN
F 3 "~" H 5950 3050 50  0001 C CNN
	1    5950 3050
	-1   0    0    1   
$EndComp
$Comp
L Device:C_Small C4
U 1 1 5EF60655
P 6200 3050
AR Path="/5EDC7347/5EF60655" Ref="C4"  Part="1" 
AR Path="/5EF8D4D7/5EF60655" Ref="C?"  Part="1" 
AR Path="/5EF91F99/5EF60655" Ref="C5"  Part="1" 
AR Path="/5F54F38E/5EF60655" Ref="C?"  Part="1" 
F 0 "C5" H 6350 3000 39  0000 R CNN
F 1 "1u" H 6350 3050 39  0000 R CNN
F 2 "Capacitor_SMD:C_0603_1608Metric" H 6200 3050 50  0001 C CNN
F 3 "~" H 6200 3050 50  0001 C CNN
	1    6200 3050
	1    0    0    1   
$EndComp
$Comp
L power:+5V #PWR019
U 1 1 5EF6065B
P 6200 2850
AR Path="/5EDC7347/5EF6065B" Ref="#PWR019"  Part="1" 
AR Path="/5EF8D4D7/5EF6065B" Ref="#PWR?"  Part="1" 
AR Path="/5EF91F99/5EF6065B" Ref="#PWR025"  Part="1" 
AR Path="/5F54F38E/5EF6065B" Ref="#PWR?"  Part="1" 
F 0 "#PWR025" H 6200 2700 50  0001 C CNN
F 1 "+5V" H 6215 3023 39  0000 C CNN
F 2 "" H 6200 2850 50  0001 C CNN
F 3 "" H 6200 2850 50  0001 C CNN
	1    6200 2850
	1    0    0    -1  
$EndComp
Wire Wire Line
	6200 2950 6200 2850
Wire Wire Line
	5950 2850 5950 2950
Wire Wire Line
	6200 2850 5950 2850
Connection ~ 6200 2850
$Comp
L power:GND #PWR020
U 1 1 5EF60665
P 6200 3150
AR Path="/5EDC7347/5EF60665" Ref="#PWR020"  Part="1" 
AR Path="/5EF8D4D7/5EF60665" Ref="#PWR?"  Part="1" 
AR Path="/5EF91F99/5EF60665" Ref="#PWR026"  Part="1" 
AR Path="/5F54F38E/5EF60665" Ref="#PWR?"  Part="1" 
F 0 "#PWR026" H 6200 2900 50  0001 C CNN
F 1 "GND" H 6205 2977 39  0000 C CNN
F 2 "" H 6200 3150 50  0001 C CNN
F 3 "" H 6200 3150 50  0001 C CNN
	1    6200 3150
	1    0    0    -1  
$EndComp
$Comp
L Device:R_Small R5
U 1 1 5EF6066C
P 5750 3050
AR Path="/5EDC7347/5EF6066C" Ref="R5"  Part="1" 
AR Path="/5EF8D4D7/5EF6066C" Ref="R?"  Part="1" 
AR Path="/5EF91F99/5EF6066C" Ref="R9"  Part="1" 
AR Path="/5F54F38E/5EF6066C" Ref="R?"  Part="1" 
F 0 "R9" H 5800 3000 39  0000 L CNN
F 1 "140" H 5800 3050 39  0000 L CNN
F 2 "Resistor_SMD:R_0603_1608Metric" H 5750 3050 50  0001 C CNN
F 3 "~" H 5750 3050 50  0001 C CNN
	1    5750 3050
	-1   0    0    1   
$EndComp
Wire Wire Line
	5750 2950 5750 2850
Wire Wire Line
	5750 2850 5950 2850
Connection ~ 5950 2850
Wire Wire Line
	5750 3150 5750 3400
Wire Wire Line
	5950 3150 5950 3400
$Comp
L power:GND #PWR016
U 1 1 5EDCFA30
P 5350 4600
AR Path="/5EDC7347/5EDCFA30" Ref="#PWR016"  Part="1" 
AR Path="/5EF8D4D7/5EDCFA30" Ref="#PWR?"  Part="1" 
AR Path="/5EF91F99/5EDCFA30" Ref="#PWR022"  Part="1" 
AR Path="/5F54F38E/5EDCFA30" Ref="#PWR?"  Part="1" 
F 0 "#PWR022" H 5350 4350 50  0001 C CNN
F 1 "GND" H 5355 4427 39  0000 C CNN
F 2 "" H 5350 4600 50  0001 C CNN
F 3 "" H 5350 4600 50  0001 C CNN
	1    5350 4600
	1    0    0    -1  
$EndComp
$Comp
L Device:R_Small R4
U 1 1 5EDCFA20
P 5350 4500
AR Path="/5EDC7347/5EDCFA20" Ref="R4"  Part="1" 
AR Path="/5EF8D4D7/5EDCFA20" Ref="R?"  Part="1" 
AR Path="/5EF91F99/5EDCFA20" Ref="R8"  Part="1" 
AR Path="/5F54F38E/5EDCFA20" Ref="R?"  Part="1" 
F 0 "R8" H 5400 4450 39  0000 L CNN
F 1 "10k" H 5400 4500 39  0000 L CNN
F 2 "Resistor_SMD:R_0603_1608Metric" H 5350 4500 50  0001 C CNN
F 3 "~" H 5350 4500 50  0001 C CNN
	1    5350 4500
	-1   0    0    1   
$EndComp
Text HLabel 5250 4350 0    39   Input ~ 0
LED_G
Connection ~ 5350 4350
Wire Wire Line
	5350 4350 5250 4350
Wire Wire Line
	5350 4350 5350 4400
Wire Wire Line
	5750 4000 5750 4150
Wire Wire Line
	5750 4550 5750 4600
Wire Wire Line
	5450 4350 5350 4350
$Comp
L Device:Q_NMOS_GSD Q?
U 1 1 5F13D508
P 5650 4350
AR Path="/5ED37053/5F13D508" Ref="Q?"  Part="1" 
AR Path="/5EDC7347/5F13D508" Ref="Q1"  Part="1" 
AR Path="/5EF91F99/5F13D508" Ref="Q3"  Part="1" 
AR Path="/5F54F38E/5F13D508" Ref="Q?"  Part="1" 
F 0 "Q3" H 5350 4600 39  0000 L CNN
F 1 "Si2302CDS" H 5350 4550 39  0000 L CNN
F 2 "Package_TO_SOT_SMD:SOT-23" H 5850 4450 50  0001 C CNN
F 3 "https://eu.mouser.com/datasheet/2/427/si2302cds-1764899.pdf" H 5650 4350 50  0001 C CNN
	1    5650 4350
	1    0    0    -1  
$EndComp
$Comp
L Device:Q_NMOS_GSD Q?
U 1 1 5F13E8F8
P 6050 4350
AR Path="/5ED37053/5F13E8F8" Ref="Q?"  Part="1" 
AR Path="/5EDC7347/5F13E8F8" Ref="Q2"  Part="1" 
AR Path="/5EF91F99/5F13E8F8" Ref="Q4"  Part="1" 
AR Path="/5F54F38E/5F13E8F8" Ref="Q?"  Part="1" 
F 0 "Q4" H 5750 4600 39  0000 L CNN
F 1 "Si2302CDS" H 5750 4550 39  0000 L CNN
F 2 "Package_TO_SOT_SMD:SOT-23" H 6250 4450 50  0001 C CNN
F 3 "https://eu.mouser.com/datasheet/2/427/si2302cds-1764899.pdf" H 6050 4350 50  0001 C CNN
	1    6050 4350
	-1   0    0    -1  
$EndComp
Text Notes 5250 3750 0    39   ~ 0
If = 20 mA
$Comp
L Device:C_Small C9
U 1 1 5F5AB11A
P 5500 3050
AR Path="/5EDC7347/5F5AB11A" Ref="C9"  Part="1" 
AR Path="/5EF8D4D7/5F5AB11A" Ref="C?"  Part="1" 
AR Path="/5EF91F99/5F5AB11A" Ref="C10"  Part="1" 
AR Path="/5F54F38E/5F5AB11A" Ref="C?"  Part="1" 
F 0 "C10" H 5650 3000 39  0000 R CNN
F 1 "1u" H 5650 3050 39  0000 R CNN
F 2 "Capacitor_SMD:C_0603_1608Metric" H 5500 3050 50  0001 C CNN
F 3 "~" H 5500 3050 50  0001 C CNN
	1    5500 3050
	-1   0    0    1   
$EndComp
$Comp
L power:+5V #PWR0111
U 1 1 5F5AB120
P 5500 2850
AR Path="/5EDC7347/5F5AB120" Ref="#PWR0111"  Part="1" 
AR Path="/5EF8D4D7/5F5AB120" Ref="#PWR?"  Part="1" 
AR Path="/5EF91F99/5F5AB120" Ref="#PWR0113"  Part="1" 
AR Path="/5F54F38E/5F5AB120" Ref="#PWR?"  Part="1" 
F 0 "#PWR0113" H 5500 2700 50  0001 C CNN
F 1 "+5V" H 5515 3023 39  0000 C CNN
F 2 "" H 5500 2850 50  0001 C CNN
F 3 "" H 5500 2850 50  0001 C CNN
	1    5500 2850
	-1   0    0    -1  
$EndComp
Wire Wire Line
	5500 2950 5500 2850
Wire Wire Line
	5500 2850 5750 2850
Connection ~ 5500 2850
$Comp
L power:GND #PWR0112
U 1 1 5F5AB129
P 5500 3150
AR Path="/5EDC7347/5F5AB129" Ref="#PWR0112"  Part="1" 
AR Path="/5EF8D4D7/5F5AB129" Ref="#PWR?"  Part="1" 
AR Path="/5EF91F99/5F5AB129" Ref="#PWR0114"  Part="1" 
AR Path="/5F54F38E/5F5AB129" Ref="#PWR?"  Part="1" 
F 0 "#PWR0114" H 5500 2900 50  0001 C CNN
F 1 "GND" H 5505 2977 39  0000 C CNN
F 2 "" H 5500 3150 50  0001 C CNN
F 3 "" H 5500 3150 50  0001 C CNN
	1    5500 3150
	-1   0    0    -1  
$EndComp
$EndSCHEMATC
