EESchema Schematic File Version 4
EELAYER 30 0
EELAYER END
$Descr A4 11693 8268
encoding utf-8
Sheet 3 6
Title "Server Status"
Date "2020-08-14"
Rev "1.0"
Comp "Institute for Automation of Complex Power Systems - E.ON ERC - RWTH Aachen University"
Comment1 "Designer: D. Wienands, S. Melcher, L. Jeske, D. Moll"
Comment2 "Supervisor: C. Guarnieri Calò Carducci"
Comment3 ""
Comment4 ""
$EndDescr
Wire Wire Line
	3225 2100 3125 2100
$Comp
L power:GND #PWR?
U 1 1 5F19B2AE
P 3125 2450
AR Path="/5F133236/5F19B2AE" Ref="#PWR?"  Part="1" 
AR Path="/5F1207D0/5F19B2AE" Ref="#PWR022"  Part="1" 
F 0 "#PWR022" H 3125 2200 50  0001 C CNN
F 1 "GND" H 3130 2277 39  0000 C CNN
F 2 "" H 3125 2450 50  0001 C CNN
F 3 "" H 3125 2450 50  0001 C CNN
	1    3125 2450
	1    0    0    -1  
$EndComp
Wire Wire Line
	3125 2100 3125 2200
Wire Wire Line
	3525 2300 3525 2450
$Comp
L Device:R_Small R?
U 1 1 5F19B2D4
P 3125 2300
AR Path="/5F133236/5F19B2D4" Ref="R?"  Part="1" 
AR Path="/5F1207D0/5F19B2D4" Ref="R7"  Part="1" 
F 0 "R7" H 3184 2346 39  0000 L CNN
F 1 "10k" H 3184 2255 39  0000 L CNN
F 2 "Resistor_SMD:R_0603_1608Metric" H 3125 2300 50  0001 C CNN
F 3 "~" H 3125 2300 50  0001 C CNN
	1    3125 2300
	1    0    0    -1  
$EndComp
Text HLabel 3025 2100 0    39   Input ~ 0
STATUS
$Comp
L Device:Q_NMOS_GSD Q?
U 1 1 5F19B2F1
P 3425 2100
AR Path="/5EF380A1/5F19B2F1" Ref="Q?"  Part="1" 
AR Path="/5F1207D0/5F19B2F1" Ref="Q3"  Part="1" 
AR Path="/5F133236/5F19B2F1" Ref="Q?"  Part="1" 
F 0 "Q3" H 3629 2146 39  0000 L CNN
F 1 "Si2302CDS" H 3629 2055 39  0000 L CNN
F 2 "Package_TO_SOT_SMD:SOT-23" H 3625 2200 50  0001 C CNN
F 3 "https://eu.mouser.com/datasheet/2/427/si2302cds-1764899.pdf" H 3425 2100 50  0001 C CNN
	1    3425 2100
	1    0    0    -1  
$EndComp
Wire Wire Line
	3125 2400 3125 2450
$Comp
L power:GND #PWR?
U 1 1 5F35F49A
P 3525 2450
AR Path="/5F133236/5F35F49A" Ref="#PWR?"  Part="1" 
AR Path="/5F1207D0/5F35F49A" Ref="#PWR025"  Part="1" 
F 0 "#PWR025" H 3525 2200 50  0001 C CNN
F 1 "GND" H 3530 2277 39  0000 C CNN
F 2 "" H 3525 2450 50  0001 C CNN
F 3 "" H 3525 2450 50  0001 C CNN
	1    3525 2450
	1    0    0    -1  
$EndComp
Connection ~ 3125 2100
Wire Wire Line
	3025 2100 3125 2100
Wire Wire Line
	3525 1800 3525 1900
$Comp
L Device:LED D4
U 1 1 5F3662C9
P 3525 1650
F 0 "D4" V 3564 1532 39  0000 R CNN
F 1 "IN-S126AT5UW" V 3473 1532 39  0000 R CNN
F 2 "LED_SMD:LED_1206_3216Metric_Castellated" H 3525 1650 50  0001 C CNN
F 3 "http://inolux-corp.com/datasheet/SMDLED/Mono%20Color%20Top%20View/IN-S126AT%20Series_V1.0.pdf" H 3525 1650 50  0001 C CNN
	1    3525 1650
	0    -1   -1   0   
$EndComp
$Comp
L Device:R_Small R?
U 1 1 5F416A3E
P 3525 1300
AR Path="/5F133236/5F416A3E" Ref="R?"  Part="1" 
AR Path="/5F1207D0/5F416A3E" Ref="R9"  Part="1" 
F 0 "R9" H 3584 1346 39  0000 L CNN
F 1 "20" H 3584 1255 39  0000 L CNN
F 2 "Resistor_SMD:R_0603_1608Metric" H 3525 1300 50  0001 C CNN
F 3 "~" H 3525 1300 50  0001 C CNN
	1    3525 1300
	1    0    0    -1  
$EndComp
Wire Wire Line
	3525 1400 3525 1500
$Comp
L power:+3.3V #PWR?
U 1 1 5F41931C
P 3525 1125
AR Path="/5F10B8E7/5F41931C" Ref="#PWR?"  Part="1" 
AR Path="/5F41931C" Ref="#PWR?"  Part="1" 
AR Path="/5F1207D0/5F41931C" Ref="#PWR024"  Part="1" 
F 0 "#PWR024" H 3525 975 50  0001 C CNN
F 1 "+3.3V" H 3540 1290 39  0000 C CNN
F 2 "" H 3525 1125 50  0001 C CNN
F 3 "" H 3525 1125 50  0001 C CNN
	1    3525 1125
	1    0    0    -1  
$EndComp
Wire Wire Line
	3525 1125 3525 1200
Wire Wire Line
	4725 2100 4625 2100
$Comp
L power:GND #PWR?
U 1 1 5F425CB2
P 4625 2450
AR Path="/5F133236/5F425CB2" Ref="#PWR?"  Part="1" 
AR Path="/5F1207D0/5F425CB2" Ref="#PWR028"  Part="1" 
F 0 "#PWR028" H 4625 2200 50  0001 C CNN
F 1 "GND" H 4630 2277 39  0000 C CNN
F 2 "" H 4625 2450 50  0001 C CNN
F 3 "" H 4625 2450 50  0001 C CNN
	1    4625 2450
	1    0    0    -1  
$EndComp
Wire Wire Line
	4625 2100 4625 2200
Wire Wire Line
	5025 2300 5025 2450
$Comp
L Device:R_Small R?
U 1 1 5F425CBA
P 4625 2300
AR Path="/5F133236/5F425CBA" Ref="R?"  Part="1" 
AR Path="/5F1207D0/5F425CBA" Ref="R11"  Part="1" 
F 0 "R11" H 4684 2346 39  0000 L CNN
F 1 "10k" H 4684 2255 39  0000 L CNN
F 2 "Resistor_SMD:R_0603_1608Metric" H 4625 2300 50  0001 C CNN
F 3 "~" H 4625 2300 50  0001 C CNN
	1    4625 2300
	1    0    0    -1  
$EndComp
Text HLabel 4525 2100 0    39   Input ~ 0
STATUS
$Comp
L Device:Q_NMOS_GSD Q?
U 1 1 5F425CC1
P 4925 2100
AR Path="/5EF380A1/5F425CC1" Ref="Q?"  Part="1" 
AR Path="/5F1207D0/5F425CC1" Ref="Q5"  Part="1" 
AR Path="/5F133236/5F425CC1" Ref="Q?"  Part="1" 
F 0 "Q5" H 5129 2146 39  0000 L CNN
F 1 "Si2302CDS" H 5129 2055 39  0000 L CNN
F 2 "Package_TO_SOT_SMD:SOT-23" H 5125 2200 50  0001 C CNN
F 3 "https://eu.mouser.com/datasheet/2/427/si2302cds-1764899.pdf" H 4925 2100 50  0001 C CNN
	1    4925 2100
	1    0    0    -1  
$EndComp
Wire Wire Line
	4625 2400 4625 2450
$Comp
L power:GND #PWR?
U 1 1 5F425CC8
P 5025 2450
AR Path="/5F133236/5F425CC8" Ref="#PWR?"  Part="1" 
AR Path="/5F1207D0/5F425CC8" Ref="#PWR031"  Part="1" 
F 0 "#PWR031" H 5025 2200 50  0001 C CNN
F 1 "GND" H 5030 2277 39  0000 C CNN
F 2 "" H 5025 2450 50  0001 C CNN
F 3 "" H 5025 2450 50  0001 C CNN
	1    5025 2450
	1    0    0    -1  
$EndComp
Connection ~ 4625 2100
Wire Wire Line
	4525 2100 4625 2100
Wire Wire Line
	5025 1800 5025 1900
$Comp
L Device:LED D6
U 1 1 5F425CD1
P 5025 1650
F 0 "D6" V 5064 1532 39  0000 R CNN
F 1 "IN-S126AT5UW" V 4973 1532 39  0000 R CNN
F 2 "LED_SMD:LED_1206_3216Metric_Castellated" H 5025 1650 50  0001 C CNN
F 3 "http://inolux-corp.com/datasheet/SMDLED/Mono%20Color%20Top%20View/IN-S126AT%20Series_V1.0.pdf" H 5025 1650 50  0001 C CNN
	1    5025 1650
	0    -1   -1   0   
$EndComp
$Comp
L Device:R_Small R?
U 1 1 5F425CD7
P 5025 1300
AR Path="/5F133236/5F425CD7" Ref="R?"  Part="1" 
AR Path="/5F1207D0/5F425CD7" Ref="R13"  Part="1" 
F 0 "R13" H 5084 1346 39  0000 L CNN
F 1 "20" H 5084 1255 39  0000 L CNN
F 2 "Resistor_SMD:R_0603_1608Metric" H 5025 1300 50  0001 C CNN
F 3 "~" H 5025 1300 50  0001 C CNN
	1    5025 1300
	1    0    0    -1  
$EndComp
Wire Wire Line
	5025 1400 5025 1500
$Comp
L power:+3.3V #PWR?
U 1 1 5F425CDE
P 5025 1125
AR Path="/5F10B8E7/5F425CDE" Ref="#PWR?"  Part="1" 
AR Path="/5F425CDE" Ref="#PWR?"  Part="1" 
AR Path="/5F1207D0/5F425CDE" Ref="#PWR030"  Part="1" 
F 0 "#PWR030" H 5025 975 50  0001 C CNN
F 1 "+3.3V" H 5040 1290 39  0000 C CNN
F 2 "" H 5025 1125 50  0001 C CNN
F 3 "" H 5025 1125 50  0001 C CNN
	1    5025 1125
	1    0    0    -1  
$EndComp
Wire Wire Line
	5025 1125 5025 1200
Wire Wire Line
	1725 2100 1625 2100
$Comp
L power:GND #PWR?
U 1 1 5F42E39B
P 1625 2450
AR Path="/5F133236/5F42E39B" Ref="#PWR?"  Part="1" 
AR Path="/5F1207D0/5F42E39B" Ref="#PWR016"  Part="1" 
F 0 "#PWR016" H 1625 2200 50  0001 C CNN
F 1 "GND" H 1630 2277 39  0000 C CNN
F 2 "" H 1625 2450 50  0001 C CNN
F 3 "" H 1625 2450 50  0001 C CNN
	1    1625 2450
	1    0    0    -1  
$EndComp
Wire Wire Line
	1625 2100 1625 2200
Wire Wire Line
	2025 2300 2025 2450
$Comp
L Device:R_Small R?
U 1 1 5F42E3A3
P 1625 2300
AR Path="/5F133236/5F42E3A3" Ref="R?"  Part="1" 
AR Path="/5F1207D0/5F42E3A3" Ref="R3"  Part="1" 
F 0 "R3" H 1684 2346 39  0000 L CNN
F 1 "10k" H 1684 2255 39  0000 L CNN
F 2 "Resistor_SMD:R_0603_1608Metric" H 1625 2300 50  0001 C CNN
F 3 "~" H 1625 2300 50  0001 C CNN
	1    1625 2300
	1    0    0    -1  
$EndComp
Text HLabel 1525 2100 0    39   Input ~ 0
STATUS
$Comp
L Device:Q_NMOS_GSD Q?
U 1 1 5F42E3AA
P 1925 2100
AR Path="/5EF380A1/5F42E3AA" Ref="Q?"  Part="1" 
AR Path="/5F1207D0/5F42E3AA" Ref="Q1"  Part="1" 
AR Path="/5F133236/5F42E3AA" Ref="Q?"  Part="1" 
F 0 "Q1" H 2129 2146 39  0000 L CNN
F 1 "Si2302CDS" H 2129 2055 39  0000 L CNN
F 2 "Package_TO_SOT_SMD:SOT-23" H 2125 2200 50  0001 C CNN
F 3 "https://eu.mouser.com/datasheet/2/427/si2302cds-1764899.pdf" H 1925 2100 50  0001 C CNN
	1    1925 2100
	1    0    0    -1  
$EndComp
Wire Wire Line
	1625 2400 1625 2450
$Comp
L power:GND #PWR?
U 1 1 5F42E3B1
P 2025 2450
AR Path="/5F133236/5F42E3B1" Ref="#PWR?"  Part="1" 
AR Path="/5F1207D0/5F42E3B1" Ref="#PWR019"  Part="1" 
F 0 "#PWR019" H 2025 2200 50  0001 C CNN
F 1 "GND" H 2030 2277 39  0000 C CNN
F 2 "" H 2025 2450 50  0001 C CNN
F 3 "" H 2025 2450 50  0001 C CNN
	1    2025 2450
	1    0    0    -1  
$EndComp
Connection ~ 1625 2100
Wire Wire Line
	1525 2100 1625 2100
Wire Wire Line
	2025 1800 2025 1900
$Comp
L Device:LED D2
U 1 1 5F42E3BA
P 2025 1650
F 0 "D2" V 2064 1532 39  0000 R CNN
F 1 "IN-S126AT5UW" V 1973 1532 39  0000 R CNN
F 2 "LED_SMD:LED_1206_3216Metric_Castellated" H 2025 1650 50  0001 C CNN
F 3 "http://inolux-corp.com/datasheet/SMDLED/Mono%20Color%20Top%20View/IN-S126AT%20Series_V1.0.pdf" H 2025 1650 50  0001 C CNN
	1    2025 1650
	0    -1   -1   0   
$EndComp
$Comp
L Device:R_Small R?
U 1 1 5F42E3C0
P 2025 1300
AR Path="/5F133236/5F42E3C0" Ref="R?"  Part="1" 
AR Path="/5F1207D0/5F42E3C0" Ref="R5"  Part="1" 
F 0 "R5" H 2084 1346 39  0000 L CNN
F 1 "20" H 2084 1255 39  0000 L CNN
F 2 "Resistor_SMD:R_0603_1608Metric" H 2025 1300 50  0001 C CNN
F 3 "~" H 2025 1300 50  0001 C CNN
	1    2025 1300
	1    0    0    -1  
$EndComp
Wire Wire Line
	2025 1400 2025 1500
$Comp
L power:+3.3V #PWR?
U 1 1 5F42E3C7
P 2025 1125
AR Path="/5F10B8E7/5F42E3C7" Ref="#PWR?"  Part="1" 
AR Path="/5F42E3C7" Ref="#PWR?"  Part="1" 
AR Path="/5F1207D0/5F42E3C7" Ref="#PWR018"  Part="1" 
F 0 "#PWR018" H 2025 975 50  0001 C CNN
F 1 "+3.3V" H 2040 1290 39  0000 C CNN
F 2 "" H 2025 1125 50  0001 C CNN
F 3 "" H 2025 1125 50  0001 C CNN
	1    2025 1125
	1    0    0    -1  
$EndComp
Wire Wire Line
	2025 1125 2025 1200
Wire Wire Line
	6225 2100 6125 2100
$Comp
L power:GND #PWR?
U 1 1 5F433378
P 6125 2450
AR Path="/5F133236/5F433378" Ref="#PWR?"  Part="1" 
AR Path="/5F1207D0/5F433378" Ref="#PWR034"  Part="1" 
F 0 "#PWR034" H 6125 2200 50  0001 C CNN
F 1 "GND" H 6130 2277 39  0000 C CNN
F 2 "" H 6125 2450 50  0001 C CNN
F 3 "" H 6125 2450 50  0001 C CNN
	1    6125 2450
	1    0    0    -1  
$EndComp
Wire Wire Line
	6125 2100 6125 2200
Wire Wire Line
	6525 2300 6525 2450
$Comp
L Device:R_Small R?
U 1 1 5F433380
P 6125 2300
AR Path="/5F133236/5F433380" Ref="R?"  Part="1" 
AR Path="/5F1207D0/5F433380" Ref="R15"  Part="1" 
F 0 "R15" H 6184 2346 39  0000 L CNN
F 1 "10k" H 6184 2255 39  0000 L CNN
F 2 "Resistor_SMD:R_0603_1608Metric" H 6125 2300 50  0001 C CNN
F 3 "~" H 6125 2300 50  0001 C CNN
	1    6125 2300
	1    0    0    -1  
$EndComp
Text HLabel 6025 2100 0    39   Input ~ 0
STATUS
$Comp
L Device:Q_NMOS_GSD Q?
U 1 1 5F433387
P 6425 2100
AR Path="/5EF380A1/5F433387" Ref="Q?"  Part="1" 
AR Path="/5F1207D0/5F433387" Ref="Q7"  Part="1" 
AR Path="/5F133236/5F433387" Ref="Q?"  Part="1" 
F 0 "Q7" H 6629 2146 39  0000 L CNN
F 1 "Si2302CDS" H 6629 2055 39  0000 L CNN
F 2 "Package_TO_SOT_SMD:SOT-23" H 6625 2200 50  0001 C CNN
F 3 "https://eu.mouser.com/datasheet/2/427/si2302cds-1764899.pdf" H 6425 2100 50  0001 C CNN
	1    6425 2100
	1    0    0    -1  
$EndComp
Wire Wire Line
	6125 2400 6125 2450
$Comp
L power:GND #PWR?
U 1 1 5F43338E
P 6525 2450
AR Path="/5F133236/5F43338E" Ref="#PWR?"  Part="1" 
AR Path="/5F1207D0/5F43338E" Ref="#PWR037"  Part="1" 
F 0 "#PWR037" H 6525 2200 50  0001 C CNN
F 1 "GND" H 6530 2277 39  0000 C CNN
F 2 "" H 6525 2450 50  0001 C CNN
F 3 "" H 6525 2450 50  0001 C CNN
	1    6525 2450
	1    0    0    -1  
$EndComp
Connection ~ 6125 2100
Wire Wire Line
	6025 2100 6125 2100
Wire Wire Line
	6525 1800 6525 1900
$Comp
L Device:LED D8
U 1 1 5F433397
P 6525 1650
F 0 "D8" V 6564 1532 39  0000 R CNN
F 1 "IN-S126AT5UW" V 6473 1532 39  0000 R CNN
F 2 "LED_SMD:LED_1206_3216Metric_Castellated" H 6525 1650 50  0001 C CNN
F 3 "http://inolux-corp.com/datasheet/SMDLED/Mono%20Color%20Top%20View/IN-S126AT%20Series_V1.0.pdf" H 6525 1650 50  0001 C CNN
	1    6525 1650
	0    -1   -1   0   
$EndComp
$Comp
L Device:R_Small R?
U 1 1 5F43339D
P 6525 1300
AR Path="/5F133236/5F43339D" Ref="R?"  Part="1" 
AR Path="/5F1207D0/5F43339D" Ref="R17"  Part="1" 
F 0 "R17" H 6584 1346 39  0000 L CNN
F 1 "20" H 6584 1255 39  0000 L CNN
F 2 "Resistor_SMD:R_0603_1608Metric" H 6525 1300 50  0001 C CNN
F 3 "~" H 6525 1300 50  0001 C CNN
	1    6525 1300
	1    0    0    -1  
$EndComp
Wire Wire Line
	6525 1400 6525 1500
$Comp
L power:+3.3V #PWR?
U 1 1 5F4333A4
P 6525 1125
AR Path="/5F10B8E7/5F4333A4" Ref="#PWR?"  Part="1" 
AR Path="/5F4333A4" Ref="#PWR?"  Part="1" 
AR Path="/5F1207D0/5F4333A4" Ref="#PWR036"  Part="1" 
F 0 "#PWR036" H 6525 975 50  0001 C CNN
F 1 "+3.3V" H 6540 1290 39  0000 C CNN
F 2 "" H 6525 1125 50  0001 C CNN
F 3 "" H 6525 1125 50  0001 C CNN
	1    6525 1125
	1    0    0    -1  
$EndComp
Wire Wire Line
	6525 1125 6525 1200
Wire Wire Line
	7725 2100 7625 2100
$Comp
L power:GND #PWR?
U 1 1 5F438008
P 7625 2450
AR Path="/5F133236/5F438008" Ref="#PWR?"  Part="1" 
AR Path="/5F1207D0/5F438008" Ref="#PWR040"  Part="1" 
F 0 "#PWR040" H 7625 2200 50  0001 C CNN
F 1 "GND" H 7630 2277 39  0000 C CNN
F 2 "" H 7625 2450 50  0001 C CNN
F 3 "" H 7625 2450 50  0001 C CNN
	1    7625 2450
	1    0    0    -1  
$EndComp
Wire Wire Line
	7625 2100 7625 2200
Wire Wire Line
	8025 2300 8025 2450
$Comp
L Device:R_Small R?
U 1 1 5F438010
P 7625 2300
AR Path="/5F133236/5F438010" Ref="R?"  Part="1" 
AR Path="/5F1207D0/5F438010" Ref="R19"  Part="1" 
F 0 "R19" H 7684 2346 39  0000 L CNN
F 1 "10k" H 7684 2255 39  0000 L CNN
F 2 "Resistor_SMD:R_0603_1608Metric" H 7625 2300 50  0001 C CNN
F 3 "~" H 7625 2300 50  0001 C CNN
	1    7625 2300
	1    0    0    -1  
$EndComp
Text HLabel 7525 2100 0    39   Input ~ 0
STATUS
$Comp
L Device:Q_NMOS_GSD Q?
U 1 1 5F438017
P 7925 2100
AR Path="/5EF380A1/5F438017" Ref="Q?"  Part="1" 
AR Path="/5F1207D0/5F438017" Ref="Q9"  Part="1" 
AR Path="/5F133236/5F438017" Ref="Q?"  Part="1" 
F 0 "Q9" H 8129 2146 39  0000 L CNN
F 1 "Si2302CDS" H 8129 2055 39  0000 L CNN
F 2 "Package_TO_SOT_SMD:SOT-23" H 8125 2200 50  0001 C CNN
F 3 "https://eu.mouser.com/datasheet/2/427/si2302cds-1764899.pdf" H 7925 2100 50  0001 C CNN
	1    7925 2100
	1    0    0    -1  
$EndComp
Wire Wire Line
	7625 2400 7625 2450
$Comp
L power:GND #PWR?
U 1 1 5F43801E
P 8025 2450
AR Path="/5F133236/5F43801E" Ref="#PWR?"  Part="1" 
AR Path="/5F1207D0/5F43801E" Ref="#PWR043"  Part="1" 
F 0 "#PWR043" H 8025 2200 50  0001 C CNN
F 1 "GND" H 8030 2277 39  0000 C CNN
F 2 "" H 8025 2450 50  0001 C CNN
F 3 "" H 8025 2450 50  0001 C CNN
	1    8025 2450
	1    0    0    -1  
$EndComp
Connection ~ 7625 2100
Wire Wire Line
	7525 2100 7625 2100
Wire Wire Line
	8025 1800 8025 1900
$Comp
L Device:LED D10
U 1 1 5F438027
P 8025 1650
F 0 "D10" V 8064 1532 39  0000 R CNN
F 1 "IN-S126AT5UW" V 7973 1532 39  0000 R CNN
F 2 "LED_SMD:LED_1206_3216Metric_Castellated" H 8025 1650 50  0001 C CNN
F 3 "http://inolux-corp.com/datasheet/SMDLED/Mono%20Color%20Top%20View/IN-S126AT%20Series_V1.0.pdf" H 8025 1650 50  0001 C CNN
	1    8025 1650
	0    -1   -1   0   
$EndComp
$Comp
L Device:R_Small R?
U 1 1 5F43802D
P 8025 1300
AR Path="/5F133236/5F43802D" Ref="R?"  Part="1" 
AR Path="/5F1207D0/5F43802D" Ref="R21"  Part="1" 
F 0 "R21" H 8084 1346 39  0000 L CNN
F 1 "20" H 8084 1255 39  0000 L CNN
F 2 "Resistor_SMD:R_0603_1608Metric" H 8025 1300 50  0001 C CNN
F 3 "~" H 8025 1300 50  0001 C CNN
	1    8025 1300
	1    0    0    -1  
$EndComp
Wire Wire Line
	8025 1400 8025 1500
$Comp
L power:+3.3V #PWR?
U 1 1 5F438034
P 8025 1125
AR Path="/5F10B8E7/5F438034" Ref="#PWR?"  Part="1" 
AR Path="/5F438034" Ref="#PWR?"  Part="1" 
AR Path="/5F1207D0/5F438034" Ref="#PWR042"  Part="1" 
F 0 "#PWR042" H 8025 975 50  0001 C CNN
F 1 "+3.3V" H 8040 1290 39  0000 C CNN
F 2 "" H 8025 1125 50  0001 C CNN
F 3 "" H 8025 1125 50  0001 C CNN
	1    8025 1125
	1    0    0    -1  
$EndComp
Wire Wire Line
	8025 1125 8025 1200
Wire Wire Line
	9225 2100 9125 2100
$Comp
L power:GND #PWR?
U 1 1 5F43C8AE
P 9125 2450
AR Path="/5F133236/5F43C8AE" Ref="#PWR?"  Part="1" 
AR Path="/5F1207D0/5F43C8AE" Ref="#PWR046"  Part="1" 
F 0 "#PWR046" H 9125 2200 50  0001 C CNN
F 1 "GND" H 9130 2277 39  0000 C CNN
F 2 "" H 9125 2450 50  0001 C CNN
F 3 "" H 9125 2450 50  0001 C CNN
	1    9125 2450
	1    0    0    -1  
$EndComp
Wire Wire Line
	9125 2100 9125 2200
Wire Wire Line
	9525 2300 9525 2450
$Comp
L Device:R_Small R?
U 1 1 5F43C8B6
P 9125 2300
AR Path="/5F133236/5F43C8B6" Ref="R?"  Part="1" 
AR Path="/5F1207D0/5F43C8B6" Ref="R23"  Part="1" 
F 0 "R23" H 9184 2346 39  0000 L CNN
F 1 "10k" H 9184 2255 39  0000 L CNN
F 2 "Resistor_SMD:R_0603_1608Metric" H 9125 2300 50  0001 C CNN
F 3 "~" H 9125 2300 50  0001 C CNN
	1    9125 2300
	1    0    0    -1  
$EndComp
Text HLabel 9025 2100 0    39   Input ~ 0
STATUS
$Comp
L Device:Q_NMOS_GSD Q?
U 1 1 5F43C8BD
P 9425 2100
AR Path="/5EF380A1/5F43C8BD" Ref="Q?"  Part="1" 
AR Path="/5F1207D0/5F43C8BD" Ref="Q11"  Part="1" 
AR Path="/5F133236/5F43C8BD" Ref="Q?"  Part="1" 
F 0 "Q11" H 9629 2146 39  0000 L CNN
F 1 "Si2302CDS" H 9629 2055 39  0000 L CNN
F 2 "Package_TO_SOT_SMD:SOT-23" H 9625 2200 50  0001 C CNN
F 3 "https://eu.mouser.com/datasheet/2/427/si2302cds-1764899.pdf" H 9425 2100 50  0001 C CNN
	1    9425 2100
	1    0    0    -1  
$EndComp
Wire Wire Line
	9125 2400 9125 2450
$Comp
L power:GND #PWR?
U 1 1 5F43C8C4
P 9525 2450
AR Path="/5F133236/5F43C8C4" Ref="#PWR?"  Part="1" 
AR Path="/5F1207D0/5F43C8C4" Ref="#PWR049"  Part="1" 
F 0 "#PWR049" H 9525 2200 50  0001 C CNN
F 1 "GND" H 9530 2277 39  0000 C CNN
F 2 "" H 9525 2450 50  0001 C CNN
F 3 "" H 9525 2450 50  0001 C CNN
	1    9525 2450
	1    0    0    -1  
$EndComp
Connection ~ 9125 2100
Wire Wire Line
	9025 2100 9125 2100
Wire Wire Line
	9525 1800 9525 1900
$Comp
L Device:LED D12
U 1 1 5F43C8CD
P 9525 1650
F 0 "D12" V 9564 1532 39  0000 R CNN
F 1 "IN-S126AT5UW" V 9473 1532 39  0000 R CNN
F 2 "LED_SMD:LED_1206_3216Metric_Castellated" H 9525 1650 50  0001 C CNN
F 3 "http://inolux-corp.com/datasheet/SMDLED/Mono%20Color%20Top%20View/IN-S126AT%20Series_V1.0.pdf" H 9525 1650 50  0001 C CNN
	1    9525 1650
	0    -1   -1   0   
$EndComp
$Comp
L Device:R_Small R?
U 1 1 5F43C8D3
P 9525 1300
AR Path="/5F133236/5F43C8D3" Ref="R?"  Part="1" 
AR Path="/5F1207D0/5F43C8D3" Ref="R25"  Part="1" 
F 0 "R25" H 9584 1346 39  0000 L CNN
F 1 "20" H 9584 1255 39  0000 L CNN
F 2 "Resistor_SMD:R_0603_1608Metric" H 9525 1300 50  0001 C CNN
F 3 "~" H 9525 1300 50  0001 C CNN
	1    9525 1300
	1    0    0    -1  
$EndComp
Wire Wire Line
	9525 1400 9525 1500
$Comp
L power:+3.3V #PWR?
U 1 1 5F43C8DA
P 9525 1125
AR Path="/5F10B8E7/5F43C8DA" Ref="#PWR?"  Part="1" 
AR Path="/5F43C8DA" Ref="#PWR?"  Part="1" 
AR Path="/5F1207D0/5F43C8DA" Ref="#PWR048"  Part="1" 
F 0 "#PWR048" H 9525 975 50  0001 C CNN
F 1 "+3.3V" H 9540 1290 39  0000 C CNN
F 2 "" H 9525 1125 50  0001 C CNN
F 3 "" H 9525 1125 50  0001 C CNN
	1    9525 1125
	1    0    0    -1  
$EndComp
Wire Wire Line
	9525 1125 9525 1200
Wire Wire Line
	3225 4600 3125 4600
$Comp
L power:GND #PWR?
U 1 1 5F473BB6
P 3125 4950
AR Path="/5F133236/5F473BB6" Ref="#PWR?"  Part="1" 
AR Path="/5F1207D0/5F473BB6" Ref="#PWR023"  Part="1" 
F 0 "#PWR023" H 3125 4700 50  0001 C CNN
F 1 "GND" H 3130 4777 39  0000 C CNN
F 2 "" H 3125 4950 50  0001 C CNN
F 3 "" H 3125 4950 50  0001 C CNN
	1    3125 4950
	1    0    0    -1  
$EndComp
Wire Wire Line
	3125 4600 3125 4700
Wire Wire Line
	3525 4800 3525 4950
$Comp
L Device:R_Small R?
U 1 1 5F473BBE
P 3125 4800
AR Path="/5F133236/5F473BBE" Ref="R?"  Part="1" 
AR Path="/5F1207D0/5F473BBE" Ref="R8"  Part="1" 
F 0 "R8" H 3184 4846 39  0000 L CNN
F 1 "10k" H 3184 4755 39  0000 L CNN
F 2 "Resistor_SMD:R_0603_1608Metric" H 3125 4800 50  0001 C CNN
F 3 "~" H 3125 4800 50  0001 C CNN
	1    3125 4800
	1    0    0    -1  
$EndComp
Text HLabel 3025 4600 0    39   Input ~ 0
SERVER2
$Comp
L Device:Q_NMOS_GSD Q?
U 1 1 5F473BC5
P 3425 4600
AR Path="/5EF380A1/5F473BC5" Ref="Q?"  Part="1" 
AR Path="/5F1207D0/5F473BC5" Ref="Q4"  Part="1" 
AR Path="/5F133236/5F473BC5" Ref="Q?"  Part="1" 
F 0 "Q4" H 3629 4646 39  0000 L CNN
F 1 "Si2302CDS" H 3629 4555 39  0000 L CNN
F 2 "Package_TO_SOT_SMD:SOT-23" H 3625 4700 50  0001 C CNN
F 3 "https://eu.mouser.com/datasheet/2/427/si2302cds-1764899.pdf" H 3425 4600 50  0001 C CNN
	1    3425 4600
	1    0    0    -1  
$EndComp
Wire Wire Line
	3125 4900 3125 4950
$Comp
L power:GND #PWR?
U 1 1 5F473BCC
P 3525 4950
AR Path="/5F133236/5F473BCC" Ref="#PWR?"  Part="1" 
AR Path="/5F1207D0/5F473BCC" Ref="#PWR027"  Part="1" 
F 0 "#PWR027" H 3525 4700 50  0001 C CNN
F 1 "GND" H 3530 4777 39  0000 C CNN
F 2 "" H 3525 4950 50  0001 C CNN
F 3 "" H 3525 4950 50  0001 C CNN
	1    3525 4950
	1    0    0    -1  
$EndComp
Connection ~ 3125 4600
Wire Wire Line
	3025 4600 3125 4600
Wire Wire Line
	3525 4300 3525 4400
$Comp
L Device:LED D5
U 1 1 5F473BD5
P 3525 4150
F 0 "D5" V 3564 4032 39  0000 R CNN
F 1 "IN-S126ATB " V 3473 4032 39  0000 R CNN
F 2 "LED_SMD:LED_1206_3216Metric_Castellated" H 3525 4150 50  0001 C CNN
F 3 "http://inolux-corp.com/datasheet/SMDLED/Mono%20Color%20Top%20View/IN-S126AT%20Series_V1.0.pdf" H 3525 4150 50  0001 C CNN
	1    3525 4150
	0    -1   -1   0   
$EndComp
$Comp
L Device:R_Small R?
U 1 1 5F473BDB
P 3525 3800
AR Path="/5F133236/5F473BDB" Ref="R?"  Part="1" 
AR Path="/5F1207D0/5F473BDB" Ref="R10"  Part="1" 
F 0 "R10" H 3584 3846 39  0000 L CNN
F 1 "20" H 3584 3755 39  0000 L CNN
F 2 "Resistor_SMD:R_0603_1608Metric" H 3525 3800 50  0001 C CNN
F 3 "~" H 3525 3800 50  0001 C CNN
	1    3525 3800
	1    0    0    -1  
$EndComp
Wire Wire Line
	3525 3900 3525 4000
$Comp
L power:+3.3V #PWR?
U 1 1 5F473BE2
P 3525 3625
AR Path="/5F10B8E7/5F473BE2" Ref="#PWR?"  Part="1" 
AR Path="/5F473BE2" Ref="#PWR?"  Part="1" 
AR Path="/5F1207D0/5F473BE2" Ref="#PWR026"  Part="1" 
F 0 "#PWR026" H 3525 3475 50  0001 C CNN
F 1 "+3.3V" H 3540 3790 39  0000 C CNN
F 2 "" H 3525 3625 50  0001 C CNN
F 3 "" H 3525 3625 50  0001 C CNN
	1    3525 3625
	1    0    0    -1  
$EndComp
Wire Wire Line
	3525 3625 3525 3700
Wire Wire Line
	4725 4600 4625 4600
$Comp
L power:GND #PWR?
U 1 1 5F473BEA
P 4625 4950
AR Path="/5F133236/5F473BEA" Ref="#PWR?"  Part="1" 
AR Path="/5F1207D0/5F473BEA" Ref="#PWR029"  Part="1" 
F 0 "#PWR029" H 4625 4700 50  0001 C CNN
F 1 "GND" H 4630 4777 39  0000 C CNN
F 2 "" H 4625 4950 50  0001 C CNN
F 3 "" H 4625 4950 50  0001 C CNN
	1    4625 4950
	1    0    0    -1  
$EndComp
Wire Wire Line
	4625 4600 4625 4700
Wire Wire Line
	5025 4800 5025 4950
$Comp
L Device:R_Small R?
U 1 1 5F473BF2
P 4625 4800
AR Path="/5F133236/5F473BF2" Ref="R?"  Part="1" 
AR Path="/5F1207D0/5F473BF2" Ref="R12"  Part="1" 
F 0 "R12" H 4684 4846 39  0000 L CNN
F 1 "10k" H 4684 4755 39  0000 L CNN
F 2 "Resistor_SMD:R_0603_1608Metric" H 4625 4800 50  0001 C CNN
F 3 "~" H 4625 4800 50  0001 C CNN
	1    4625 4800
	1    0    0    -1  
$EndComp
Text HLabel 4525 4600 0    39   Input ~ 0
SERVER3
$Comp
L Device:Q_NMOS_GSD Q?
U 1 1 5F473BF9
P 4925 4600
AR Path="/5EF380A1/5F473BF9" Ref="Q?"  Part="1" 
AR Path="/5F1207D0/5F473BF9" Ref="Q6"  Part="1" 
AR Path="/5F133236/5F473BF9" Ref="Q?"  Part="1" 
F 0 "Q6" H 5129 4646 39  0000 L CNN
F 1 "Si2302CDS" H 5129 4555 39  0000 L CNN
F 2 "Package_TO_SOT_SMD:SOT-23" H 5125 4700 50  0001 C CNN
F 3 "https://eu.mouser.com/datasheet/2/427/si2302cds-1764899.pdf" H 4925 4600 50  0001 C CNN
	1    4925 4600
	1    0    0    -1  
$EndComp
Wire Wire Line
	4625 4900 4625 4950
$Comp
L power:GND #PWR?
U 1 1 5F473C00
P 5025 4950
AR Path="/5F133236/5F473C00" Ref="#PWR?"  Part="1" 
AR Path="/5F1207D0/5F473C00" Ref="#PWR033"  Part="1" 
F 0 "#PWR033" H 5025 4700 50  0001 C CNN
F 1 "GND" H 5030 4777 39  0000 C CNN
F 2 "" H 5025 4950 50  0001 C CNN
F 3 "" H 5025 4950 50  0001 C CNN
	1    5025 4950
	1    0    0    -1  
$EndComp
Connection ~ 4625 4600
Wire Wire Line
	4525 4600 4625 4600
Wire Wire Line
	5025 4300 5025 4400
$Comp
L Device:LED D7
U 1 1 5F473C09
P 5025 4150
F 0 "D7" V 5064 4032 39  0000 R CNN
F 1 "IN-S126ATB " V 4973 4032 39  0000 R CNN
F 2 "LED_SMD:LED_1206_3216Metric_Castellated" H 5025 4150 50  0001 C CNN
F 3 "http://inolux-corp.com/datasheet/SMDLED/Mono%20Color%20Top%20View/IN-S126AT%20Series_V1.0.pdf" H 5025 4150 50  0001 C CNN
	1    5025 4150
	0    -1   -1   0   
$EndComp
$Comp
L Device:R_Small R?
U 1 1 5F473C0F
P 5025 3800
AR Path="/5F133236/5F473C0F" Ref="R?"  Part="1" 
AR Path="/5F1207D0/5F473C0F" Ref="R14"  Part="1" 
F 0 "R14" H 5084 3846 39  0000 L CNN
F 1 "20" H 5084 3755 39  0000 L CNN
F 2 "Resistor_SMD:R_0603_1608Metric" H 5025 3800 50  0001 C CNN
F 3 "~" H 5025 3800 50  0001 C CNN
	1    5025 3800
	1    0    0    -1  
$EndComp
Wire Wire Line
	5025 3900 5025 4000
$Comp
L power:+3.3V #PWR?
U 1 1 5F473C16
P 5025 3625
AR Path="/5F10B8E7/5F473C16" Ref="#PWR?"  Part="1" 
AR Path="/5F473C16" Ref="#PWR?"  Part="1" 
AR Path="/5F1207D0/5F473C16" Ref="#PWR032"  Part="1" 
F 0 "#PWR032" H 5025 3475 50  0001 C CNN
F 1 "+3.3V" H 5040 3790 39  0000 C CNN
F 2 "" H 5025 3625 50  0001 C CNN
F 3 "" H 5025 3625 50  0001 C CNN
	1    5025 3625
	1    0    0    -1  
$EndComp
Wire Wire Line
	5025 3625 5025 3700
Wire Wire Line
	1725 4600 1625 4600
$Comp
L power:GND #PWR?
U 1 1 5F473C1E
P 1625 4950
AR Path="/5F133236/5F473C1E" Ref="#PWR?"  Part="1" 
AR Path="/5F1207D0/5F473C1E" Ref="#PWR017"  Part="1" 
F 0 "#PWR017" H 1625 4700 50  0001 C CNN
F 1 "GND" H 1630 4777 39  0000 C CNN
F 2 "" H 1625 4950 50  0001 C CNN
F 3 "" H 1625 4950 50  0001 C CNN
	1    1625 4950
	1    0    0    -1  
$EndComp
Wire Wire Line
	1625 4600 1625 4700
Wire Wire Line
	2025 4800 2025 4950
$Comp
L Device:R_Small R?
U 1 1 5F473C26
P 1625 4800
AR Path="/5F133236/5F473C26" Ref="R?"  Part="1" 
AR Path="/5F1207D0/5F473C26" Ref="R4"  Part="1" 
F 0 "R4" H 1684 4846 39  0000 L CNN
F 1 "10k" H 1684 4755 39  0000 L CNN
F 2 "Resistor_SMD:R_0603_1608Metric" H 1625 4800 50  0001 C CNN
F 3 "~" H 1625 4800 50  0001 C CNN
	1    1625 4800
	1    0    0    -1  
$EndComp
Text HLabel 1525 4600 0    39   Input ~ 0
SERVER1
$Comp
L Device:Q_NMOS_GSD Q?
U 1 1 5F473C2D
P 1925 4600
AR Path="/5EF380A1/5F473C2D" Ref="Q?"  Part="1" 
AR Path="/5F1207D0/5F473C2D" Ref="Q2"  Part="1" 
AR Path="/5F133236/5F473C2D" Ref="Q?"  Part="1" 
F 0 "Q2" H 2129 4646 39  0000 L CNN
F 1 "Si2302CDS" H 2129 4555 39  0000 L CNN
F 2 "Package_TO_SOT_SMD:SOT-23" H 2125 4700 50  0001 C CNN
F 3 "https://eu.mouser.com/datasheet/2/427/si2302cds-1764899.pdf" H 1925 4600 50  0001 C CNN
	1    1925 4600
	1    0    0    -1  
$EndComp
Wire Wire Line
	1625 4900 1625 4950
$Comp
L power:GND #PWR?
U 1 1 5F473C34
P 2025 4950
AR Path="/5F133236/5F473C34" Ref="#PWR?"  Part="1" 
AR Path="/5F1207D0/5F473C34" Ref="#PWR021"  Part="1" 
F 0 "#PWR021" H 2025 4700 50  0001 C CNN
F 1 "GND" H 2030 4777 39  0000 C CNN
F 2 "" H 2025 4950 50  0001 C CNN
F 3 "" H 2025 4950 50  0001 C CNN
	1    2025 4950
	1    0    0    -1  
$EndComp
Connection ~ 1625 4600
Wire Wire Line
	1525 4600 1625 4600
Wire Wire Line
	2025 4300 2025 4400
$Comp
L Device:LED D3
U 1 1 5F473C3D
P 2025 4150
F 0 "D3" V 2064 4032 39  0000 R CNN
F 1 "IN-S126ATB " V 1973 4032 39  0000 R CNN
F 2 "LED_SMD:LED_1206_3216Metric_Castellated" H 2025 4150 50  0001 C CNN
F 3 "http://inolux-corp.com/datasheet/SMDLED/Mono%20Color%20Top%20View/IN-S126AT%20Series_V1.0.pdf" H 2025 4150 50  0001 C CNN
	1    2025 4150
	0    -1   -1   0   
$EndComp
$Comp
L Device:R_Small R?
U 1 1 5F473C43
P 2025 3800
AR Path="/5F133236/5F473C43" Ref="R?"  Part="1" 
AR Path="/5F1207D0/5F473C43" Ref="R6"  Part="1" 
F 0 "R6" H 2084 3846 39  0000 L CNN
F 1 "20" H 2084 3755 39  0000 L CNN
F 2 "Resistor_SMD:R_0603_1608Metric" H 2025 3800 50  0001 C CNN
F 3 "~" H 2025 3800 50  0001 C CNN
	1    2025 3800
	1    0    0    -1  
$EndComp
Wire Wire Line
	2025 3900 2025 4000
$Comp
L power:+3.3V #PWR?
U 1 1 5F473C4A
P 2025 3625
AR Path="/5F10B8E7/5F473C4A" Ref="#PWR?"  Part="1" 
AR Path="/5F473C4A" Ref="#PWR?"  Part="1" 
AR Path="/5F1207D0/5F473C4A" Ref="#PWR020"  Part="1" 
F 0 "#PWR020" H 2025 3475 50  0001 C CNN
F 1 "+3.3V" H 2040 3790 39  0000 C CNN
F 2 "" H 2025 3625 50  0001 C CNN
F 3 "" H 2025 3625 50  0001 C CNN
	1    2025 3625
	1    0    0    -1  
$EndComp
Wire Wire Line
	2025 3625 2025 3700
Wire Wire Line
	6225 4600 6125 4600
$Comp
L power:GND #PWR?
U 1 1 5F473C52
P 6125 4950
AR Path="/5F133236/5F473C52" Ref="#PWR?"  Part="1" 
AR Path="/5F1207D0/5F473C52" Ref="#PWR035"  Part="1" 
F 0 "#PWR035" H 6125 4700 50  0001 C CNN
F 1 "GND" H 6130 4777 39  0000 C CNN
F 2 "" H 6125 4950 50  0001 C CNN
F 3 "" H 6125 4950 50  0001 C CNN
	1    6125 4950
	1    0    0    -1  
$EndComp
Wire Wire Line
	6125 4600 6125 4700
Wire Wire Line
	6525 4800 6525 4950
$Comp
L Device:R_Small R?
U 1 1 5F473C5A
P 6125 4800
AR Path="/5F133236/5F473C5A" Ref="R?"  Part="1" 
AR Path="/5F1207D0/5F473C5A" Ref="R16"  Part="1" 
F 0 "R16" H 6184 4846 39  0000 L CNN
F 1 "10k" H 6184 4755 39  0000 L CNN
F 2 "Resistor_SMD:R_0603_1608Metric" H 6125 4800 50  0001 C CNN
F 3 "~" H 6125 4800 50  0001 C CNN
	1    6125 4800
	1    0    0    -1  
$EndComp
Text HLabel 6025 4600 0    39   Input ~ 0
SERVER4
$Comp
L Device:Q_NMOS_GSD Q?
U 1 1 5F473C61
P 6425 4600
AR Path="/5EF380A1/5F473C61" Ref="Q?"  Part="1" 
AR Path="/5F1207D0/5F473C61" Ref="Q8"  Part="1" 
AR Path="/5F133236/5F473C61" Ref="Q?"  Part="1" 
F 0 "Q8" H 6629 4646 39  0000 L CNN
F 1 "Si2302CDS" H 6629 4555 39  0000 L CNN
F 2 "Package_TO_SOT_SMD:SOT-23" H 6625 4700 50  0001 C CNN
F 3 "https://eu.mouser.com/datasheet/2/427/si2302cds-1764899.pdf" H 6425 4600 50  0001 C CNN
	1    6425 4600
	1    0    0    -1  
$EndComp
Wire Wire Line
	6125 4900 6125 4950
$Comp
L power:GND #PWR?
U 1 1 5F473C68
P 6525 4950
AR Path="/5F133236/5F473C68" Ref="#PWR?"  Part="1" 
AR Path="/5F1207D0/5F473C68" Ref="#PWR039"  Part="1" 
F 0 "#PWR039" H 6525 4700 50  0001 C CNN
F 1 "GND" H 6530 4777 39  0000 C CNN
F 2 "" H 6525 4950 50  0001 C CNN
F 3 "" H 6525 4950 50  0001 C CNN
	1    6525 4950
	1    0    0    -1  
$EndComp
Connection ~ 6125 4600
Wire Wire Line
	6025 4600 6125 4600
Wire Wire Line
	6525 4300 6525 4400
$Comp
L Device:LED D9
U 1 1 5F473C71
P 6525 4150
F 0 "D9" V 6564 4032 39  0000 R CNN
F 1 "IN-S126ATB " V 6473 4032 39  0000 R CNN
F 2 "LED_SMD:LED_1206_3216Metric_Castellated" H 6525 4150 50  0001 C CNN
F 3 "http://inolux-corp.com/datasheet/SMDLED/Mono%20Color%20Top%20View/IN-S126AT%20Series_V1.0.pdf" H 6525 4150 50  0001 C CNN
	1    6525 4150
	0    -1   -1   0   
$EndComp
$Comp
L Device:R_Small R?
U 1 1 5F473C77
P 6525 3800
AR Path="/5F133236/5F473C77" Ref="R?"  Part="1" 
AR Path="/5F1207D0/5F473C77" Ref="R18"  Part="1" 
F 0 "R18" H 6584 3846 39  0000 L CNN
F 1 "20" H 6584 3755 39  0000 L CNN
F 2 "Resistor_SMD:R_0603_1608Metric" H 6525 3800 50  0001 C CNN
F 3 "~" H 6525 3800 50  0001 C CNN
	1    6525 3800
	1    0    0    -1  
$EndComp
Wire Wire Line
	6525 3900 6525 4000
$Comp
L power:+3.3V #PWR?
U 1 1 5F473C7E
P 6525 3625
AR Path="/5F10B8E7/5F473C7E" Ref="#PWR?"  Part="1" 
AR Path="/5F473C7E" Ref="#PWR?"  Part="1" 
AR Path="/5F1207D0/5F473C7E" Ref="#PWR038"  Part="1" 
F 0 "#PWR038" H 6525 3475 50  0001 C CNN
F 1 "+3.3V" H 6540 3790 39  0000 C CNN
F 2 "" H 6525 3625 50  0001 C CNN
F 3 "" H 6525 3625 50  0001 C CNN
	1    6525 3625
	1    0    0    -1  
$EndComp
Wire Wire Line
	6525 3625 6525 3700
Wire Wire Line
	7725 4600 7625 4600
$Comp
L power:GND #PWR?
U 1 1 5F473C86
P 7625 4950
AR Path="/5F133236/5F473C86" Ref="#PWR?"  Part="1" 
AR Path="/5F1207D0/5F473C86" Ref="#PWR041"  Part="1" 
F 0 "#PWR041" H 7625 4700 50  0001 C CNN
F 1 "GND" H 7630 4777 39  0000 C CNN
F 2 "" H 7625 4950 50  0001 C CNN
F 3 "" H 7625 4950 50  0001 C CNN
	1    7625 4950
	1    0    0    -1  
$EndComp
Wire Wire Line
	7625 4600 7625 4700
Wire Wire Line
	8025 4800 8025 4950
$Comp
L Device:R_Small R?
U 1 1 5F473C8E
P 7625 4800
AR Path="/5F133236/5F473C8E" Ref="R?"  Part="1" 
AR Path="/5F1207D0/5F473C8E" Ref="R20"  Part="1" 
F 0 "R20" H 7684 4846 39  0000 L CNN
F 1 "10k" H 7684 4755 39  0000 L CNN
F 2 "Resistor_SMD:R_0603_1608Metric" H 7625 4800 50  0001 C CNN
F 3 "~" H 7625 4800 50  0001 C CNN
	1    7625 4800
	1    0    0    -1  
$EndComp
Text HLabel 7525 4600 0    39   Input ~ 0
SERVER5
$Comp
L Device:Q_NMOS_GSD Q?
U 1 1 5F473C95
P 7925 4600
AR Path="/5EF380A1/5F473C95" Ref="Q?"  Part="1" 
AR Path="/5F1207D0/5F473C95" Ref="Q10"  Part="1" 
AR Path="/5F133236/5F473C95" Ref="Q?"  Part="1" 
F 0 "Q10" H 8129 4646 39  0000 L CNN
F 1 "Si2302CDS" H 8129 4555 39  0000 L CNN
F 2 "Package_TO_SOT_SMD:SOT-23" H 8125 4700 50  0001 C CNN
F 3 "https://eu.mouser.com/datasheet/2/427/si2302cds-1764899.pdf" H 7925 4600 50  0001 C CNN
	1    7925 4600
	1    0    0    -1  
$EndComp
Wire Wire Line
	7625 4900 7625 4950
$Comp
L power:GND #PWR?
U 1 1 5F473C9C
P 8025 4950
AR Path="/5F133236/5F473C9C" Ref="#PWR?"  Part="1" 
AR Path="/5F1207D0/5F473C9C" Ref="#PWR045"  Part="1" 
F 0 "#PWR045" H 8025 4700 50  0001 C CNN
F 1 "GND" H 8030 4777 39  0000 C CNN
F 2 "" H 8025 4950 50  0001 C CNN
F 3 "" H 8025 4950 50  0001 C CNN
	1    8025 4950
	1    0    0    -1  
$EndComp
Connection ~ 7625 4600
Wire Wire Line
	7525 4600 7625 4600
Wire Wire Line
	8025 4300 8025 4400
$Comp
L Device:LED D11
U 1 1 5F473CA5
P 8025 4150
F 0 "D11" V 8064 4032 39  0000 R CNN
F 1 "IN-S126ATB " V 7973 4032 39  0000 R CNN
F 2 "LED_SMD:LED_1206_3216Metric_Castellated" H 8025 4150 50  0001 C CNN
F 3 "http://inolux-corp.com/datasheet/SMDLED/Mono%20Color%20Top%20View/IN-S126AT%20Series_V1.0.pdf" H 8025 4150 50  0001 C CNN
	1    8025 4150
	0    -1   -1   0   
$EndComp
$Comp
L Device:R_Small R?
U 1 1 5F473CAB
P 8025 3800
AR Path="/5F133236/5F473CAB" Ref="R?"  Part="1" 
AR Path="/5F1207D0/5F473CAB" Ref="R22"  Part="1" 
F 0 "R22" H 8084 3846 39  0000 L CNN
F 1 "20" H 8084 3755 39  0000 L CNN
F 2 "Resistor_SMD:R_0603_1608Metric" H 8025 3800 50  0001 C CNN
F 3 "~" H 8025 3800 50  0001 C CNN
	1    8025 3800
	1    0    0    -1  
$EndComp
Wire Wire Line
	8025 3900 8025 4000
$Comp
L power:+3.3V #PWR?
U 1 1 5F473CB2
P 8025 3625
AR Path="/5F10B8E7/5F473CB2" Ref="#PWR?"  Part="1" 
AR Path="/5F473CB2" Ref="#PWR?"  Part="1" 
AR Path="/5F1207D0/5F473CB2" Ref="#PWR044"  Part="1" 
F 0 "#PWR044" H 8025 3475 50  0001 C CNN
F 1 "+3.3V" H 8040 3790 39  0000 C CNN
F 2 "" H 8025 3625 50  0001 C CNN
F 3 "" H 8025 3625 50  0001 C CNN
	1    8025 3625
	1    0    0    -1  
$EndComp
Wire Wire Line
	8025 3625 8025 3700
Wire Wire Line
	9225 4600 9125 4600
$Comp
L power:GND #PWR?
U 1 1 5F473CBA
P 9125 4950
AR Path="/5F133236/5F473CBA" Ref="#PWR?"  Part="1" 
AR Path="/5F1207D0/5F473CBA" Ref="#PWR047"  Part="1" 
F 0 "#PWR047" H 9125 4700 50  0001 C CNN
F 1 "GND" H 9130 4777 39  0000 C CNN
F 2 "" H 9125 4950 50  0001 C CNN
F 3 "" H 9125 4950 50  0001 C CNN
	1    9125 4950
	1    0    0    -1  
$EndComp
Wire Wire Line
	9125 4600 9125 4700
Wire Wire Line
	9525 4800 9525 4950
$Comp
L Device:R_Small R?
U 1 1 5F473CC2
P 9125 4800
AR Path="/5F133236/5F473CC2" Ref="R?"  Part="1" 
AR Path="/5F1207D0/5F473CC2" Ref="R24"  Part="1" 
F 0 "R24" H 9184 4846 39  0000 L CNN
F 1 "10k" H 9184 4755 39  0000 L CNN
F 2 "Resistor_SMD:R_0603_1608Metric" H 9125 4800 50  0001 C CNN
F 3 "~" H 9125 4800 50  0001 C CNN
	1    9125 4800
	1    0    0    -1  
$EndComp
Text HLabel 9025 4600 0    39   Input ~ 0
SERVER6
$Comp
L Device:Q_NMOS_GSD Q?
U 1 1 5F473CC9
P 9425 4600
AR Path="/5EF380A1/5F473CC9" Ref="Q?"  Part="1" 
AR Path="/5F1207D0/5F473CC9" Ref="Q12"  Part="1" 
AR Path="/5F133236/5F473CC9" Ref="Q?"  Part="1" 
F 0 "Q12" H 9629 4646 39  0000 L CNN
F 1 "Si2302CDS" H 9629 4555 39  0000 L CNN
F 2 "Package_TO_SOT_SMD:SOT-23" H 9625 4700 50  0001 C CNN
F 3 "https://eu.mouser.com/datasheet/2/427/si2302cds-1764899.pdf" H 9425 4600 50  0001 C CNN
	1    9425 4600
	1    0    0    -1  
$EndComp
Wire Wire Line
	9125 4900 9125 4950
$Comp
L power:GND #PWR?
U 1 1 5F473CD0
P 9525 4950
AR Path="/5F133236/5F473CD0" Ref="#PWR?"  Part="1" 
AR Path="/5F1207D0/5F473CD0" Ref="#PWR051"  Part="1" 
F 0 "#PWR051" H 9525 4700 50  0001 C CNN
F 1 "GND" H 9530 4777 39  0000 C CNN
F 2 "" H 9525 4950 50  0001 C CNN
F 3 "" H 9525 4950 50  0001 C CNN
	1    9525 4950
	1    0    0    -1  
$EndComp
Connection ~ 9125 4600
Wire Wire Line
	9025 4600 9125 4600
Wire Wire Line
	9525 4300 9525 4400
$Comp
L Device:LED D13
U 1 1 5F473CD9
P 9525 4150
F 0 "D13" V 9564 4032 39  0000 R CNN
F 1 "IN-S126ATB " V 9473 4032 39  0000 R CNN
F 2 "LED_SMD:LED_1206_3216Metric_Castellated" H 9525 4150 50  0001 C CNN
F 3 "http://inolux-corp.com/datasheet/SMDLED/Mono%20Color%20Top%20View/IN-S126AT%20Series_V1.0.pdf" H 9525 4150 50  0001 C CNN
	1    9525 4150
	0    -1   -1   0   
$EndComp
$Comp
L Device:R_Small R?
U 1 1 5F473CDF
P 9525 3800
AR Path="/5F133236/5F473CDF" Ref="R?"  Part="1" 
AR Path="/5F1207D0/5F473CDF" Ref="R26"  Part="1" 
F 0 "R26" H 9584 3846 39  0000 L CNN
F 1 "20" H 9584 3755 39  0000 L CNN
F 2 "Resistor_SMD:R_0603_1608Metric" H 9525 3800 50  0001 C CNN
F 3 "~" H 9525 3800 50  0001 C CNN
	1    9525 3800
	1    0    0    -1  
$EndComp
Wire Wire Line
	9525 3900 9525 4000
$Comp
L power:+3.3V #PWR?
U 1 1 5F473CE6
P 9525 3625
AR Path="/5F10B8E7/5F473CE6" Ref="#PWR?"  Part="1" 
AR Path="/5F473CE6" Ref="#PWR?"  Part="1" 
AR Path="/5F1207D0/5F473CE6" Ref="#PWR050"  Part="1" 
F 0 "#PWR050" H 9525 3475 50  0001 C CNN
F 1 "+3.3V" H 9540 3790 39  0000 C CNN
F 2 "" H 9525 3625 50  0001 C CNN
F 3 "" H 9525 3625 50  0001 C CNN
	1    9525 3625
	1    0    0    -1  
$EndComp
Wire Wire Line
	9525 3625 9525 3700
Text Notes 1175 1325 0    39   ~ 0
If = 10 mA @ Vf = 3.1 V
$EndSCHEMATC
