EESchema Schematic File Version 4
EELAYER 30 0
EELAYER END
$Descr A4 11693 8268
encoding utf-8
Sheet 7 9
Title "Thermal Load"
Date "2020-09-01"
Rev "1.0"
Comp "Institute for Automation of Complex Power Systems - E.ON ERC - RWTH Aachen University"
Comment1 "Designer: D. Wienands, S. Melcher, L. Jeske, D. Moll"
Comment2 "Supervisor: C. Guarnieri Calò Carducci"
Comment3 ""
Comment4 ""
$EndDescr
Wire Wire Line
	3450 5425 3450 5500
Wire Wire Line
	3450 6000 3450 6150
$Comp
L Motor:Fan M1
U 1 1 5F273144
P 3450 5225
AR Path="/5F25F1E7/5F273144" Ref="M1"  Part="1" 
AR Path="/5F56A024/5F273144" Ref="M?"  Part="1" 
F 0 "M1" H 3200 5325 39  0000 L CNN
F 1 "Fan_IN" H 3100 5225 39  0000 L CNN
F 2 "" H 3450 5235 50  0001 C CNN
F 3 "https://www.sunon.com/eu/PROSEARCH_FILES/(D03037420G-00)-1.pdf" H 3450 5235 50  0001 C CNN
F 4 "MF30060V2-1000U-A99" H 3450 5225 50  0001 C CNN "Mfr"
	1    3450 5225
	1    0    0    -1  
$EndComp
$Comp
L power:GND #PWR?
U 1 1 5F27D288
P 3450 6150
AR Path="/5F27D288" Ref="#PWR?"  Part="1" 
AR Path="/5EFE1C3B/5F27D288" Ref="#PWR?"  Part="1" 
AR Path="/5F25F1E7/5F27D288" Ref="#PWR072"  Part="1" 
AR Path="/5F56A024/5F27D288" Ref="#PWR?"  Part="1" 
F 0 "#PWR072" H 3450 5900 50  0001 C CNN
F 1 "GND" H 3455 5977 39  0000 C CNN
F 2 "" H 3450 6150 50  0001 C CNN
F 3 "" H 3450 6150 50  0001 C CNN
	1    3450 6150
	1    0    0    -1  
$EndComp
Wire Wire Line
	6625 1475 6625 1625
$Comp
L power:GND #PWR?
U 1 1 5F590E6C
P 6625 3125
AR Path="/5F590E6C" Ref="#PWR?"  Part="1" 
AR Path="/5EFE1C3B/5F590E6C" Ref="#PWR?"  Part="1" 
AR Path="/5F25F1E7/5F590E6C" Ref="#PWR083"  Part="1" 
AR Path="/5F56A024/5F590E6C" Ref="#PWR?"  Part="1" 
F 0 "#PWR083" H 6625 2875 50  0001 C CNN
F 1 "GND" H 6630 2952 39  0000 C CNN
F 2 "" H 6625 3125 50  0001 C CNN
F 3 "" H 6625 3125 50  0001 C CNN
	1    6625 3125
	1    0    0    -1  
$EndComp
$Comp
L power:+3.3V #PWR?
U 1 1 5F593024
P 6625 1475
AR Path="/5F593024" Ref="#PWR?"  Part="1" 
AR Path="/5F25F1E7/5F593024" Ref="#PWR082"  Part="1" 
AR Path="/5F56A024/5F593024" Ref="#PWR?"  Part="1" 
F 0 "#PWR082" H 6625 1325 50  0001 C CNN
F 1 "+3.3V" H 6640 1648 39  0000 C CNN
F 2 "" H 6625 1475 50  0001 C CNN
F 3 "" H 6625 1475 50  0001 C CNN
	1    6625 1475
	1    0    0    -1  
$EndComp
$Comp
L power:GND #PWR?
U 1 1 5F599B3B
P 7175 3125
AR Path="/5F599B3B" Ref="#PWR?"  Part="1" 
AR Path="/5EFE1C3B/5F599B3B" Ref="#PWR?"  Part="1" 
AR Path="/5F25F1E7/5F599B3B" Ref="#PWR086"  Part="1" 
AR Path="/5F56A024/5F599B3B" Ref="#PWR?"  Part="1" 
F 0 "#PWR086" H 7175 2875 50  0001 C CNN
F 1 "GND" H 7180 2952 39  0000 C CNN
F 2 "" H 7175 3125 50  0001 C CNN
F 3 "" H 7175 3125 50  0001 C CNN
	1    7175 3125
	-1   0    0    -1  
$EndComp
$Comp
L Device:R_Small R?
U 1 1 5F599B41
P 7175 2975
AR Path="/5F599B41" Ref="R?"  Part="1" 
AR Path="/5EFE1C3B/5F599B41" Ref="R?"  Part="1" 
AR Path="/5F25F1E7/5F599B41" Ref="R45"  Part="1" 
AR Path="/5F56A024/5F599B41" Ref="R?"  Part="1" 
F 0 "R45" H 7234 3021 39  0000 L CNN
F 1 "10k" H 7234 2930 39  0000 L CNN
F 2 "Resistor_SMD:R_0603_1608Metric" H 7175 2975 50  0001 C CNN
F 3 "~" H 7175 2975 50  0001 C CNN
	1    7175 2975
	-1   0    0    -1  
$EndComp
Wire Wire Line
	7175 3075 7175 3125
Wire Wire Line
	6925 2775 7175 2775
Wire Wire Line
	7175 2775 7175 2875
Wire Wire Line
	6625 2975 6625 3125
$Comp
L Device:R_Small R?
U 1 1 5F59BED3
P 7175 1625
AR Path="/5F59BED3" Ref="R?"  Part="1" 
AR Path="/5EFE1C3B/5F59BED3" Ref="R?"  Part="1" 
AR Path="/5F25F1E7/5F59BED3" Ref="R44"  Part="1" 
AR Path="/5F56A024/5F59BED3" Ref="R?"  Part="1" 
F 0 "R44" H 7234 1671 39  0000 L CNN
F 1 "4.7k" H 7234 1580 39  0000 L CNN
F 2 "Resistor_SMD:R_0603_1608Metric" H 7175 1625 50  0001 C CNN
F 3 "~" H 7175 1625 50  0001 C CNN
	1    7175 1625
	-1   0    0    1   
$EndComp
Wire Wire Line
	7175 1525 7175 1475
Wire Wire Line
	6925 1825 7175 1825
Wire Wire Line
	7175 1825 7175 1725
$Comp
L power:+3.3V #PWR?
U 1 1 5F59CFCE
P 7175 1475
AR Path="/5F59CFCE" Ref="#PWR?"  Part="1" 
AR Path="/5F25F1E7/5F59CFCE" Ref="#PWR084"  Part="1" 
AR Path="/5F56A024/5F59CFCE" Ref="#PWR?"  Part="1" 
F 0 "#PWR084" H 7175 1325 50  0001 C CNN
F 1 "+3.3V" H 7190 1648 39  0000 C CNN
F 2 "" H 7175 1475 50  0001 C CNN
F 3 "" H 7175 1475 50  0001 C CNN
	1    7175 1475
	1    0    0    -1  
$EndComp
Text HLabel 7475 2775 2    39   Input ~ 0
HEAT
Wire Wire Line
	7475 2775 7175 2775
Connection ~ 7175 2775
Text HLabel 7475 2125 2    39   Input ~ 0
COOL
Connection ~ 7175 1825
$Comp
L Device:Q_NMOS_GSD Q11
U 1 1 5FA5FE7B
P 4575 2125
AR Path="/5F25F1E7/5FA5FE7B" Ref="Q11"  Part="1" 
AR Path="/5F56A024/5FA5FE7B" Ref="Q?"  Part="1" 
F 0 "Q11" H 4780 2163 39  0000 L CNN
F 1 "Si2302CDS" H 4780 2088 39  0000 L CNN
F 2 "Package_TO_SOT_SMD:SOT-23" H 4775 2225 50  0001 C CNN
F 3 "https://eu.mouser.com/datasheet/2/427/si2302cds-1764899.pdf" H 4575 2125 50  0001 C CNN
	1    4575 2125
	1    0    0    -1  
$EndComp
$Comp
L power:GND #PWR?
U 1 1 5FA61E27
P 4675 2450
AR Path="/5FA61E27" Ref="#PWR?"  Part="1" 
AR Path="/5EFE1C3B/5FA61E27" Ref="#PWR?"  Part="1" 
AR Path="/5F25F1E7/5FA61E27" Ref="#PWR076"  Part="1" 
AR Path="/5F56A024/5FA61E27" Ref="#PWR?"  Part="1" 
F 0 "#PWR076" H 4675 2200 50  0001 C CNN
F 1 "GND" H 4680 2277 39  0000 C CNN
F 2 "" H 4675 2450 50  0001 C CNN
F 3 "" H 4675 2450 50  0001 C CNN
	1    4675 2450
	1    0    0    -1  
$EndComp
Wire Wire Line
	4675 2325 4675 2450
Connection ~ 4675 2775
Wire Wire Line
	4675 2775 4375 2775
Text HLabel 4375 2775 0    39   Input ~ 0
COOL
Connection ~ 4675 1825
$Comp
L power:+3.3V #PWR?
U 1 1 5F5A0B03
P 4675 1475
AR Path="/5F5A0B03" Ref="#PWR?"  Part="1" 
AR Path="/5F25F1E7/5F5A0B03" Ref="#PWR075"  Part="1" 
AR Path="/5F56A024/5F5A0B03" Ref="#PWR?"  Part="1" 
F 0 "#PWR075" H 4675 1325 50  0001 C CNN
F 1 "+3.3V" H 4690 1648 39  0000 C CNN
F 2 "" H 4675 1475 50  0001 C CNN
F 3 "" H 4675 1475 50  0001 C CNN
	1    4675 1475
	-1   0    0    -1  
$EndComp
Wire Wire Line
	4675 1825 4675 1725
Wire Wire Line
	4925 1825 4675 1825
Wire Wire Line
	4675 1525 4675 1475
$Comp
L Device:R_Small R?
U 1 1 5F5A0AFA
P 4675 1625
AR Path="/5F5A0AFA" Ref="R?"  Part="1" 
AR Path="/5EFE1C3B/5F5A0AFA" Ref="R?"  Part="1" 
AR Path="/5F25F1E7/5F5A0AFA" Ref="R41"  Part="1" 
AR Path="/5F56A024/5F5A0AFA" Ref="R?"  Part="1" 
F 0 "R41" H 4734 1671 39  0000 L CNN
F 1 "4.7k" H 4734 1580 39  0000 L CNN
F 2 "Resistor_SMD:R_0603_1608Metric" H 4675 1625 50  0001 C CNN
F 3 "~" H 4675 1625 50  0001 C CNN
	1    4675 1625
	1    0    0    1   
$EndComp
Wire Wire Line
	5225 2975 5225 3125
Wire Wire Line
	4675 2775 4675 2875
Wire Wire Line
	4925 2775 4675 2775
$Comp
L power:+3.3V #PWR?
U 1 1 5F592D71
P 5225 1475
AR Path="/5F592D71" Ref="#PWR?"  Part="1" 
AR Path="/5F25F1E7/5F592D71" Ref="#PWR078"  Part="1" 
AR Path="/5F56A024/5F592D71" Ref="#PWR?"  Part="1" 
F 0 "#PWR078" H 5225 1325 50  0001 C CNN
F 1 "+3.3V" H 5240 1648 39  0000 C CNN
F 2 "" H 5225 1475 50  0001 C CNN
F 3 "" H 5225 1475 50  0001 C CNN
	1    5225 1475
	1    0    0    -1  
$EndComp
$Comp
L power:GND #PWR?
U 1 1 5F590B21
P 5225 3125
AR Path="/5F590B21" Ref="#PWR?"  Part="1" 
AR Path="/5EFE1C3B/5F590B21" Ref="#PWR?"  Part="1" 
AR Path="/5F25F1E7/5F590B21" Ref="#PWR079"  Part="1" 
AR Path="/5F56A024/5F590B21" Ref="#PWR?"  Part="1" 
F 0 "#PWR079" H 5225 2875 50  0001 C CNN
F 1 "GND" H 5230 2952 39  0000 C CNN
F 2 "" H 5225 3125 50  0001 C CNN
F 3 "" H 5225 3125 50  0001 C CNN
	1    5225 3125
	1    0    0    -1  
$EndComp
Wire Wire Line
	6125 2300 6625 2300
Wire Wire Line
	5725 2300 5225 2300
Wire Wire Line
	5225 1475 5225 1625
$Comp
L Device:Peltier_Element PE1
U 1 1 5F294DF1
P 5925 2300
AR Path="/5F25F1E7/5F294DF1" Ref="PE1"  Part="1" 
AR Path="/5F56A024/5F294DF1" Ref="PE?"  Part="1" 
F 0 "PE1" H 5925 2518 39  0000 C CNN
F 1 "CP20351" H 5925 2443 39  0000 C CNN
F 2 "" H 5925 2230 50  0001 C CNN
F 3 "https://www.mouser.de/datasheet/2/670/cp20-1776869.pdf" V 5925 2325 50  0001 C CNN
	1    5925 2300
	1    0    0    -1  
$EndComp
Wire Wire Line
	4675 3075 4675 3125
$Comp
L Device:Q_PMOS_GSD Q12
U 1 1 5F265D0E
P 5125 1825
AR Path="/5F25F1E7/5F265D0E" Ref="Q12"  Part="1" 
AR Path="/5F56A024/5F265D0E" Ref="Q?"  Part="1" 
F 0 "Q12" H 5330 1787 39  0000 L CNN
F 1 "Si2301BDS" H 5330 1862 39  0000 L CNN
F 2 "Package_TO_SOT_SMD:SOT-23" H 5325 1925 50  0001 C CNN
F 3 "https://eu.mouser.com/datasheet/2/427/si2301bds-1765637.pdf" H 5125 1825 50  0001 C CNN
	1    5125 1825
	1    0    0    1   
$EndComp
$Comp
L Device:R_Small R?
U 1 1 5F54276C
P 4675 2975
AR Path="/5F54276C" Ref="R?"  Part="1" 
AR Path="/5EFE1C3B/5F54276C" Ref="R?"  Part="1" 
AR Path="/5F25F1E7/5F54276C" Ref="R42"  Part="1" 
AR Path="/5F56A024/5F54276C" Ref="R?"  Part="1" 
F 0 "R42" H 4734 3021 39  0000 L CNN
F 1 "10k" H 4734 2930 39  0000 L CNN
F 2 "Resistor_SMD:R_0603_1608Metric" H 4675 2975 50  0001 C CNN
F 3 "~" H 4675 2975 50  0001 C CNN
	1    4675 2975
	1    0    0    -1  
$EndComp
$Comp
L power:GND #PWR?
U 1 1 5F54276A
P 4675 3125
AR Path="/5F54276A" Ref="#PWR?"  Part="1" 
AR Path="/5EFE1C3B/5F54276A" Ref="#PWR?"  Part="1" 
AR Path="/5F25F1E7/5F54276A" Ref="#PWR077"  Part="1" 
AR Path="/5F56A024/5F54276A" Ref="#PWR?"  Part="1" 
F 0 "#PWR077" H 4675 2875 50  0001 C CNN
F 1 "GND" H 4680 2952 39  0000 C CNN
F 2 "" H 4675 3125 50  0001 C CNN
F 3 "" H 4675 3125 50  0001 C CNN
	1    4675 3125
	1    0    0    -1  
$EndComp
Text HLabel 4375 2125 0    39   Input ~ 0
HEAT
Wire Wire Line
	4675 1925 4675 1825
$Comp
L power:GND #PWR?
U 1 1 5FAA4890
P 7175 2450
AR Path="/5FAA4890" Ref="#PWR?"  Part="1" 
AR Path="/5EFE1C3B/5FAA4890" Ref="#PWR?"  Part="1" 
AR Path="/5F25F1E7/5FAA4890" Ref="#PWR085"  Part="1" 
AR Path="/5F56A024/5FAA4890" Ref="#PWR?"  Part="1" 
F 0 "#PWR085" H 7175 2200 50  0001 C CNN
F 1 "GND" H 7180 2277 39  0000 C CNN
F 2 "" H 7175 2450 50  0001 C CNN
F 3 "" H 7175 2450 50  0001 C CNN
	1    7175 2450
	-1   0    0    -1  
$EndComp
Wire Wire Line
	7175 2325 7175 2450
Wire Wire Line
	7175 1925 7175 1825
Connection ~ 5225 2300
Wire Wire Line
	5225 2300 5225 2575
Connection ~ 6625 2300
Wire Wire Line
	6625 2300 6625 2575
Wire Wire Line
	6625 2025 6625 2300
Wire Wire Line
	5225 2025 5225 2300
$Comp
L LEGOS:SN74AUP1G32DBV U11
U 1 1 5FACB6CB
P 2500 5800
AR Path="/5F25F1E7/5FACB6CB" Ref="U11"  Part="1" 
AR Path="/5F56A024/5FACB6CB" Ref="U?"  Part="1" 
F 0 "U11" H 2625 5650 39  0000 L CNN
F 1 "SN74AUP1G32DBV" H 2625 5575 39  0000 L CNN
F 2 "Package_TO_SOT_SMD:SOT-23-5" H 2500 5800 50  0001 C CNN
F 3 "http://www.ti.com/lit/ds/symlink/sn74aup1g32.pdf" H 2500 5800 50  0001 C CNN
	1    2500 5800
	1    0    0    -1  
$EndComp
Text HLabel 2200 5900 0    39   Input ~ 0
COOL
Text HLabel 2200 5700 0    39   Input ~ 0
HEAT
$Comp
L power:+3.3V #PWR?
U 1 1 5FAD6D7C
P 2500 5600
AR Path="/5FAD6D7C" Ref="#PWR?"  Part="1" 
AR Path="/5F25F1E7/5FAD6D7C" Ref="#PWR069"  Part="1" 
AR Path="/5F56A024/5FAD6D7C" Ref="#PWR?"  Part="1" 
F 0 "#PWR069" H 2500 5450 50  0001 C CNN
F 1 "+3.3V" H 2515 5773 39  0000 C CNN
F 2 "" H 2500 5600 50  0001 C CNN
F 3 "" H 2500 5600 50  0001 C CNN
	1    2500 5600
	-1   0    0    -1  
$EndComp
$Comp
L power:GND #PWR?
U 1 1 5FAD85CB
P 2500 6000
AR Path="/5FAD85CB" Ref="#PWR?"  Part="1" 
AR Path="/5EFE1C3B/5FAD85CB" Ref="#PWR?"  Part="1" 
AR Path="/5F25F1E7/5FAD85CB" Ref="#PWR070"  Part="1" 
AR Path="/5F56A024/5FAD85CB" Ref="#PWR?"  Part="1" 
F 0 "#PWR070" H 2500 5750 50  0001 C CNN
F 1 "GND" H 2505 5827 39  0000 C CNN
F 2 "" H 2500 6000 50  0001 C CNN
F 3 "" H 2500 6000 50  0001 C CNN
	1    2500 6000
	1    0    0    -1  
$EndComp
Wire Wire Line
	3150 5800 2800 5800
$Comp
L Diode:BAT60A D2
U 1 1 5FAE8E3C
P 3775 5175
AR Path="/5F25F1E7/5FAE8E3C" Ref="D2"  Part="1" 
AR Path="/5F56A024/5FAE8E3C" Ref="D?"  Part="1" 
F 0 "D2" V 3737 5255 39  0000 L CNN
F 1 "BAT60A" V 3812 5255 39  0000 L CNN
F 2 "Diode_SMD:D_SOD-323" H 3775 5000 50  0001 C CNN
F 3 "https://www.infineon.com/dgdl/Infineon-BAT60ASERIES-DS-v01_01-en.pdf?fileId=db3a304313d846880113def70c9304a9" H 3775 5175 50  0001 C CNN
	1    3775 5175
	0    1    1    0   
$EndComp
Wire Wire Line
	3775 4875 3775 5025
Wire Wire Line
	3450 5500 3775 5500
Wire Wire Line
	3775 5500 3775 5325
Connection ~ 3450 5500
Wire Wire Line
	3450 5500 3450 5600
Wire Wire Line
	3450 4825 3450 4875
Wire Wire Line
	3450 4875 3775 4875
Connection ~ 3450 4875
Wire Wire Line
	3450 4875 3450 4925
Wire Wire Line
	4600 5425 4600 5500
Wire Wire Line
	4600 6000 4600 6150
$Comp
L power:GND #PWR?
U 1 1 5FAF77F9
P 4600 6150
AR Path="/5FAF77F9" Ref="#PWR?"  Part="1" 
AR Path="/5EFE1C3B/5FAF77F9" Ref="#PWR?"  Part="1" 
AR Path="/5F25F1E7/5FAF77F9" Ref="#PWR074"  Part="1" 
AR Path="/5F56A024/5FAF77F9" Ref="#PWR?"  Part="1" 
F 0 "#PWR074" H 4600 5900 50  0001 C CNN
F 1 "GND" H 4605 5977 39  0000 C CNN
F 2 "" H 4600 6150 50  0001 C CNN
F 3 "" H 4600 6150 50  0001 C CNN
	1    4600 6150
	1    0    0    -1  
$EndComp
$Comp
L Diode:BAT60A D3
U 1 1 5FAF780B
P 4925 5175
AR Path="/5F25F1E7/5FAF780B" Ref="D3"  Part="1" 
AR Path="/5F56A024/5FAF780B" Ref="D?"  Part="1" 
F 0 "D3" V 4887 5255 39  0000 L CNN
F 1 "BAT60A" V 4962 5255 39  0000 L CNN
F 2 "Diode_SMD:D_SOD-323" H 4925 5000 50  0001 C CNN
F 3 "https://www.infineon.com/dgdl/Infineon-BAT60ASERIES-DS-v01_01-en.pdf?fileId=db3a304313d846880113def70c9304a9" H 4925 5175 50  0001 C CNN
	1    4925 5175
	0    1    1    0   
$EndComp
Wire Wire Line
	4925 4875 4925 5025
Wire Wire Line
	4600 5500 4925 5500
Wire Wire Line
	4925 5500 4925 5325
Connection ~ 4600 5500
Wire Wire Line
	4600 5500 4600 5600
Wire Wire Line
	4600 4825 4600 4875
Wire Wire Line
	4600 4875 4925 4875
Connection ~ 4600 4875
Wire Wire Line
	4600 4875 4600 4925
Text Label 3050 5800 2    39   ~ 0
FAN
Wire Wire Line
	4200 5800 4300 5800
Text Label 4200 5800 2    39   ~ 0
FAN
$Comp
L Motor:Fan M2
U 1 1 5FB00662
P 4600 5225
AR Path="/5F25F1E7/5FB00662" Ref="M2"  Part="1" 
AR Path="/5F56A024/5FB00662" Ref="M?"  Part="1" 
F 0 "M2" H 4350 5325 39  0000 L CNN
F 1 "Fan_IN" H 4250 5225 39  0000 L CNN
F 2 "" H 4600 5235 50  0001 C CNN
F 3 "https://www.sunon.com/eu/PROSEARCH_FILES/(D03037420G-00)-1.pdf" H 4600 5235 50  0001 C CNN
F 4 "MF30060V2-1000U-A99" H 4600 5225 50  0001 C CNN "Mfr"
	1    4600 5225
	1    0    0    -1  
$EndComp
$Comp
L power:+3.3V #PWR?
U 1 1 5FB013A0
P 3450 4825
AR Path="/5FB013A0" Ref="#PWR?"  Part="1" 
AR Path="/5F25F1E7/5FB013A0" Ref="#PWR071"  Part="1" 
AR Path="/5F56A024/5FB013A0" Ref="#PWR?"  Part="1" 
F 0 "#PWR071" H 3450 4675 50  0001 C CNN
F 1 "+3.3V" H 3465 4998 39  0000 C CNN
F 2 "" H 3450 4825 50  0001 C CNN
F 3 "" H 3450 4825 50  0001 C CNN
	1    3450 4825
	-1   0    0    -1  
$EndComp
$Comp
L power:+3.3V #PWR?
U 1 1 5FB02029
P 4600 4825
AR Path="/5FB02029" Ref="#PWR?"  Part="1" 
AR Path="/5F25F1E7/5FB02029" Ref="#PWR073"  Part="1" 
AR Path="/5F56A024/5FB02029" Ref="#PWR?"  Part="1" 
F 0 "#PWR073" H 4600 4675 50  0001 C CNN
F 1 "+3.3V" H 4615 4998 39  0000 C CNN
F 2 "" H 4600 4825 50  0001 C CNN
F 3 "" H 4600 4825 50  0001 C CNN
	1    4600 4825
	-1   0    0    -1  
$EndComp
Text Notes 5725 2475 0    39   ~ 0
R = 6.7 Ohm\nI = 500 mA \n
$Comp
L Sensor_Temperature:TMP100 U?
U 1 1 5F4F5E89
P 2450 1700
AR Path="/5F4F5E89" Ref="U?"  Part="1" 
AR Path="/5F25F1E7/5F4F5E89" Ref="U9"  Part="1" 
AR Path="/5F56A024/5F4F5E89" Ref="U?"  Part="1" 
F 0 "U9" H 2780 1738 39  0000 L CNN
F 1 "TMP100" H 2780 1663 39  0000 L CNN
F 2 "Package_TO_SOT_SMD:SOT-23-6" H 2450 1350 50  0001 C CNN
F 3 "http://www.ti.com/lit/gpn/tmp100" H 2400 1700 50  0001 C CNN
	1    2450 1700
	1    0    0    -1  
$EndComp
$Comp
L power:+3.3V #PWR?
U 1 1 5F4F74EF
P 2450 1300
AR Path="/5F4F74EF" Ref="#PWR?"  Part="1" 
AR Path="/5F25F1E7/5F4F74EF" Ref="#PWR065"  Part="1" 
AR Path="/5F56A024/5F4F74EF" Ref="#PWR?"  Part="1" 
F 0 "#PWR065" H 2450 1150 50  0001 C CNN
F 1 "+3.3V" H 2465 1473 39  0000 C CNN
F 2 "" H 2450 1300 50  0001 C CNN
F 3 "" H 2450 1300 50  0001 C CNN
	1    2450 1300
	-1   0    0    -1  
$EndComp
$Comp
L power:GND #PWR?
U 1 1 5F4F7E75
P 2450 2100
AR Path="/5F4F7E75" Ref="#PWR?"  Part="1" 
AR Path="/5EFE1C3B/5F4F7E75" Ref="#PWR?"  Part="1" 
AR Path="/5F25F1E7/5F4F7E75" Ref="#PWR066"  Part="1" 
AR Path="/5F56A024/5F4F7E75" Ref="#PWR?"  Part="1" 
F 0 "#PWR066" H 2450 1850 50  0001 C CNN
F 1 "GND" H 2455 1927 39  0000 C CNN
F 2 "" H 2450 2100 50  0001 C CNN
F 3 "" H 2450 2100 50  0001 C CNN
	1    2450 2100
	1    0    0    -1  
$EndComp
Text GLabel 2050 1600 0    39   Input ~ 0
SCL
Text GLabel 2050 1500 0    39   Input ~ 0
SDA
$Comp
L power:GND #PWR?
U 1 1 5F4FAD28
P 2050 1800
AR Path="/5F4FAD28" Ref="#PWR?"  Part="1" 
AR Path="/5EFE1C3B/5F4FAD28" Ref="#PWR?"  Part="1" 
AR Path="/5F25F1E7/5F4FAD28" Ref="#PWR062"  Part="1" 
AR Path="/5F56A024/5F4FAD28" Ref="#PWR?"  Part="1" 
F 0 "#PWR062" H 2050 1550 50  0001 C CNN
F 1 "GND" V 2050 1600 39  0000 C CNN
F 2 "" H 2050 1800 50  0001 C CNN
F 3 "" H 2050 1800 50  0001 C CNN
	1    2050 1800
	0    1    1    0   
$EndComp
Wire Wire Line
	2050 1800 2050 1900
Connection ~ 2050 1800
$Comp
L Sensor_Temperature:TMP100 U?
U 1 1 5F50188C
P 2450 3100
AR Path="/5F50188C" Ref="U?"  Part="1" 
AR Path="/5F25F1E7/5F50188C" Ref="U10"  Part="1" 
AR Path="/5F56A024/5F50188C" Ref="U?"  Part="1" 
F 0 "U10" H 2780 3138 39  0000 L CNN
F 1 "TMP100" H 2780 3063 39  0000 L CNN
F 2 "Package_TO_SOT_SMD:SOT-23-6" H 2450 2750 50  0001 C CNN
F 3 "http://www.ti.com/lit/gpn/tmp100" H 2400 3100 50  0001 C CNN
	1    2450 3100
	1    0    0    -1  
$EndComp
$Comp
L power:+3.3V #PWR?
U 1 1 5F501892
P 2450 2700
AR Path="/5F501892" Ref="#PWR?"  Part="1" 
AR Path="/5F25F1E7/5F501892" Ref="#PWR067"  Part="1" 
AR Path="/5F56A024/5F501892" Ref="#PWR?"  Part="1" 
F 0 "#PWR067" H 2450 2550 50  0001 C CNN
F 1 "+3.3V" H 2465 2873 39  0000 C CNN
F 2 "" H 2450 2700 50  0001 C CNN
F 3 "" H 2450 2700 50  0001 C CNN
	1    2450 2700
	-1   0    0    -1  
$EndComp
$Comp
L power:GND #PWR?
U 1 1 5F501898
P 2450 3500
AR Path="/5F501898" Ref="#PWR?"  Part="1" 
AR Path="/5EFE1C3B/5F501898" Ref="#PWR?"  Part="1" 
AR Path="/5F25F1E7/5F501898" Ref="#PWR068"  Part="1" 
AR Path="/5F56A024/5F501898" Ref="#PWR?"  Part="1" 
F 0 "#PWR068" H 2450 3250 50  0001 C CNN
F 1 "GND" H 2455 3327 39  0000 C CNN
F 2 "" H 2450 3500 50  0001 C CNN
F 3 "" H 2450 3500 50  0001 C CNN
	1    2450 3500
	1    0    0    -1  
$EndComp
Text GLabel 2050 3000 0    39   Input ~ 0
SCL
Text GLabel 2050 2900 0    39   Input ~ 0
SDA
$Comp
L power:GND #PWR?
U 1 1 5F5018A0
P 2050 3200
AR Path="/5F5018A0" Ref="#PWR?"  Part="1" 
AR Path="/5EFE1C3B/5F5018A0" Ref="#PWR?"  Part="1" 
AR Path="/5F25F1E7/5F5018A0" Ref="#PWR063"  Part="1" 
AR Path="/5F56A024/5F5018A0" Ref="#PWR?"  Part="1" 
F 0 "#PWR063" H 2050 2950 50  0001 C CNN
F 1 "GND" V 2050 3000 39  0000 C CNN
F 2 "" H 2050 3200 50  0001 C CNN
F 3 "" H 2050 3200 50  0001 C CNN
	1    2050 3200
	0    1    1    0   
$EndComp
$Comp
L power:+3.3V #PWR?
U 1 1 5F5035FF
P 2050 3300
AR Path="/5F5035FF" Ref="#PWR?"  Part="1" 
AR Path="/5F25F1E7/5F5035FF" Ref="#PWR064"  Part="1" 
AR Path="/5F56A024/5F5035FF" Ref="#PWR?"  Part="1" 
F 0 "#PWR064" H 2050 3150 50  0001 C CNN
F 1 "+3.3V" V 2050 3500 39  0000 C CNN
F 2 "" H 2050 3300 50  0001 C CNN
F 3 "" H 2050 3300 50  0001 C CNN
	1    2050 3300
	0    -1   1    0   
$EndComp
$Comp
L Connector_Generic:Conn_01x06 J?
U 1 1 5F6A0892
P 9350 2300
AR Path="/5F6A0892" Ref="J?"  Part="1" 
AR Path="/5F25F1E7/5F6A0892" Ref="J6"  Part="1" 
F 0 "J6" H 9268 1699 39  0000 C CNN
F 1 "Conn_01x06" H 9268 1774 39  0000 C CNN
F 2 "Connector_PinSocket_2.54mm:PinSocket_1x06_P2.54mm_Vertical_SMD_Pin1Left" H 9350 2300 50  0001 C CNN
F 3 "https://www.mouser.de/datasheet/2/527/ssm_sm-1317000.pdf" H 9350 2300 50  0001 C CNN
F 4 "SSM-106-F-SV" H 9350 2300 50  0001 C CNN "Mfr"
	1    9350 2300
	1    0    0    1   
$EndComp
Text Label 6125 2300 0    39   ~ 0
PE+
Text Label 5725 2300 2    39   ~ 0
PE-
Wire Wire Line
	9050 2000 9150 2000
Wire Wire Line
	9050 2100 9150 2100
Wire Wire Line
	9050 2200 9150 2200
Wire Wire Line
	9050 2300 9150 2300
Wire Wire Line
	9050 2400 9150 2400
Wire Wire Line
	9050 2500 9150 2500
Text Label 9050 2200 2    39   ~ 0
PE+
Text Label 9050 2300 2    39   ~ 0
PE-
$Comp
L power:+3.3V #PWR?
U 1 1 5F6B5ED8
P 9050 2400
AR Path="/5F6B5ED8" Ref="#PWR?"  Part="1" 
AR Path="/5F25F1E7/5F6B5ED8" Ref="#PWR0134"  Part="1" 
AR Path="/5F56A024/5F6B5ED8" Ref="#PWR?"  Part="1" 
F 0 "#PWR0134" H 9050 2250 50  0001 C CNN
F 1 "+3.3V" V 9050 2600 39  0000 C CNN
F 2 "" H 9050 2400 50  0001 C CNN
F 3 "" H 9050 2400 50  0001 C CNN
	1    9050 2400
	0    -1   1    0   
$EndComp
$Comp
L power:+3.3V #PWR?
U 1 1 5F6B79D5
P 9050 2100
AR Path="/5F6B79D5" Ref="#PWR?"  Part="1" 
AR Path="/5F25F1E7/5F6B79D5" Ref="#PWR0136"  Part="1" 
AR Path="/5F56A024/5F6B79D5" Ref="#PWR?"  Part="1" 
F 0 "#PWR0136" H 9050 1950 50  0001 C CNN
F 1 "+3.3V" V 9050 2300 39  0000 C CNN
F 2 "" H 9050 2100 50  0001 C CNN
F 3 "" H 9050 2100 50  0001 C CNN
	1    9050 2100
	0    -1   1    0   
$EndComp
Text Label 3450 5500 0    39   ~ 0
M1
Text Label 4600 5500 0    39   ~ 0
M2
Text Label 9050 2000 2    39   ~ 0
M1
Text Label 9050 2500 2    39   ~ 0
M2
$Comp
L Device:C_Small C?
U 1 1 5F8232D6
P 3000 1400
AR Path="/5F8232D6" Ref="C?"  Part="1" 
AR Path="/5F25F1E7/5F8232D6" Ref="C11"  Part="1" 
F 0 "C11" H 2950 1350 39  0000 R CNN
F 1 "10n" H 3000 1450 39  0000 R CNN
F 2 "Capacitor_SMD:C_0603_1608Metric" H 3000 1400 50  0001 C CNN
F 3 "~" H 3000 1400 50  0001 C CNN
	1    3000 1400
	-1   0    0    -1  
$EndComp
$Comp
L power:GND #PWR?
U 1 1 5F8232DC
P 3000 1500
AR Path="/5F8232DC" Ref="#PWR?"  Part="1" 
AR Path="/5F25F1E7/5F8232DC" Ref="#PWR0144"  Part="1" 
F 0 "#PWR0144" H 3000 1250 50  0001 C CNN
F 1 "GND" H 3005 1327 39  0000 C CNN
F 2 "" H 3000 1500 50  0001 C CNN
F 3 "" H 3000 1500 50  0001 C CNN
	1    3000 1500
	1    0    0    -1  
$EndComp
Wire Wire Line
	3000 1300 2450 1300
Connection ~ 2450 1300
Wire Wire Line
	3000 2700 2450 2700
$Comp
L power:GND #PWR?
U 1 1 5F826DD7
P 3000 2900
AR Path="/5F826DD7" Ref="#PWR?"  Part="1" 
AR Path="/5F25F1E7/5F826DD7" Ref="#PWR0145"  Part="1" 
F 0 "#PWR0145" H 3000 2650 50  0001 C CNN
F 1 "GND" H 3005 2727 39  0000 C CNN
F 2 "" H 3000 2900 50  0001 C CNN
F 3 "" H 3000 2900 50  0001 C CNN
	1    3000 2900
	1    0    0    -1  
$EndComp
$Comp
L Device:C_Small C?
U 1 1 5F826DD1
P 3000 2800
AR Path="/5F826DD1" Ref="C?"  Part="1" 
AR Path="/5F25F1E7/5F826DD1" Ref="C12"  Part="1" 
F 0 "C12" H 2950 2750 39  0000 R CNN
F 1 "10n" H 3000 2850 39  0000 R CNN
F 2 "Capacitor_SMD:C_0603_1608Metric" H 3000 2800 50  0001 C CNN
F 3 "~" H 3000 2800 50  0001 C CNN
	1    3000 2800
	-1   0    0    -1  
$EndComp
Connection ~ 2450 2700
$Comp
L Device:Q_NMOS_GSD Q13
U 1 1 5F9B3489
P 5125 2775
AR Path="/5F25F1E7/5F9B3489" Ref="Q13"  Part="1" 
AR Path="/5F56A024/5F9B3489" Ref="Q?"  Part="1" 
F 0 "Q13" H 5330 2813 39  0000 L CNN
F 1 "Si2302CDS" H 5330 2738 39  0000 L CNN
F 2 "Package_TO_SOT_SMD:SOT-23" H 5325 2875 50  0001 C CNN
F 3 "https://eu.mouser.com/datasheet/2/427/si2302cds-1764899.pdf" H 5125 2775 50  0001 C CNN
	1    5125 2775
	1    0    0    -1  
$EndComp
$Comp
L Device:Q_NMOS_GSD Q16
U 1 1 5F9B3AD9
P 6725 2775
AR Path="/5F25F1E7/5F9B3AD9" Ref="Q16"  Part="1" 
AR Path="/5F56A024/5F9B3AD9" Ref="Q?"  Part="1" 
F 0 "Q16" H 6930 2813 39  0000 L CNN
F 1 "Si2302CDS" H 6930 2738 39  0000 L CNN
F 2 "Package_TO_SOT_SMD:SOT-23" H 6925 2875 50  0001 C CNN
F 3 "https://eu.mouser.com/datasheet/2/427/si2302cds-1764899.pdf" H 6725 2775 50  0001 C CNN
	1    6725 2775
	-1   0    0    -1  
$EndComp
$Comp
L Device:Q_NMOS_GSD Q17
U 1 1 5F9B4CA5
P 7275 2125
AR Path="/5F25F1E7/5F9B4CA5" Ref="Q17"  Part="1" 
AR Path="/5F56A024/5F9B4CA5" Ref="Q?"  Part="1" 
F 0 "Q17" H 7480 2163 39  0000 L CNN
F 1 "Si2302CDS" H 7480 2088 39  0000 L CNN
F 2 "Package_TO_SOT_SMD:SOT-23" H 7475 2225 50  0001 C CNN
F 3 "https://eu.mouser.com/datasheet/2/427/si2302cds-1764899.pdf" H 7275 2125 50  0001 C CNN
	1    7275 2125
	-1   0    0    -1  
$EndComp
$Comp
L Device:Q_NMOS_GSD Q9
U 1 1 5F9B5FEC
P 3350 5800
AR Path="/5F25F1E7/5F9B5FEC" Ref="Q9"  Part="1" 
AR Path="/5F56A024/5F9B5FEC" Ref="Q?"  Part="1" 
F 0 "Q9" H 3555 5838 39  0000 L CNN
F 1 "Si2302CDS" H 3555 5763 39  0000 L CNN
F 2 "Package_TO_SOT_SMD:SOT-23" H 3550 5900 50  0001 C CNN
F 3 "https://eu.mouser.com/datasheet/2/427/si2302cds-1764899.pdf" H 3350 5800 50  0001 C CNN
	1    3350 5800
	1    0    0    -1  
$EndComp
$Comp
L Device:Q_NMOS_GSD Q10
U 1 1 5F9B911A
P 4500 5800
AR Path="/5F25F1E7/5F9B911A" Ref="Q10"  Part="1" 
AR Path="/5F56A024/5F9B911A" Ref="Q?"  Part="1" 
F 0 "Q10" H 4705 5838 39  0000 L CNN
F 1 "Si2302CDS" H 4705 5763 39  0000 L CNN
F 2 "Package_TO_SOT_SMD:SOT-23" H 4700 5900 50  0001 C CNN
F 3 "https://eu.mouser.com/datasheet/2/427/si2302cds-1764899.pdf" H 4500 5800 50  0001 C CNN
	1    4500 5800
	1    0    0    -1  
$EndComp
$Comp
L Device:Q_PMOS_GSD Q15
U 1 1 5F9BBD52
P 6725 1825
AR Path="/5F25F1E7/5F9BBD52" Ref="Q15"  Part="1" 
AR Path="/5F56A024/5F9BBD52" Ref="Q?"  Part="1" 
F 0 "Q15" H 6930 1787 39  0000 L CNN
F 1 "Si2301BDS" H 6930 1862 39  0000 L CNN
F 2 "Package_TO_SOT_SMD:SOT-23" H 6925 1925 50  0001 C CNN
F 3 "https://eu.mouser.com/datasheet/2/427/si2301bds-1765637.pdf" H 6725 1825 50  0001 C CNN
	1    6725 1825
	-1   0    0    1   
$EndComp
$EndSCHEMATC
