{
	"JSON": {
		"ID": "1eeb0023-4bc5-6881-a2a3-f01b80428a84",
		"label": "",
		"comment": "UUID6 is used"
	},
	"probe": {
		"name": "Guitar",
		"type": "Stratocaster",
		"manufacturer": "Harley Benton"
	}
}
