{
	"JSON": {
		"ID": "1ee82fca-900d-69a3-82d3-a5e439419a24",
		"label": "",
		"comment": "UUID6 is used"
	},
    "comment": "here you can write down something important about this setup file",
    "info": "List below ALL components, you used in your experiment. By using the UUID there is no possibility to mix something up.",
	"setup": {
		"1ee82fa5-8f49-6532-b6bb-f5a84a79226d": {
            "type": "group_info",
			"name": "group_info",
            "comment": ""
        },
		"1ee82fa9-d223-6181-906e-e739e02158b0": {
            "type": "instrument",
			"name": "raspberry_pi",
            "comment": ""
        },
		"1ee7d755-d10f-64fd-aec6-7bddd5d21f4b": {
            "type": "sensor",
			"name": "sensor 1",
            "comment": ""
        },
		"1ee82fc2-a8ce-6292-a77c-2066cbc5bfc": {
            "type": "probe",
			"name": "probe_description",
            "comment": ""
        },
		"1ee8730f-3693-65f5-97b7-e8f9bb87930a": {
			"type": "label",
			"name": "newton",
			"comment": ""
		},
		"1ee7d756-458d-68f5-915e-8568260303ba": {
			"type": "sensor",
			"name": "sensor 2",
			"comment": ""
		}
	}
}