{
	"JSON": {
		"ID": "1ee82fa5-8f49-6532-b6bb-f5a84a79226d",
		"label": "",
		"comment": "UUID6 is used"
	},
	"group": {
		"number": "69",
		"author": "Niklas Darge",
		"experiment": "calorimetry"
	}
}