{
    "assembly": {
        "uuid": "kpi-2d58a7c6-5a4f-4076-960d-ba0810b567ab",
        "properties": {
            "label": "Fahrzeug 2",
            "mass [g]": 278.6400000000001,
            "price [Euro]": 28.195000000000004,
            "average delivery time [days]": 3.86
        },
        "layer": "kpi-SYSTEM",
        "components": [],
        "assemblies": [
            {
                "assembly": {
                    "uuid": "kpi-20ae6f2c-1ea4-44af-bf7b-f2b03aa80d49",
                    "properties": {
                        "label": "Chassis"
                    },
                    "layer": "kpi-ASSEMBLY",
                    "components": [
                        {
                            "component": {
                                "uuid": "kpi-187d20fa-9bc7-4a95-9687-d5572d9fc985",
                                "properties": {
                                    "label": "back left frame",
                                    "item number": 32018,
                                    "item description": "Technic, Brick 1 x 14 with Holes",
                                    "category": "frame",
                                    "price [Euro]": 0.03,
                                    "mass [g]": 4.92,
                                    "delivery time [days]": 5,
                                    "data source": "https://www.bricklink.com/v2/catalog/catalogitem.page?P=32018#T=C",
                                    "dimension [studs]": "1 x 14 x 1",
                                    "color": "red"
                                },
                                "layer": "kpi-COMPONENT"
                            }
                        },
                        {
                            "component": {
                                "uuid": "kpi-e5982755-3fc0-4562-97bd-927f78b71d37",
                                "properties": {
                                    "label": " back right frame",
                                    "item number": 32018,
                                    "item description": "Technic, Brick 1 x 14 with Holes",
                                    "category": "frame",
                                    "price [Euro]": 0.03,
                                    "mass [g]": 4.92,
                                    "delivery time [days]": 5,
                                    "data source": "https://www.bricklink.com/v2/catalog/catalogitem.page?P=32018#T=C",
                                    "dimension [studs]": "1 x 14 x 1",
                                    "color": "red"
                                },
                                "layer": "kpi-COMPONENT"
                            }
                        },
                        {
                            "component": {
                                "uuid": "kpi-06b41569-72e0-4f4a-8594-3f5dbf81ce6a",
                                "properties": {
                                    "label": "front left frame",
                                    "item number": 32525,
                                    "item description": "Technic, Liftarm Thick 1 x 11",
                                    "category": "frame",
                                    "price [Euro]": 0.02,
                                    "mass [g]": 2.8,
                                    "delivery time [days]": 3,
                                    "data source": "https://www.bricklink.com/v2/catalog/catalogitem.page?P=32525&name=Technic,%20Liftarm%20Thick%201%20x%2011&category=%5BTechnic,%20Liftarm%5D#T=S&O={%22iconly%22:0}",
                                    "dimension [studs]": "1 x 11",
                                    "color": "red"
                                },
                                "layer": "kpi-COMPONENT"
                            }
                        },
                        {
                            "component": {
                                "uuid": "kpi-4b97a788-f22f-4dba-9e36-c4ae41e6e4ad",
                                "properties": {
                                    "label": "front right frame",
                                    "item number": 32525,
                                    "item description": "Technic, Liftarm Thick 1 x 11",
                                    "category": "frame",
                                    "price [Euro]": 0.02,
                                    "mass [g]": 2.8,
                                    "delivery time [days]": 3,
                                    "data source": "https://www.bricklink.com/v2/catalog/catalogitem.page?P=32525&name=Technic,%20Liftarm%20Thick%201%20x%2011&category=%5BTechnic,%20Liftarm%5D#T=S&O={%22iconly%22:0}",
                                    "dimension [studs]": "1 x 11",
                                    "color": "red"
                                },
                                "layer": "kpi-COMPONENT"
                            }
                        },
                        {
                            "component": {
                                "uuid": "kpi-43c6e5d3-f7a1-4eab-b684-c4ecfc7aeb22",
                                "properties": {
                                    "label": "left back down brick",
                                    "item number": 3700,
                                    "item description": "Technic, Brick 1 x 2 with Hole",
                                    "category": "frame",
                                    "price [Euro]": 0.01,
                                    "mass [g]": 0.82,
                                    "delivery time [days]": 3,
                                    "data source": "https://www.bricklink.com/v2/catalog/catalogitem.page?P=3700#T=C",
                                    "dimension [studs]": "1 x 2",
                                    "color": "red"
                                },
                                "layer": "kpi-COMPONENT"
                            }
                        },
                        {
                            "component": {
                                "uuid": "kpi-a1ff7578-eb00-456b-9a55-e8bac45db491",
                                "properties": {
                                    "label": "left back up brick",
                                    "item number": 3700,
                                    "item description": "Technic, Brick 1 x 2 with Hole",
                                    "category": "frame",
                                    "price [Euro]": 0.01,
                                    "mass [g]": 0.82,
                                    "delivery time [days]": 3,
                                    "data source": "https://www.bricklink.com/v2/catalog/catalogitem.page?P=3700#T=C",
                                    "dimension [studs]": "1 x 2",
                                    "color": "red"
                                },
                                "layer": "kpi-COMPONENT"
                            }
                        },
                        {
                            "component": {
                                "uuid": "kpi-0f4f2b35-ff02-475d-b4ed-a22768a85b63",
                                "properties": {
                                    "label": "left front down brick",
                                    "item number": 3700,
                                    "item description": "Technic, Brick 1 x 2 with Hole",
                                    "category": "frame",
                                    "price [Euro]": 0.01,
                                    "mass [g]": 0.82,
                                    "delivery time [days]": 3,
                                    "data source": "https://www.bricklink.com/v2/catalog/catalogitem.page?P=3700#T=C",
                                    "dimension [studs]": "1 x 2",
                                    "color": "red"
                                },
                                "layer": "kpi-COMPONENT"
                            }
                        },
                        {
                            "component": {
                                "uuid": "kpi-16b80b57-ae20-415a-a7ef-884cd4d7d268",
                                "properties": {
                                    "label": "left front up brick",
                                    "item number": 3700,
                                    "item description": "Technic, Brick 1 x 2 with Hole",
                                    "category": "frame",
                                    "price [Euro]": 0.01,
                                    "mass [g]": 0.82,
                                    "delivery time [days]": 3,
                                    "data source": "https://www.bricklink.com/v2/catalog/catalogitem.page?P=3700#T=C",
                                    "dimension [studs]": "1 x 2",
                                    "color": "red"
                                },
                                "layer": "kpi-COMPONENT"
                            }
                        },
                        {
                            "component": {
                                "uuid": "kpi-eefc58f9-fc5e-4d35-93bb-51f43da4fee8",
                                "properties": {
                                    "label": "right back down brick",
                                    "item number": 3700,
                                    "item description": "Technic, Brick 1 x 2 with Hole",
                                    "category": "frame",
                                    "price [Euro]": 0.01,
                                    "mass [g]": 0.82,
                                    "delivery time [days]": 3,
                                    "data source": "https://www.bricklink.com/v2/catalog/catalogitem.page?P=3700#T=C",
                                    "dimension [studs]": "1 x 2",
                                    "color": "red"
                                },
                                "layer": "kpi-COMPONENT"
                            }
                        },
                        {
                            "component": {
                                "uuid": "kpi-ef8a2308-b40b-47e8-bd26-24749c62487f",
                                "properties": {
                                    "label": "right back up brick",
                                    "item number": 3700,
                                    "item description": "Technic, Brick 1 x 2 with Hole",
                                    "category": "frame",
                                    "price [Euro]": 0.01,
                                    "mass [g]": 0.82,
                                    "delivery time [days]": 3,
                                    "data source": "https://www.bricklink.com/v2/catalog/catalogitem.page?P=3700#T=C",
                                    "dimension [studs]": "1 x 2",
                                    "color": "red"
                                },
                                "layer": "kpi-COMPONENT"
                            }
                        },
                        {
                            "component": {
                                "uuid": "kpi-f1cc970a-9836-44ea-a308-d03c10ee7103",
                                "properties": {
                                    "label": "right front down brick",
                                    "item number": 3700,
                                    "item description": "Technic, Brick 1 x 2 with Hole",
                                    "category": "frame",
                                    "price [Euro]": 0.01,
                                    "mass [g]": 0.82,
                                    "delivery time [days]": 3,
                                    "data source": "https://www.bricklink.com/v2/catalog/catalogitem.page?P=3700#T=C",
                                    "dimension [studs]": "1 x 2",
                                    "color": "red"
                                },
                                "layer": "kpi-COMPONENT"
                            }
                        },
                        {
                            "component": {
                                "uuid": "kpi-7b96c71a-9dae-4fea-ba2e-1e8369d09e0b",
                                "properties": {
                                    "label": "right front up brick",
                                    "item number": 3700,
                                    "item description": "Technic, Brick 1 x 2 with Hole",
                                    "category": "frame",
                                    "price [Euro]": 0.01,
                                    "mass [g]": 0.82,
                                    "delivery time [days]": 3,
                                    "data source": "https://www.bricklink.com/v2/catalog/catalogitem.page?P=3700#T=C",
                                    "dimension [studs]": "1 x 2",
                                    "color": "red"
                                },
                                "layer": "kpi-COMPONENT"
                            }
                        },
                        {
                            "component": {
                                "uuid": "kpi-cbaaa3e6-8c47-45c5-a044-6ef6bec10a76",
                                "properties": {
                                    "label": "back up axle",
                                    "item number": 3707,
                                    "item description": "Axle 8 studs",
                                    "category": "axle",
                                    "price [Euro]": 0.01,
                                    "mass [g]": 1.18,
                                    "delivery time [days]": 3,
                                    "data source": "https://www.bricklink.com/v2/catalog/catalogitem.page?P=3707#T=S&O={%22iconly%22:0}",
                                    "dimension [studs]": 8,
                                    "color": "red"
                                },
                                "layer": "kpi-COMPONENT"
                            }
                        },
                        {
                            "component": {
                                "uuid": "kpi-c1e4c450-505c-4163-867f-df137d19fa06",
                                "properties": {
                                    "label": "middle back up axle",
                                    "item number": 3707,
                                    "item description": "Axle 8 studs",
                                    "category": "axle",
                                    "price [Euro]": 0.01,
                                    "mass [g]": 1.18,
                                    "delivery time [days]": 3,
                                    "data source": "https://www.bricklink.com/v2/catalog/catalogitem.page?P=3707#T=S&O={%22iconly%22:0}",
                                    "dimension [studs]": 8,
                                    "color": "red"
                                },
                                "layer": "kpi-COMPONENT"
                            }
                        },
                        {
                            "component": {
                                "uuid": "kpi-3595c58a-2893-43d5-a5e5-565239f214d4",
                                "properties": {
                                    "label": "middle front left axle",
                                    "item number": 32073,
                                    "item description": "Axle 5 studs",
                                    "category": "axle",
                                    "price [Euro]": 0.001,
                                    "mass [g]": 0.66,
                                    "delivery time [days]": 3,
                                    "data source": "https://www.bricklink.com/v2/catalog/catalogitem.page?P=32073#T=S&O={%22iconly%22:0}",
                                    "dimension [studs]": 5,
                                    "color": "red"
                                },
                                "layer": "kpi-COMPONENT"
                            }
                        },
                        {
                            "component": {
                                "uuid": "kpi-96c1228b-42ac-40a4-9513-5f6e70b5a170",
                                "properties": {
                                    "label": "middle front right axle",
                                    "item number": 32073,
                                    "item description": "Axle 5 studs",
                                    "category": "axle",
                                    "price [Euro]": 0.001,
                                    "mass [g]": 0.66,
                                    "delivery time [days]": 3,
                                    "data source": "https://www.bricklink.com/v2/catalog/catalogitem.page?P=32073#T=S&O={%22iconly%22:0}",
                                    "dimension [studs]": 5,
                                    "color": "red"
                                },
                                "layer": "kpi-COMPONENT"
                            }
                        },
                        {
                            "component": {
                                "uuid": "kpi-24c961e8-fc3b-458c-8648-9aa9b12dd1f5",
                                "properties": {
                                    "label": "left back up bush",
                                    "item number": 32123,
                                    "item description": "Technic Bush 1/2 Smooth",
                                    "category": "frame",
                                    "price [Euro]": 0.01,
                                    "mass [g]": 0.01,
                                    "delivery time [days]": 3,
                                    "data source": "https://www.bricklink.com/v2/catalog/catalogitem.page?P=4265c&name=Technic%20Bush%201/2%20Smooth&category=%5BTechnic%5D#T=S&O={%22iconly%22:0}",
                                    "dimension [studs]": 1,
                                    "color": "red"
                                },
                                "layer": "kpi-COMPONENT"
                            }
                        },
                        {
                            "component": {
                                "uuid": "kpi-2e26f3c4-563d-4c7d-bdfa-eede66992b71",
                                "properties": {
                                    "label": "right back up bush",
                                    "item number": 32123,
                                    "item description": "Technic Bush 1/2 Smooth",
                                    "category": "frame",
                                    "price [Euro]": 0.01,
                                    "mass [g]": 0.01,
                                    "delivery time [days]": 3,
                                    "data source": "https://www.bricklink.com/v2/catalog/catalogitem.page?P=4265c&name=Technic%20Bush%201/2%20Smooth&category=%5BTechnic%5D#T=S&O={%22iconly%22:0}",
                                    "dimension [studs]": 1,
                                    "color": "red"
                                },
                                "layer": "kpi-COMPONENT"
                            }
                        },
                        {
                            "component": {
                                "uuid": "kpi-71cf4ebb-f771-410e-ac37-d90a568f6667",
                                "properties": {
                                    "label": "left middle back up bush",
                                    "item number": 32123,
                                    "item description": "Technic Bush 1/2 Smooth",
                                    "category": "frame",
                                    "price [Euro]": 0.01,
                                    "mass [g]": 0.01,
                                    "delivery time [days]": 3,
                                    "data source": "https://www.bricklink.com/v2/catalog/catalogitem.page?P=4265c&name=Technic%20Bush%201/2%20Smooth&category=%5BTechnic%5D#T=S&O={%22iconly%22:0}",
                                    "dimension [studs]": 1,
                                    "color": "red"
                                },
                                "layer": "kpi-COMPONENT"
                            }
                        },
                        {
                            "component": {
                                "uuid": "kpi-75064f4a-a1a1-4972-a6bf-651f47a48610",
                                "properties": {
                                    "label": "right middle up bush",
                                    "item number": 32123,
                                    "item description": "Technic Bush 1/2 Smooth",
                                    "category": "frame",
                                    "price [Euro]": 0.01,
                                    "mass [g]": 0.01,
                                    "delivery time [days]": 3,
                                    "data source": "https://www.bricklink.com/v2/catalog/catalogitem.page?P=4265c&name=Technic%20Bush%201/2%20Smooth&category=%5BTechnic%5D#T=S&O={%22iconly%22:0}",
                                    "dimension [studs]": 1,
                                    "color": "red"
                                },
                                "layer": "kpi-COMPONENT"
                            }
                        },
                        {
                            "component": {
                                "uuid": "kpi-081e9a22-3315-4ccb-b232-22f9c9dbc92f",
                                "properties": {
                                    "label": "left left middle front bush",
                                    "item number": 32123,
                                    "item description": "Technic Bush 1/2 Smooth",
                                    "category": "frame",
                                    "price [Euro]": 0.01,
                                    "mass [g]": 0.01,
                                    "delivery time [days]": 3,
                                    "data source": "https://www.bricklink.com/v2/catalog/catalogitem.page?P=4265c&name=Technic%20Bush%201/2%20Smooth&category=%5BTechnic%5D#T=S&O={%22iconly%22:0}",
                                    "dimension [studs]": 1,
                                    "color": "red"
                                },
                                "layer": "kpi-COMPONENT"
                            }
                        },
                        {
                            "component": {
                                "uuid": "kpi-69daae9d-a091-4124-85cc-a2e7b298c793",
                                "properties": {
                                    "label": "left right middle front bush",
                                    "item number": 32123,
                                    "item description": "Technic Bush 1/2 Smooth",
                                    "category": "frame",
                                    "price [Euro]": 0.01,
                                    "mass [g]": 0.01,
                                    "delivery time [days]": 3,
                                    "data source": "https://www.bricklink.com/v2/catalog/catalogitem.page?P=4265c&name=Technic%20Bush%201/2%20Smooth&category=%5BTechnic%5D#T=S&O={%22iconly%22:0}",
                                    "dimension [studs]": 1,
                                    "color": "red"
                                },
                                "layer": "kpi-COMPONENT"
                            }
                        },
                        {
                            "component": {
                                "uuid": "kpi-018a1b4e-a9d0-4980-8aa0-15b168193ed5",
                                "properties": {
                                    "label": "right left middle front bush",
                                    "item number": 32123,
                                    "item description": "Technic Bush 1/2 Smooth",
                                    "category": "frame",
                                    "price [Euro]": 0.01,
                                    "mass [g]": 0.01,
                                    "delivery time [days]": 3,
                                    "data source": "https://www.bricklink.com/v2/catalog/catalogitem.page?P=4265c&name=Technic%20Bush%201/2%20Smooth&category=%5BTechnic%5D#T=S&O={%22iconly%22:0}",
                                    "dimension [studs]": 1,
                                    "color": "red"
                                },
                                "layer": "kpi-COMPONENT"
                            }
                        },
                        {
                            "component": {
                                "uuid": "kpi-bdcfa8d2-6e6b-47e2-bf6d-b656470122a8",
                                "properties": {
                                    "label": "right right middle front bush",
                                    "item number": 32123,
                                    "item description": "Technic Bush 1/2 Smooth",
                                    "category": "frame",
                                    "price [Euro]": 0.01,
                                    "mass [g]": 0.01,
                                    "delivery time [days]": 3,
                                    "data source": "https://www.bricklink.com/v2/catalog/catalogitem.page?P=4265c&name=Technic%20Bush%201/2%20Smooth&category=%5BTechnic%5D#T=S&O={%22iconly%22:0}",
                                    "dimension [studs]": 1,
                                    "color": "red"
                                },
                                "layer": "kpi-COMPONENT"
                            }
                        },
                        {
                            "component": {
                                "uuid": "kpi-ddc7b364-43ab-447a-977c-fae9423d248b",
                                "properties": {
                                    "label": "left pin",
                                    "item number": 3673,
                                    "item description": "Technic, Pin without Friction Ridges",
                                    "category": "frame",
                                    "price [Euro]": 0.01,
                                    "mass [g]": 0.16,
                                    "delivery time [days]": 3,
                                    "data source": "https://www.bricklink.com/v2/catalog/catalogitem.page?P=3673&name=Technic,%20Pin%20without%20Friction%20Ridges&category=%5BTechnic,%20Pin%5D#T=S&O={%22iconly%22:0}",
                                    "dimension [studs]": 1,
                                    "color": "red"
                                },
                                "layer": "kpi-COMPONENT"
                            }
                        },
                        {
                            "component": {
                                "uuid": "kpi-3787e22c-8ec8-42e2-aaee-cf0d039b1c36",
                                "properties": {
                                    "label": "right pin",
                                    "item number": 3673,
                                    "item description": "Technic, Pin without Friction Ridges",
                                    "category": "frame",
                                    "price [Euro]": 0.01,
                                    "mass [g]": 0.16,
                                    "delivery time [days]": 3,
                                    "data source": "https://www.bricklink.com/v2/catalog/catalogitem.page?P=3673&name=Technic,%20Pin%20without%20Friction%20Ridges&category=%5BTechnic,%20Pin%5D#T=S&O={%22iconly%22:0}",
                                    "dimension [studs]": 1,
                                    "color": "red"
                                },
                                "layer": "kpi-COMPONENT"
                            }
                        }
                    ],
                    "assemblies": []
                }
            },
            {
                "assembly": {
                    "uuid": "kpi-a804dfab-4ddf-4efc-9faa-8f4eb48c6137",
                    "properties": {
                        "label": "Fahrwerk"
                    },
                    "layer": "kpi-ASSEMBLY",
                    "components": [],
                    "assemblies": [
                        {
                            "assembly": {
                                "uuid": "kpi-c5b297ac-9d5b-47b7-8f91-0ee5b6687fa2",
                                "properties": {
                                    "label": "front wheels assembly"
                                },
                                "layer": "kpi-SUBASSEMBLY",
                                "components": [
                                    {
                                        "component": {
                                            "uuid": "kpi-b79cdba3-9a72-4dbc-9ed7-f142c8987fee",
                                            "properties": {
                                                "label": "front axle",
                                                "item number": 3708,
                                                "item description": "Axle 12 studs",
                                                "category": "axle",
                                                "price [Euro]": 0.02,
                                                "mass [g]": 1.82,
                                                "delivery time [days]": 7,
                                                "data source": "https://www.bricklink.com/v2/catalog/catalogitem.page?P=3708#T=S&O={%22iconly%22:0}",
                                                "dimension [studs]": 12,
                                                "color": "red"
                                            },
                                            "layer": "kpi-COMPONENT"
                                        }
                                    },
                                    {
                                        "component": {
                                            "uuid": "kpi-1bed9875-8b98-4774-961d-44f375b5d34f",
                                            "properties": {
                                                "label": "front left wheel",
                                                "item number": "3482c01",
                                                "item description": "wheel 24",
                                                "category": "wheel",
                                                "related items": 3483,
                                                "price [Euro]": 0.01,
                                                "mass [g]": 3.0,
                                                "delivery time [days]": 5,
                                                "data source": "https://www.bricklink.com/v2/catalog/catalogitem.page?P=3482c01#T=C",
                                                "diameter [mm]": 24.0,
                                                "color": "blue"
                                            },
                                            "layer": "kpi-COMPONENT"
                                        }
                                    },
                                    {
                                        "component": {
                                            "uuid": "kpi-ea3947f7-e674-45b1-841a-6a8179ae4f42",
                                            "properties": {
                                                "label": "front right wheel",
                                                "item number": "3482c01",
                                                "item description": "wheel 24",
                                                "category": "wheel",
                                                "related items": 3483,
                                                "price [Euro]": 0.01,
                                                "mass [g]": 3.0,
                                                "delivery time [days]": 5,
                                                "data source": "https://www.bricklink.com/v2/catalog/catalogitem.page?P=3482c01#T=C",
                                                "diameter [mm]": 24.0,
                                                "color": "blue"
                                            },
                                            "layer": "kpi-COMPONENT"
                                        }
                                    },
                                    {
                                        "component": {
                                            "uuid": "kpi-aae37d78-6e69-4477-8392-04674ebb43fe",
                                            "properties": {
                                                "label": "left front bush",
                                                "item number": 32123,
                                                "item description": "Technic Bush 1/2 Smooth",
                                                "category": "frame",
                                                "price [Euro]": 0.01,
                                                "mass [g]": 0.01,
                                                "delivery time [days]": 3,
                                                "data source": "https://www.bricklink.com/v2/catalog/catalogitem.page?P=4265c&name=Technic%20Bush%201/2%20Smooth&category=%5BTechnic%5D#T=S&O={%22iconly%22:0}",
                                                "dimension [studs]": 1,
                                                "color": "red"
                                            },
                                            "layer": "kpi-COMPONENT"
                                        }
                                    },
                                    {
                                        "component": {
                                            "uuid": "kpi-d468b310-fdbc-4e8d-b22c-31e71517455d",
                                            "properties": {
                                                "label": "right front bush",
                                                "item number": 32123,
                                                "item description": "Technic Bush 1/2 Smooth",
                                                "category": "frame",
                                                "price [Euro]": 0.01,
                                                "mass [g]": 0.01,
                                                "delivery time [days]": 3,
                                                "data source": "https://www.bricklink.com/v2/catalog/catalogitem.page?P=4265c&name=Technic%20Bush%201/2%20Smooth&category=%5BTechnic%5D#T=S&O={%22iconly%22:0}",
                                                "dimension [studs]": 1,
                                                "color": "red"
                                            },
                                            "layer": "kpi-COMPONENT"
                                        }
                                    }
                                ],
                                "assemblies": []
                            }
                        },
                        {
                            "assembly": {
                                "uuid": "kpi-a1cd1e9f-d937-4d55-9600-b072f883b1a1",
                                "properties": {
                                    "label": "middle wheels assembly"
                                },
                                "layer": "kpi-SUBASSEMBLY",
                                "components": [
                                    {
                                        "component": {
                                            "uuid": "kpi-f734d346-be06-4569-bbeb-e602c91ad95e",
                                            "properties": {
                                                "label": "middle back down axle",
                                                "item number": 3708,
                                                "item description": "Axle 12 studs",
                                                "category": "axle",
                                                "price [Euro]": 0.02,
                                                "mass [g]": 1.82,
                                                "delivery time [days]": 7,
                                                "data source": "https://www.bricklink.com/v2/catalog/catalogitem.page?P=3708#T=S&O={%22iconly%22:0}",
                                                "dimension [studs]": 12,
                                                "color": "red"
                                            },
                                            "layer": "kpi-COMPONENT"
                                        }
                                    },
                                    {
                                        "component": {
                                            "uuid": "kpi-4b44ea77-c649-41dd-894b-e36999802a86",
                                            "properties": {
                                                "label": "middle left wheel",
                                                "item number": "3482c01",
                                                "item description": "wheel 24",
                                                "category": "wheel",
                                                "related items": 3483,
                                                "price [Euro]": 0.01,
                                                "mass [g]": 3.0,
                                                "delivery time [days]": 5,
                                                "data source": "https://www.bricklink.com/v2/catalog/catalogitem.page?P=3482c01#T=C",
                                                "diameter [mm]": 24.0,
                                                "color": "blue"
                                            },
                                            "layer": "kpi-COMPONENT"
                                        }
                                    },
                                    {
                                        "component": {
                                            "uuid": "kpi-73f95c85-28f7-498a-b3d4-449e6787c4f5",
                                            "properties": {
                                                "label": "middle right wheel",
                                                "item number": "3482c01",
                                                "item description": "wheel 24",
                                                "category": "wheel",
                                                "related items": 3483,
                                                "price [Euro]": 0.01,
                                                "mass [g]": 3.0,
                                                "delivery time [days]": 5,
                                                "data source": "https://www.bricklink.com/v2/catalog/catalogitem.page?P=3482c01#T=C",
                                                "diameter [mm]": 24.0,
                                                "color": "blue"
                                            },
                                            "layer": "kpi-COMPONENT"
                                        }
                                    },
                                    {
                                        "component": {
                                            "uuid": "kpi-855a7dd1-fce2-4f34-aa1c-5cfc1b8ebe13",
                                            "properties": {
                                                "label": "left middle back down bush",
                                                "item number": 32123,
                                                "item description": "Technic Bush 1/2 Smooth",
                                                "category": "frame",
                                                "price [Euro]": 0.01,
                                                "mass [g]": 0.01,
                                                "delivery time [days]": 3,
                                                "data source": "https://www.bricklink.com/v2/catalog/catalogitem.page?P=4265c&name=Technic%20Bush%201/2%20Smooth&category=%5BTechnic%5D#T=S&O={%22iconly%22:0}",
                                                "dimension [studs]": 1,
                                                "color": "red"
                                            },
                                            "layer": "kpi-COMPONENT"
                                        }
                                    },
                                    {
                                        "component": {
                                            "uuid": "kpi-2e7c002a-446f-45e4-83a4-ce44902dfcbc",
                                            "properties": {
                                                "label": "right middle down bush",
                                                "item number": 32123,
                                                "item description": "Technic Bush 1/2 Smooth",
                                                "category": "frame",
                                                "price [Euro]": 0.01,
                                                "mass [g]": 0.01,
                                                "delivery time [days]": 3,
                                                "data source": "https://www.bricklink.com/v2/catalog/catalogitem.page?P=4265c&name=Technic%20Bush%201/2%20Smooth&category=%5BTechnic%5D#T=S&O={%22iconly%22:0}",
                                                "dimension [studs]": 1,
                                                "color": "red"
                                            },
                                            "layer": "kpi-COMPONENT"
                                        }
                                    }
                                ],
                                "assemblies": []
                            }
                        },
                        {
                            "assembly": {
                                "uuid": "kpi-5816904e-dcf8-4c5b-b7db-03130a0a2c52",
                                "properties": {
                                    "label": "back wheels assembly"
                                },
                                "layer": "kpi-SUBASSEMBLY",
                                "components": [
                                    {
                                        "component": {
                                            "uuid": "kpi-91fc3b97-6d6f-4439-b8b6-1f29a4cd524f",
                                            "properties": {
                                                "label": "back down left axle",
                                                "item number": 32073,
                                                "item description": "Axle 5 studs",
                                                "category": "axle",
                                                "price [Euro]": 0.001,
                                                "mass [g]": 0.66,
                                                "delivery time [days]": 3,
                                                "data source": "https://www.bricklink.com/v2/catalog/catalogitem.page?P=32073#T=S&O={%22iconly%22:0}",
                                                "dimension [studs]": 5,
                                                "color": "red"
                                            },
                                            "layer": "kpi-COMPONENT"
                                        }
                                    },
                                    {
                                        "component": {
                                            "uuid": "kpi-7edb4c99-68d8-44b8-96ae-8d780fa1b120",
                                            "properties": {
                                                "label": "back down right axle",
                                                "item number": 32073,
                                                "item description": "Axle 5 studs",
                                                "category": "axle",
                                                "price [Euro]": 0.001,
                                                "mass [g]": 0.66,
                                                "delivery time [days]": 3,
                                                "data source": "https://www.bricklink.com/v2/catalog/catalogitem.page?P=32073#T=S&O={%22iconly%22:0}",
                                                "dimension [studs]": 5,
                                                "color": "red"
                                            },
                                            "layer": "kpi-COMPONENT"
                                        }
                                    },
                                    {
                                        "component": {
                                            "uuid": "kpi-226b5264-096f-4ec2-8f8a-845a138bbf57",
                                            "properties": {
                                                "label": "back left wheel",
                                                "item number": "3482c01",
                                                "item description": "wheel 24",
                                                "category": "wheel",
                                                "related items": 3483,
                                                "price [Euro]": 0.01,
                                                "mass [g]": 3.0,
                                                "delivery time [days]": 5,
                                                "data source": "https://www.bricklink.com/v2/catalog/catalogitem.page?P=3482c01#T=C",
                                                "diameter [mm]": 24.0,
                                                "color": "blue"
                                            },
                                            "layer": "kpi-COMPONENT"
                                        }
                                    },
                                    {
                                        "component": {
                                            "uuid": "kpi-244a44f1-4c06-477e-8150-24a959944aa3",
                                            "properties": {
                                                "label": "back right wheel",
                                                "item number": "3482c01",
                                                "item description": "wheel 24",
                                                "category": "wheel",
                                                "related items": 3483,
                                                "price [Euro]": 0.01,
                                                "mass [g]": 3.0,
                                                "delivery time [days]": 5,
                                                "data source": "https://www.bricklink.com/v2/catalog/catalogitem.page?P=3482c01#T=C",
                                                "diameter [mm]": 24.0,
                                                "color": "blue"
                                            },
                                            "layer": "kpi-COMPONENT"
                                        }
                                    },
                                    {
                                        "component": {
                                            "uuid": "kpi-5f9e2971-2551-4582-a6a0-37338464bc67",
                                            "properties": {
                                                "label": "left back down bush",
                                                "item number": 32123,
                                                "item description": "Technic Bush 1/2 Smooth",
                                                "category": "frame",
                                                "price [Euro]": 0.01,
                                                "mass [g]": 0.01,
                                                "delivery time [days]": 3,
                                                "data source": "https://www.bricklink.com/v2/catalog/catalogitem.page?P=4265c&name=Technic%20Bush%201/2%20Smooth&category=%5BTechnic%5D#T=S&O={%22iconly%22:0}",
                                                "dimension [studs]": 1,
                                                "color": "red"
                                            },
                                            "layer": "kpi-COMPONENT"
                                        }
                                    },
                                    {
                                        "component": {
                                            "uuid": "kpi-c583d38c-c3e4-461d-87da-56085a3838d7",
                                            "properties": {
                                                "label": "right back down bush",
                                                "item number": 32123,
                                                "item description": "Technic Bush 1/2 Smooth",
                                                "category": "frame",
                                                "price [Euro]": 0.01,
                                                "mass [g]": 0.01,
                                                "delivery time [days]": 3,
                                                "data source": "https://www.bricklink.com/v2/catalog/catalogitem.page?P=4265c&name=Technic%20Bush%201/2%20Smooth&category=%5BTechnic%5D#T=S&O={%22iconly%22:0}",
                                                "dimension [studs]": 1,
                                                "color": "red"
                                            },
                                            "layer": "kpi-COMPONENT"
                                        }
                                    },
                                    {
                                        "component": {
                                            "uuid": "kpi-e9013949-f399-4bd4-b54a-c3ccbf55634b",
                                            "properties": {
                                                "label": "axle_connector",
                                                "item number": 6538,
                                                "item description": "Technic, Axle Connector 2L (Ridged Undetermined Type)",
                                                "category": "frame",
                                                "price [Euro]": 0.03,
                                                "mass [g]": 0.4,
                                                "delivery time [days]": 5,
                                                "data source": "https://www.bricklink.com/v2/catalog/catalogitem.page?P=6538#T=C",
                                                "dimension [studs]": "?",
                                                "color": "red"
                                            },
                                            "layer": "kpi-COMPONENT"
                                        }
                                    }
                                ],
                                "assemblies": []
                            }
                        }
                    ]
                }
            },
            {
                "assembly": {
                    "uuid": "kpi-5329614b-c646-4674-8a2b-4d0ae17b0ab5",
                    "properties": {
                        "label": "Antrieb"
                    },
                    "layer": "kpi-ASSEMBLY",
                    "components": [
                        {
                            "component": {
                                "uuid": "kpi-80a04ae8-4a64-48c6-b836-55ff591010e3",
                                "properties": {
                                    "label": "battery",
                                    "item number": "8881-1",
                                    "item description": "Power Functions Battery Box",
                                    "category": "battery",
                                    "price [Euro]": 12,
                                    "mass [g]": 179.4,
                                    "delivery time [days]": 3,
                                    "data source": "https://www.bricklink.com/v2/catalog/catalogitem.page?S=8881-1#T=S&O={%22iconly%22:0}",
                                    "output voltage [V]": 9.0,
                                    "dimensions [cm]": "8,8 x 6,3 x 3,2",
                                    "color": "red"
                                },
                                "layer": "kpi-COMPONENT"
                            }
                        },
                        {
                            "component": {
                                "uuid": "kpi-11b1d3bb-ed2e-4b6b-840a-bc0df5c98ef1",
                                "properties": {
                                    "label": "motor",
                                    "item number": "88003-1",
                                    "item description": "Power Functions L-Motor",
                                    "category": "motor",
                                    "related items": "8881, 8878, 88000",
                                    "idle current [mA]": 120,
                                    "idle speed [rev per min]": 390,
                                    "locking torque [Ncm]": 18,
                                    "price [Euro]": 15,
                                    "mass [g]": 48.0,
                                    "delivery time [days]": 3,
                                    "data source": "https://www.bricklink.com/v2/catalog/catalogitem.page?S=88003-1&name=Power%20Functions%20L-Motor&category=%5BPower%20Functions%5D#T=S&O={%22iconly%22:0}",
                                    "compatible battery": "8881, 8878, 88000",
                                    "input voltage [V]": 9,
                                    "dimensions [cm]": "13 x 11 x 2.5",
                                    "color": "red"
                                },
                                "layer": "kpi-COMPONENT"
                            }
                        },
                        {
                            "component": {
                                "uuid": "kpi-63162308-a4b1-44db-9e2e-9d30703cc7e1",
                                "properties": {
                                    "label": "left motor pin",
                                    "item number": 3673,
                                    "item description": "Technic, Pin without Friction Ridges",
                                    "category": "frame",
                                    "price [Euro]": 0.01,
                                    "mass [g]": 0.16,
                                    "delivery time [days]": 3,
                                    "data source": "https://www.bricklink.com/v2/catalog/catalogitem.page?P=3673&name=Technic,%20Pin%20without%20Friction%20Ridges&category=%5BTechnic,%20Pin%5D#T=S&O={%22iconly%22:0}",
                                    "dimension [studs]": 1,
                                    "color": "red"
                                },
                                "layer": "kpi-COMPONENT"
                            }
                        },
                        {
                            "component": {
                                "uuid": "kpi-f563d4e8-6f63-4839-92a7-72e08d89542d",
                                "properties": {
                                    "label": "right motor pin",
                                    "item number": 3673,
                                    "item description": "Technic, Pin without Friction Ridges",
                                    "category": "frame",
                                    "price [Euro]": 0.01,
                                    "mass [g]": 0.16,
                                    "delivery time [days]": 3,
                                    "data source": "https://www.bricklink.com/v2/catalog/catalogitem.page?P=3673&name=Technic,%20Pin%20without%20Friction%20Ridges&category=%5BTechnic,%20Pin%5D#T=S&O={%22iconly%22:0}",
                                    "dimension [studs]": 1,
                                    "color": "red"
                                },
                                "layer": "kpi-COMPONENT"
                            }
                        }
                    ],
                    "assemblies": [
                        {
                            "assembly": {
                                "uuid": "kpi-0b5ed153-6cfb-4c53-8479-563dc1fff7b7",
                                "properties": {
                                    "label": "Getriebe"
                                },
                                "layer": "kpi-SUBASSEMBLY",
                                "components": [
                                    {
                                        "component": {
                                            "uuid": "kpi-4b21825b-7bf4-44f4-9a79-540c9d7ae279",
                                            "properties": {
                                                "label": "worm screw",
                                                "item number": 4716,
                                                "item description": "Gear Worm Screw",
                                                "category": "gear",
                                                "price [Euro]": 0.54,
                                                "mass [g]": 0.6,
                                                "delivery time [days]": 12,
                                                "data source": "https://www.bricklink.com/v2/catalog/catalogitem.page?P=4716#T=C",
                                                "color": "red"
                                            },
                                            "layer": "kpi-COMPONENT"
                                        }
                                    },
                                    {
                                        "component": {
                                            "uuid": "kpi-94d8c072-2e53-4933-9e19-f437eb7cc65b",
                                            "properties": {
                                                "label": "small gear",
                                                "item number": 3647,
                                                "item description": "Gear 8 Tooth",
                                                "category": "gear",
                                                "price [Euro]": 0.14,
                                                "mass [g]": 0.16,
                                                "delivery time [days]": 11,
                                                "data source": "https://www.bricklink.com/v2/catalog/catalogitem.page?P=3647#T=C",
                                                "color": "red"
                                            },
                                            "layer": "kpi-COMPONENT"
                                        }
                                    },
                                    {
                                        "component": {
                                            "uuid": "kpi-36262b65-fee1-41bb-80c5-c939805b05f3",
                                            "properties": {
                                                "label": "gear axle",
                                                "item number": 32073,
                                                "item description": "Axle 5 studs",
                                                "category": "axle",
                                                "price [Euro]": 0.001,
                                                "mass [g]": 0.66,
                                                "delivery time [days]": 3,
                                                "data source": "https://www.bricklink.com/v2/catalog/catalogitem.page?P=32073#T=S&O={%22iconly%22:0}",
                                                "dimension [studs]": 5,
                                                "color": "red"
                                            },
                                            "layer": "kpi-COMPONENT"
                                        }
                                    }
                                ],
                                "assemblies": []
                            }
                        }
                    ]
                }
            }
        ]
    }
}