{
	"JSON": {
		"ID": "1ee82415-0fbe-652a-aea6-39cda52b5240",
		"label": "",
		"comment": "UUID6 is used"
	},
	"part": {
		"name": "touch-down_bearing_testrig_3",
		"distance to motor bearing": {
			"value": 450,
			"unit": "millimeter"
		}
	}
}