{
    "JSON": {
        "ID": "1eeae409-9a9b-608b-a63d-8b85fc89ce34",
        "label": "setup_compressor",
        "comment": "UUID6 is used"
    },
    "setup": {
        "1ee846ef-4df0-632a-bfdb-ef2ea3181b39": {
            "type": "general",
            "name": "general_info",
            "comment": ""
        },
        "1ee846f1-b588-6d3c-9659-7c3266d530e8": {
            "type": "instrument",
            "name": "raspberry_pi",
            "comment": ""
        },
        "1ee847be-fddd-6ee4-892a-68c4555b0981": {
            "type": "sensor",
            "name": "accelerometer",
            "range": {
                "min": -2,
                "max": 2,
                "units": "standard_gravity"
            },
            "frequency": {
                "value": 800,
                "units": "Hertz"
            },
            "comment": ""
        },
        "1eeae406-efd7-6533-80b1-d37f5466d308": {
            "type": "probe",
            "name": "Mixer",
            "comment": ""
        }
    }
}