{
	"JSON": {
		"ID": "1eeae3fd-fc7f-644d-a7db-3d3f47be41f7",
		"label": "Getreidemuehle",
		"comment": "UUID6 is used"
	},
	"probe": {
		"name": "Getreidemuehle",
		"type": "Küchengerät",
		"manufacturer": "Jupiter"
	}
}
