{
	"JSON": {
		"ID": "1ee83516-05d5-670c-a544-d8133e7efeba",
		"label": "setup newton",
		"comment": "UUID6 is used"
	},
    "comment": "This is the setup for the experiment newton",
    "info": "List below ALL components, you used in your experiment. By using the UUID there is no possibility to mix something up.",
	"setup": {
		"1ee8350a-ef18-64c4-b08c-47fe64b66f0c": {
            "type": "group_info",
			"name": "group_info",
            "comment": ""
        },
		"1ee8350e-d6a8-6c69-9904-d0b00db5939e": {
            "type": "instrument",
			"name": "raspberry_pi",
            "comment": ""
        },
		"1ee834da-f33e-65f2-8fe9-a2982f2ebf1b": {
            "type": "sensor",
			"name": "temperature_cup",
            "comment": ""            
        },
		"1ee834de-42b4-6cbd-b2e0-bb1cc957fbe4": {
            "type": "sensor",
			"name": "temperature_environment",
            "comment": ""            
        },       
		"1ee83507-b122-6c32-98c6-4d07b2070cc8": {
            "type": "probe",
			"name": "probe_description",
            "comment": ""
        }
	}
}