0
0
0
0
0
0
0
0
0
9
32
52
55
39
16
0
0
0
0
0
0
0
0
0
0
0
0
0
0
0
0
0
0
9
32
53
56
40
17
0
0
0
0
0
0
0
0
0
0
0
0
0
0
0
0
0
0
15
52
84
89
65
28
0
0
0
0
0
0
0
0
0
0
0
0
0
0
0
0
0
0
15
52
85
90
66
28
1
0
0
0
0
0
0
0
0
0
0
0
0
0
0
0
0
0
4
22
46
59
63
30
1
0
0
0
0
0
0
0
0
0
0
0
0
0
0
0
0
0
10
35
56
60
45
20
1
0
0
0
0
0
0
0
0
0
0
0
0
0
0
0
0
0
11
36
57
61
38
13
0
0
0
0
0
0
0
0
0
0
0
0
0
0
0
0
0
0
4
14
23
24
18
8
0
0
0
0
0
0
0
0
0
0
0
0
0
0
0
0
0
0
18
59
93
99
73
30
2
0
0
0
0
0
0
0
0
0
0
0
0
0
0
0
0
0
5
15
24
25
19
9
1
0
0
0
0
0
0
0
0
0
0
0
0
0
0
0
0
0
13
40
63
67
52
25
2
0
0
0
0
0
0
0
0
0
0
0
0
0
0
0
0
0
20
64
100
108
84
40
4
0
0
0
0
0
0
0
0
0
0
0
0
0
0
0
0
0
14
43
66
71
46
17
1
0
0
0
0
0
0
0
0
0
0
0
0
0
0
0
0
0
6
28
56
71
47
18
1
0
0
0
0
0
0
0
0
0
0
0
0
0
0
0
0
0
21
63
99
109
90
45
6
0
0
0
0
0
0
0
0
0
0
0
0
0
0
0
0
0
6
18
27
29
24
12
2
0
0
0
0
0
0
0
0
0
0
0
0
0
0
0
0
0
7
31
61
78
63
32
5
0
0
0
0
0
0
0
0
0
0
0
0
0
0
0
0
0
25
62
85
80
54
21
2
0
0
0
0
0
0
0
0
0
0
0
0
0
0
0
0
0
8
20
30
32
26
14
3
0
0
0
0
0
0
0
0
0
0
0
0
0
0
0
0
0
8
21
31
33
27
15
3
0
0
0
0
0
0
0
0
0
0
0
0
0
0
0
0
0
8
22
32
34
28
15
4
0
0
0
0
0
0
0
0
0
0
0
0
0
0
0
0
0
9
22
32
35
29
16
4
0
0
0
0
0
0
0
0
0
0
0
0
0
0
0
0
0
9
23
33
36
30
17
4
0
0
0
0
0
0
0
0
0
0
0
0
0
0
0
0
2
38
96
139
149
125
73
20
0
0
0
0
0
0
0
0
0
0
0
0
0
0
0
0
3
42
101
143
153
129
77
22
0
0
0
0
0
0
0
0
0
0
0
0
0
0
0
0
3
37
89
125
134
114
69
20
0
0
0
0
0
0
0
0
0
0
0
0
0
0
0
0
4
46
109
152
162
138
85
26
0
0
0
0
0
0
0
0
0
0
0
0
0
0
0
0
1
12
28
39
42
36
22
7
0
0
0
0
0
0
0
0
0
0
0
0
0
0
0
0
1
13
47
86
110
136
92
31
0
0
0
0
0
0
0
0
0
0
0
0
0
0
0
0
7
55
122
157
114
136
96
34
0
0
0
0
0
0
0
0
0
0
0
0
0
0
0
0
8
37
67
69
45
39
25
9
0
0
0
0
0
0
0
0
0
0
0
0
0
0
0
0
6
40
84
113
121
120
87
34
1
0
0
0
0
0
0
0
0
0
0
0
0
0
0
0
11
64
126
162
164
144
97
37
1
0
0
0
0
0
0
0
0
0
0
0
0
0
0
0
9
60
133
184
199
175
119
46
3
0
0
0
0
0
0
0
0
0
0
0
0
0
0
0
14
76
148
194
206
182
125
49
4
0
0
0
0
0
0
0
0
0
0
0
0
0
0
0
16
80
153
200
210
186
129
53
4
0
0
0
0
0
0
0
0
0
0
0
0
0
0
0
4
21
63
109
138
122
85
36
4
0
0
0
0
0
0
0
0
0
0
0
0
0
0
0
11
56
103
134
142
167
131
60
7
0
0
0
0
0
0
0
0
0
0
0
0
0
0
0
5
23
68
115
146
108
59
16
2
0
0
0
0
0
0
0
0
0
0
0
0
0
0
0
6
24
43
55
58
52
37
17
2
0
0
0
0
0
0
0
0
0
0
0
0
0
0
0
7
25
44
56
60
53
39
18
3
0
0
0
0
0
0
0
0
0
0
0
0
0
0
0
16
68
117
149
157
196
157
79
13
0
0
0
0
0
0
0
0
0
0
0
0
0
0
0
13
28
150
229
251
218
132
21
6
0
0
0
0
0
0
0
0
0
0
0
0
0
0
0
22
75
125
157
165
125
70
22
4
0
0
0
0
0
0
0
0
0
0
0
0
0
0
0
38
123
202
253
266
240
179
94
19
0
0
0
0
0
0
0
0
0
0
0
0
0
0
0
32
108
176
219
230
195
134
63
14
0
0
0
0
0
0
0
0
0
0
0
0
0
0
0
11
33
53
66
69
62
47
26
13
0
0
0
0
0
0
0
0
0
0
0
0
0
0
1
34
88
184
253
277
251
191
106
26
0
0
0
0
0
0
0
0
0
0
0
0
0
0
2
47
92
144
176
185
241
198
113
29
0
0
0
0
0
0
0
0
0
0
0
0
0
0
1
29
94
146
179
188
171
130
74
20
0
0
0
0
0
0
0
0
0
0
0
0
0
0
1
14
38
58
71
74
67
52
30
8
0
0
0
0
0
0
0
0
0
0
0
0
0
0
1
15
39
59
72
76
112
114
80
31
0
0
0
0
0
0
0
0
0
0
0
0
0
0
3
35
104
130
120
77
70
55
33
10
0
0
0
0
0
0
0
0
0
0
0
0
0
0
4
29
42
62
75
78
72
56
34
10
0
0
0
0
0
0
0
0
0
0
0
0
0
0
5
31
43
64
77
80
73
57
35
11
0
0
0
0
0
0
0
0
0
0
0
0
0
0
11
80
176
260
313
327
299
233
138
46
2
0
0
0
0
0
0
0
0
0
0
0
0
0
13
86
184
256
274
215
293
245
154
53
3
0
0
0
0
0
0
0
0
0
0
0
0
0
15
92
194
279
331
344
317
252
159
56
4
0
0
0
0
0
0
0
0
0
0
0
0
0
11
62
128
152
137
87
80
64
41
15
1
0
0
0
0
0
0
0
0
0
0
0
0
0
17
95
199
285
338
351
323
256
162
59
5
0
0
0
0
0
0
0
0
0
0
0
0
0
19
97
185
230
203
89
82
65
41
16
1
0
0
0
0
0
0
0
0
0
0
0
0
0
5
26
52
120
186
231
178
108
43
17
2
0
0
0
0
0
0
0
0
0
0
0
0
0
6
27
53
75
88
91
84
67
44
18
2
0
0
0
0
0
0
0
0
0
0
0
0
0
6
29
55
76
89
92
85
69
45
19
2
0
0
0
0
0
0
0
0
0
0
0
0
0
27
120
225
312
364
377
348
281
185
78
10
0
0
0
0
0
0
0
0
0
0
0
0
0
8
31
58
79
92
95
143
153
121
53
8
0
0
0
0
0
0
0
0
0
0
0
0
0
8
33
60
81
94
97
90
73
49
22
3
0
0
0
0
0
0
0
0
0
0
0
0
1
35
138
245
332
385
398
368
299
201
89
13
0
0
0
0
0
0
0
0
0
0
0
0
0
25
122
238
328
385
401
373
306
208
97
17
0
0
0
0
0
0
0
0
0
0
0
0
0
11
37
65
86
99
102
95
78
53
25
5
0
0
0
0
0
0
0
0
0
0
0
0
1
12
39
66
143
216
266
206
129
54
43
11
0
0
0
0
0
0
0
0
0
0
0
0
2
34
104
175
231
264
271
252
207
143
71
14
0
0
0
0
0
0
0
0
0
0
0
0
5
58
169
280
368
420
430
397
325
223
109
21
0
0
0
0
0
0
0
0
0
0
0
0
6
63
176
288
377
431
442
411
339
236
121
26
0
0
0
0
0
0
0
0
0
0
0
0
6
60
167
277
339
345
286
266
220
155
106
26
0
0
0
0
0
0
0
0
0
0
0
0
8
73
188
300
389
443
453
421
348
244
127
28
0
0
0
0
0
0
0
0
0
0
0
0
9
75
180
262
317
329
297
232
147
64
34
8
0
0
0
0
0
0
0
0
0
0
0
0
7
70
190
311
400
453
463
435
364
260
140
33
1
0
0
0
0
0
0
0
0
0
0
0
11
75
176
273
349
394
403
351
267
168
132
35
1
0
0
0
0
0
0
0
0
0
0
0
14
94
214
330
419
472
482
449
376
270
149
39
1
0
0
0
0
0
0
0
0
0
0
0
10
53
89
83
105
118
121
112
94
68
38
10
0
0
0
0
0
0
0
0
0
0
0
0
4
26
56
84
106
119
122
150
154
130
83
26
1
0
0
0
0
0
0
0
0
0
0
0
5
27
57
86
108
121
124
115
97
71
136
47
3
0
0
0
0
0
0
0
0
0
0
0
22
114
238
354
443
494
502
466
370
183
119
40
3
0
0
0
0
0
0
0
0
0
0
0
15
76
156
230
240
204
127
119
100
74
109
47
4
0
0
0
0
0
0
0
0
0
0
0
26
125
251
367
457
509
517
483
407
300
175
58
5
0
0
0
0
0
0
0
0
0
0
0
18
83
164
238
295
328
334
311
263
194
114
39
4
0
0
0
0
0
0
0
0
0
0
0
7
34
65
94
115
128
130
385
395
304
181
65
7
0
0
0
0
0
0
0
0
0
0
1
21
119
252
377
460
504
502
469
398
296
177
65
7
0
0
0
0
0
0
0
0
0
0
1
24
93
174
248
304
336
341
266
172
79
48
18
2
0
0
0
0
0
0
0
0
0
0
2
31
105
188
263
319
352
356
378
353
284
196
82
11
0
0
0
0
0
0
0
0
0
0
4
53
170
300
417
506
553
531
506
438
335
212
87
12
0
0
0
0
0
0
0
0
0
0
4
36
155
297
420
508
557
564
528
452
344
216
91
14
0
0
0
0
0
0
0
0
0
0
4
15
45
78
107
129
141
143
342
387
329
208
89
14
0
0
0
0
0
0
0
0
0
0
6
62
175
299
409
492
540
546
500
415
302
214
97
16
0
0
0
0
0
0
0
0
0
0
8
70
192
323
439
526
575
581
545
469
359
230
102
17
0
0
0
0
0
0
0
0
0
0
8
70
194
327
443
531
581
588
550
471
357
229
103
18
0
0
0
0
0
0
0
0
0
0
9
74
186
297
382
427
425
379
402
378
310
200
92
17
0
0
0
0
0
0
0
0
0
0
12
82
199
312
385
458
498
503
471
406
314
204
95
18
0
0
0
0
0
0
0
0
0
0
7
56
137
222
297
296
245
152
143
123
95
134
86
19
0
0
0
0
0
0
0
0
0
0
15
92
217
350
466
518
444
154
145
125
97
216
120
24
0
0
0
0
0
0
0
0
0
0
10
63
145
232
307
412
489
525
574
504
392
259
126
26
0
0
0
0
0
0
0
0
0
0
18
103
233
371
490
579
626
629
591
512
398
265
130
27
1
0
0
0
0
0
0
0
0
0
19
107
237
373
491
579
627
631
592
512
399
266
132
29
1
0
0
0
0
0
0
0
0
0
19
71
155
241
315
370
400
403
469
456
380
248
120
27
1
0
0
0
0
0
0
0
0
0
23
115
246
379
495
579
623
621
585
509
400
270
138
34
1
0
0
0
0
0
0
0
0
0
22
113
245
382
500
587
634
638
600
522
410
278
143
37
2
0
0
0
0
0
0
0
0
1
26
125
257
392
508
595
643
647
608
520
352
275
147
40
2
0
0
0
0
0
0
0
0
1
24
83
140
160
128
149
160
161
246
281
266
182
96
27
2
0
0
0
0
0
0
0
0
1
20
86
170
256
330
384
413
415
390
340
269
209
122
38
3
0
0
0
0
0
0
0
0
2
28
89
145
165
130
151
162
163
361
423
382
280
155
48
4
0
0
0
0
0
0
0
0
1
10
36
219
394
522
607
653
657
616
531
405
292
161
51
5
0
0
0
0
0
0
0
0
3
31
94
180
266
340
446
524
562
528
461
367
239
120
34
4
0
0
0
0
0
0
0
0
1
11
38
72
106
134
155
166
167
157
137
110
76
42
14
2
0
0
0
0
0
0
0
0
1
12
39
73
107
136
156
168
168
158
138
110
77
43
15
2
0
0
0
0
0
0
0
0
2
27
103
190
276
350
403
432
433
408
358
287
290
176
63
8
0
0
0
0
0
0
0
0
6
40
42
76
109
138
258
363
436
343
228
113
79
45
16
2
0
0
0
0
0
0
0
0
5
53
168
282
320
139
160
171
172
263
304
292
207
119
44
6
0
0
0
0
0
0
0
0
2
15
44
78
112
141
162
173
173
163
143
115
175
137
61
8
0
0
0
0
0
0
0
0
4
35
115
203
289
363
577
677
695
640
512
297
227
140
57
9
0
0
0
0
0
0
0
0
9
57
115
291
446
564
647
690
692
652
573
461
329
192
74
11
0
0
0
0
0
0
0
0
2
17
46
80
113
142
471
637
684
651
575
465
333
196
77
13
0
0
0
0
0
0
0
0
11
71
187
324
458
571
652
696
697
658
580
470
337
199
80
14
0
0
0
0
0
0
0
0
12
74
190
328
461
575
657
701
703
663
584
473
341
203
83
15
0
0
0
0
0
0
0
0
13
77
195
334
468
582
664
708
710
670
590
478
343
202
82
14
0
0
0
0
0
0
0
0
13
72
169
319
465
584
651
631
456
431
381
309
278
188
84
17
0
0
0
0
0
0
0
0
15
83
200
338
472
586
668
712
714
675
596
485
353
214
92
18
0
0
0
0
0
0
0
0
13
77
196
319
427
502
535
521
461
435
385
313
229
140
61
12
0
0
0
0
0
0
0
0
4
22
53
87
120
149
169
180
181
171
151
123
262
204
97
20
0
0
0
0
0
0
0
0
10
38
54
144
261
384
627
717
725
679
559
318
195
92
25
5
0
0
0
0
0
0
0
0
5
24
54
89
122
150
170
181
181
278
325
318
234
146
66
14
0
0
0
0
0
0
0
0
5
25
55
146
264
387
439
467
468
501
486
426
314
196
91
18
1
0
0
0
0
0
0
0
5
25
56
147
265
388
545
649
692
615
487
323
343
232
110
24
1
0
0
0
0
0
0
1
23
105
227
365
495
603
676
708
696
659
585
481
356
225
106
25
1
0
0
0
0
0
0
0
10
58
148
313
476
607
642
537
186
176
156
129
96
61
29
7
0
0
0
0
0
0
0
1
23
107
234
360
402
155
285
398
477
511
497
437
341
225
112
29
2
0
0
0
0
0
0
2
23
96
202
358
505
625
706
749
750
711
633
522
390
250
122
32
3
0
0
0
0
0
0
2
29
116
242
381
511
615
694
737
739
673
539
338
211
103
31
8
1
0
0
0
0
0
0
1
8
30
61
155
275
401
649
741
750
709
624
496
387
253
127
35
4
0
0
0
0
0
0
3
32
121
247
387
520
631
712
755
757
717
639
529
395
248
110
35
4
0
0
0
0
0
0
3
34
122
242
367
472
536
565
548
485
385
261
133
100
65
33
10
1
0
0
0
0
0
0
1
23
106
238
370
495
601
707
760
766
726
648
537
407
266
136
41
5
0
0
0
0
0
0
4
37
128
254
393
525
636
700
676
489
388
263
135
102
67
35
11
1
0
0
0
0
0
0
1
16
70
165
288
419
542
609
645
647
526
347
135
102
67
35
18
3
0
0
0
0
0
0
5
40
132
259
397
526
632
705
738
727
617
417
136
103
68
36
12
2
0
0
0
0
0
0
4
27
86
168
257
342
413
388
312
192
297
349
348
300
218
123
39
5
0
0
0
0
0
0
4
32
109
224
360
494
612
647
612
496
471
422
353
269
179
95
27
3
0
0
0
0
0
0
4
29
89
171
260
345
416
468
495
496
605
607
535
417
281
151
52
8
0
0
0
0
0
0
7
46
133
173
346
511
642
720
762
764
737
663
555
425
285
154
54
9
0
0
0
0
0
0
5
25
58
68
167
290
418
692
773
778
740
664
556
426
287
156
56
10
0
0
0
0
0
0
8
49
141
231
402
543
655
735
777
780
742
666
559
429
289
158
57
10
0
0
0
0
0
0
5
31
90
170
293
425
547
525
410
192
182
163
137
170
151
98
41
9
0
0
0
0
0
0
2
12
35
67
101
134
161
388
557
652
621
557
467
358
241
132
42
6
0
0
0
0
0
0
9
48
131
228
385
530
648
712
687
498
538
529
475
342
211
103
54
12
0
0
0
0
0
0
9
47
128
229
375
517
636
718
763
768
730
654
546
422
287
159
61
12
0
0
0
0
0
0
10
51
139
228
323
390
414
645
750
770
731
655
548
423
288
161
62
13
0
0
0
0
0
0
10
53
146
273
411
541
651
731
773
776
734
650
529
425
293
164
64
14
0
0
0
0
0
0
10
53
148
274
412
543
653
733
777
780
743
669
563
434
296
165
65
14
0
0
0
0
0
0
9
46
125
233
367
501
618
694
735
739
727
665
564
435
297
167
67
14
0
0
0
0
0
0
3
22
80
177
302
435
558
627
665
668
597
492
366
283
194
109
49
12
0
0
0
0
0
0
7
40
119
236
332
399
424
539
624
670
671
626
542
409
270
146
65
15
0
0
0
0
0
0
11
56
152
280
420
552
664
742
775
747
735
673
571
441
301
170
68
15
0
0
0
0
0
0
11
56
150
273
392
463
421
535
620
665
594
490
365
283
195
111
38
6
0
0
0
0
0
0
3
14
38
69
104
137
164
184
195
196
304
360
364
320
240
147
60
14
0
0
0
0
0
0
11
53
139
251
369
475
556
585
567
503
480
433
366
284
196
112
46
11
0
0
0
0
0
0
7
36
97
178
266
350
421
585
694
742
690
601
484
419
301
175
73
17
1
0
0
0
0
0
12
57
151
278
415
546
655
725
737
664
594
491
367
305
223
134
58
14
0
0
0
0
0
0
7
41
120
234
368
501
619
694
736
740
688
600
484
394
282
167
72
17
1
0
0
0
0
0
12
56
150
276
413
544
655
735
778
782
748
677
573
443
274
45
19
4
0
0
0
0
0
0
3
23
80
177
264
348
418
621
735
772
738
667
565
430
285
151
60
13
0
0
0
0
0
0
12
56
150
276
412
542
652
728
760
741
722
661
565
443
308
179
76
18
1
0
0
0
0
0
7
36
96
176
264
348
419
470
499
502
479
433
367
324
246
152
74
18
1
0
0
0
0
0
11
56
150
277
415
547
658
737
772
746
695
607
490
382
265
153
61
13
1
0
0
0
0
0
7
30
61
69
103
136
164
184
195
197
188
170
144
112
78
45
19
4
0
0
0
0
0
0
3
14
37
69
103
136
164
299
419
505
482
436
370
288
200
116
49
11
1
0
0
0
0
0
7
35
95
176
264
348
420
472
500
503
596
604
545
425
295
171
71
16
1
0
0
0
0
0
3
22
79
175
298
430
553
622
661
666
693
656
569
433
288
153
61
13
0
0
0
0
0
0
7
29
59
68
167
290
418
471
500
504
482
436
370
288
200
116
49
11
0
0
0
0
0
0
3
21
78
173
296
428
552
652
718
743
668
539
369
288
200
116
65
17
1
0
0
0
0
0
6
44
136
265
401
530
641
721
766
773
739
668
566
424
264
116
60
16
1
0
0
0
0
0
6
33
92
172
321
476
612
689
733
739
666
538
369
356
277
170
75
17
1
0
0
0
0
0
8
40
101
159
246
331
403
456
486
490
392
269
139
107
73
41
27
8
0
0
0
0
0
0
5
28
81
159
279
411
536
608
649
655
699
658
562
434
295
165
67
16
1
0
0
0
0
0
5
31
100
210
326
439
537
691
761
773
738
664
558
430
292
164
66
15
0
0
0
0
0
0
8
42
125
246
384
519
634
719
767
774
740
668
563
433
294
164
66
15
0
0
0
0
0
0
7
41
123
243
381
513
619
687
701
652
665
625
539
421
288
161
65
15
0
0
0
0
0
0
7
40
121
240
377
510
625
709
755
755
730
661
557
428
290
161
64
14
0
0
0
0
0
0
4
25
77
154
348
507
628
713
761
769
734
661
556
427
289
161
64
14
0
0
0
0
0
0
6
38
118
237
373
505
618
701
745
748
723
654
551
423
286
158
62
14
0
0
0
0
0
0
4
24
75
150
237
322
394
449
480
485
612
615
538
413
279
154
61
14
0
0
0
0
0
0
4
29
102
219
338
444
520
592
633
641
612
551
463
333
205
100
32
5
0
0
0
0
0
0
3
25
89
194
345
490
611
696
745
753
723
652
548
420
282
155
60
13
0
0
0
0
0
0
5
31
99
193
289
361
392
373
303
188
238
263
257
222
164
97
37
8
0
0
0
0
0
0
3
24
75
144
320
481
606
691
740
749
701
575
349
370
272
151
56
11
0
0
0
0
0
0
1
8
27
56
146
263
388
442
474
479
519
511
458
350
234
126
47
10
0
0
0
0
0
0
2
28
104
222
357
490
599
678
716
711
662
575
459
366
252
139
52
10
0
0
0
0
0
0
3
28
103
219
356
491
607
690
714
635
607
546
457
388
269
146
53
10
0
0
0
0
0
0
3
27
86
54
166
309
455
578
662
699
651
565
450
294
144
36
13
2
0
0
0
0
0
0
1
7
25
53
141
257
381
540
648
698
680
620
523
394
257
134
47
8
0
0
0
0
0
0
2
24
82
134
221
306
380
492
578
624
559
459
339
257
169
89
26
4
0
0
0
0
0
0
1
10
51
133
303
462
588
674
724
733
700
629
525
399
262
138
48
8
0
0
0
0
0
0
2
23
92
201
319
398
375
532
640
688
618
495
333
312
230
127
41
6
0
0
0
0
0
0
1
14
58
129
214
300
375
487
571
617
589
529
441
378
256
133
45
7
0
0
0
0
0
0
1
20
88
200
335
469
586
673
722
729
696
624
519
392
255
131
43
7
0
0
0
0
0
0
1
19
83
166
311
456
579
664
711
715
677
599
488
345
200
82
22
2
0
0
0
0
0
0
1
17
80
190
325
460
577
664
715
724
692
620
516
386
249
126
40
6
0
0
0
0
0
0
1
17
77
180
305
431
541
585
561
458
438
392
325
244
157
79
24
3
0
0
0
0
0
0
0
17
78
185
303
384
365
421
454
460
438
392
324
242
155
77
33
4
0
0
0
0
0
0
0
16
68
118
231
359
482
632
703
716
681
602
478
368
239
118
35
4
0
0
0
0
0
0
0
16
75
182
316
450
568
655
705
712
677
602
494
352
200
74
29
3
0
0
0
0
0
0
0
6
39
114
225
352
474
596
672
696
664
594
490
360
225
106
31
3
0
0
0
0
0
0
0
14
70
176
310
445
564
652
701
700
661
582
471
359
229
110
30
3
0
0
0
0
0
0
0
16
78
126
263
412
546
627
673
682
663
603
506
382
248
124
34
3
0
0
0
0
0
0
0
13
67
163
277
389
487
587
654
680
649
582
484
371
243
121
32
3
0
0
0
0
0
0
0
12
71
179
312
445
561
649
700
711
680
610
507
381
245
120
31
2
0
0
0
0
0
0
0
13
66
119
171
184
141
265
374
453
362
246
126
153
129
74
25
2
0
0
0
0
0
0
0
12
71
184
317
426
363
418
449
454
573
572
494
365
230
108
25
1
0
0
0
0
0
0
0
11
69
178
298
380
361
416
447
452
570
569
491
357
215
93
23
1
0
0
0
0
0
0
0
10
63
167
307
445
562
648
697
705
672
599
494
367
230
105
22
1
0
0
0
0
0
0
0
4
34
111
197
282
355
410
441
446
545
544
472
356
224
103
21
0
0
0
0
0
0
0
0
8
58
167
300
434
550
632
670
657
638
576
478
352
218
98
20
0
0
0
0
0
0
0
0
8
53
106
253
408
538
608
626
582
620
577
481
352
217
95
19
0
0
0
0
0
0
0
0
7
56
163
296
430
546
632
680
688
654
581
476
347
212
92
18
0
0
0
0
0
0
0
0
3
21
39
72
105
134
333
486
573
572
527
442
314
184
75
14
0
0
0
0
0
0
0
0
4
32
99
182
267
340
394
426
431
409
363
296
284
190
83
15
0
0
0
0
0
0
0
0
5
47
38
115
221
338
445
525
567
504
408
293
239
156
68
13
0
0
0
0
0
0
0
0
4
41
139
246
324
335
514
619
652
620
549
447
314
177
65
12
0
0
0
0
0
0
0
0
1
11
36
68
101
130
151
163
165
156
138
112
130
101
47
7
0
0
0
0
0
0
0
0
2
25
90
239
392
516
602
652
660
611
491
286
283
180
70
10
0
0
0
0
0
0
0
0
2
24
88
170
255
329
475
575
619
571
486
374
278
166
63
9
0
0
0
0
0
0
0
0
2
30
113
233
362
480
560
606
613
592
529
430
301
169
60
8
0
0
0
0
0
0
0
0
1
21
83
166
251
325
380
412
416
394
346
277
163
70
15
4
0
0
0
0
0
0
0
0
1
24
107
240
380
501
585
631
634
603
531
426
299
167
56
6
0
0
0
0
0
0
0
0
1
28
123
251
379
470
518
500
408
385
338
269
187
103
34
4
0
0
0
0
0
0
0
0
1
26
120
249
381
497
583
629
627
600
527
420
290
158
49
5
0
0
0
0
0
0
0
0
0
19
74
155
239
313
368
399
404
431
411
348
224
110
29
3
0
0
0
0
0
0
0
0
0
6
28
60
92
121
231
329
397
445
432
366
261
142
42
3
0
0
0
0
0
0
0
0
0
22
110
236
368
484
570
618
623
587
511
403
274
143
39
3
0
0
0
0
0
0
0
0
0
20
106
227
342
403
446
442
395
371
322
253
171
88
23
1
0
0
0
0
0
0
0
0
0
5
25
56
88
117
295
433
510
521
473
379
254
129
32
1
0
0
0
0
0
0
0
0
0
11
63
160
277
391
433
430
383
301
198
95
214
124
29
1
0
0
0
0
0
0
0
0
0
17
94
216
345
458
542
589
595
558
481
373
248
122
26
1
0
0
0
0
0
0
0
0
0
14
58
154
270
384
389
312
147
224
254
234
129
47
6
0
0
0
0
0
0
0
0
0
0
4
22
52
84
113
134
145
146
137
118
91
96
60
14
0
0
0
0
0
0
0
0
0
0
13
54
131
213
285
420
511
548
499
414
303
183
78
13
0
0
0
0
0
0
0
0
0
0
8
52
129
211
284
338
367
370
345
296
226
145
66
12
0
0
0
0
0
0
0
0
0
0
10
50
126
208
281
335
364
367
342
293
223
141
63
11
0
0
0
0
0
0
0
0
0
0
10
75
188
285
278
332
361
364
384
358
290
183
79
13
0
0
0
0
0
0
0
0
0
0
6
46
136
250
362
406
405
361
336
286
216
134
57
9
0
0
0
0
0
0
0
0
0
0
5
44
117
198
269
365
436
469
408
317
210
108
34
3
0
0
0
0
0
0
0
0
0
0
7
61
169
288
394
444
432
350
325
275
205
142
62
9
0
0
0
0
0
0
0
0
0
0
4
39
138
266
388
466
508
511
461
375
266
169
68
9
0
0
0
0
0
0
0
0
0
0
2
15
69
157
259
311
340
342
316
267
197
118
44
5
0
0
0
0
0
0
0
0
0
0
5
55
166
288
395
479
525
529
482
387
255
168
63
7
0
0
0
0
0
0
0
0
0
0
3
44
129
208
255
307
334
335
309
259
189
110
38
4
0
0
0
0
0
0
0
0
0
0
3
31
101
180
250
302
330
332
346
316
246
154
53
5
0
0
0
0
0
0
0
0
0
0
2
11
121
264
383
463
505
504
467
391
284
161
51
4
0
0
0
0
0
0
0
0
0
0
3
43
151
274
384
465
508
509
466
385
275
156
47
3
0
0
0
0
0
0
0
0
0
0
2
40
146
268
378
458
501
501
460
380
271
150
43
3
0
0
0
0
0
0
0
0
0
0
2
24
102
207
312
380
416
416
382
315
224
122
33
2
0
0
0
0
0
0
0
0
0
0
1
22
73
104
91
322
448
480
435
353
244
123
28
1
0
0
0
0
0
0
0
0
0
0
0
8
33
63
89
109
119
119
177
191
160
85
20
1
0
0
0
0
0
0
0
0
0
0
0
25
102
180
228
315
378
403
368
301
209
121
28
1
0
0
0
0
0
0
0
0
0
0
0
23
106
206
297
364
399
399
363
295
204
104
22
0
0
0
0
0
0
0
0
0
0
0
0
17
65
97
86
106
116
115
105
85
59
29
6
0
0
0
0
0
0
0
0
0
0
0
0
6
29
59
85
105
115
115
224
245
194
92
18
0
0
0
0
0
0
0
0
0
0
0
0
20
90
167
215
301
361
384
326
240
143
69
13
0
0
0
0
0
0
0
0
0
0
0
0
14
71
144
212
219
182
112
101
81
54
25
5
0
0
0
0
0
0
0
0
0
0
0
0
13
77
176
277
342
376
374
367
307
209
97
17
0
0
0
0
0
0
0
0
0
0
0
0
19
103
217
321
394
415
371
286
168
52
49
11
0
0
0
0
0
0
0
0
0
0
0
0
11
63
135
201
208
174
106
244
256
186
79
12
0
0
0
0
0
0
0
0
0
0
0
0
4
38
109
196
277
333
354
317
250
162
72
11
0
0
0
0
0
0
0
0
0
0
0
0
9
72
178
286
358
394
392
351
275
176
65
6
0
0
0
0
0
0
0
0
0
0
0
0
13
83
192
294
371
412
410
367
286
180
70
8
0
0
0
0
0
0
0
0
0
0
0
0
7
59
151
247
291
294
258
229
178
111
42
5
0
0
0
0
0
0
0
0
0
0
0
0
3
31
98
182
193
162
99
88
68
42
15
1
0
0
0
0
0
0
0
0
0
0
0
0
9
73
180
281
356
394
390
345
261
153
48
3
0
0
0
0
0
0
0
0
0
0
0
0
8
70
176
277
352
389
386
341
261
156
52
4
0
0
0
0
0
0
0
0
0
0
0
0
5
39
91
128
139
125
93
82
62
37
12
1
0
0
0
0
0
0
0
0
0
0
0
0
4
33
67
66
84
93
91
80
61
35
11
1
0
0
0
0
0
0
0
0
0
0
0
0
4
31
65
64
82
91
90
128
126
87
25
1
0
0
0
0
0
0
0
0
0
0
0
0
1
14
39
63
81
90
88
77
58
33
9
0
0
0
0
0
0
0
0
0
0
0
0
0
2
46
147
245
317
353
349
305
227
127
32
1
0
0
0
0
0
0
0
0
0
0
0
0
1
12
37
60
127
185
218
215
174
102
28
0
0
0
0
0
0
0
0
0
0
0
0
0
2
40
114
153
199
222
218
189
139
75
18
0
0
0
0
0
0
0
0
0
0
0
0
0
2
35
116
195
238
242
210
182
133
71
22
0
0
0
0
0
0
0
0
0
0
0
0
0
1
38
133
226
295
329
324
280
203
106
24
0
0
0
0
0
0
0
0
0
0
0
0
0
0
14
69
141
266
320
318
275
199
103
22
0
0
0
0
0
0
0
0
0
0
0
0
0
1
33
125
219
290
325
320
276
197
99
20
0
0
0
0
0
0
0
0
0
0
0
0
0
0
32
122
216
287
322
315
271
192
94
18
0
0
0
0
0
0
0
0
0
0
0
0
0
0
30
117
210
279
314
308
263
185
89
16
0
0
0
0
0
0
0
0
0
0
0
0
0
0
28
111
201
269
303
297
253
176
83
14
0
0
0
0
0
0
0
0
0
0
0
0
0
0
25
106
196
263
296
290
246
169
76
12
0
0
0
0
0
0
0
0
0
0
0
0
0
0
15
65
121
217
273
279
239
164
73
11
0
0
0
0
0
0
0
0
0
0
0
0
0
0
5
24
46
62
71
69
58
39
17
2
0
0
0
0
0
0
0
0
0
0
0
0
0
0
5
23
45
61
69
67
56
38
16
2
0
0
0
0
0
0
0
0
0
0
0
0
0
0
4
22
43
59
67
65
55
36
15
3
0
0
0
0
0
0
0
0
0
0
0
0
0
0
4
21
42
58
66
64
87
75
35
3
0
0
0
0
0
0
0
0
0
0
0
0
0
0
8
32
41
57
64
63
52
34
13
1
0
0
0
0
0
0
0
0
0
0
0
0
0
0
3
19
39
90
134
157
129
83
30
2
0
0
0
0
0
0
0
0
0
0
0
0
0
0
3
18
38
88
132
154
126
81
28
2
0
0
0
0
0
0
0
0
0
0
0
0
0
0
2
17
37
85
129
150
123
77
25
1
0
0
0
0
0
0
0
0
0
0
0
0
0
0
3
33
91
148
187
194
169
110
36
1
0
0
0
0
0
0
0
0
0
0
0
0
0
0
2
15
35
50
58
56
46
28
9
0
0
0
0
0
0
0
0
0
0
0
0
0
0
0
3
31
88
107
93
56
161
111
35
1
0
0
0
0
0
0
0
0
0
0
0
0
0
0
1
14
33
49
56
55
113
91
31
0
0
0
0
0
0
0
0
0
0
0
0
0
0
0
2
37
109
161
186
181
146
87
26
0
0
0
0
0
0
0
0
0
0
0
0
0
0
0
4
47
124
184
210
197
158
93
27
0
0
0
0
0
0
0
0
0
0
0
0
0
0
0
3
39
101
152
177
172
144
87
25
0
0
0
0
0
0
0
0
0
0
0
0
0
0
0
2
39
74
166
205
199
158
90
23
0
0
0
0
0
0
0
0
0
0
0
0
0
0
0
1
25
71
109
128
124
82
35
6
0
0
0
0
0
0
0
0
0
0
0
0
0
0
0
1
37
107
167
197
191
151
84
20
0
0
0
0
0
0
0
0
0
0
0
0
0
0
0
0
30
88
138
163
158
116
58
12
0
0
0
0
0
0
0
0
0
0
0
0
0
0
0
0
8
25
85
137
155
139
77
17
0
0
0
0
0
0
0
0
0
0
0
0
0
0
0
0
22
80
140
175
173
133
69
14
0
0
0
0
0
0
0
0
0
0
0
0
0
0
0
0
7
23
37
44
43
33
17
3
0
0
0
0
0
0
0
0
0
0
0
0
0
0
0
0
20
55
92
110
107
69
27
3
0
0
0
0
0
0
0
0
0
0
0
0
0
0
0
0
11
53
89
108
104
80
40
7
0
0
0
0
0
0
0
0
0
0
0
0
0
0
0
0
11
51
72
66
40
30
15
2
0
0
0
0
0
0
0
0
0
0
0
0
0
0
0
0
5
19
33
40
39
29
14
2
0
0
0
0
0
0
0
0
0
0
0
0
0
0
0
0
4
18
31
38
37
28
13
2
0
0
0
0
0
0
0
0
0
0
0
0
0
0
0
0
16
68
123
152
147
110
50
6
0
0
0
0
0
0
0
0
0
0
0
0
0
0
0
0
3
16
30
37
35
26
12
1
0
0
0
0
0
0
0
0
0
0
0
0
0
0
0
0
7
39
73
91
88
65
29
3
0
0
0
0
0
0
0
0
0
0
0
0
0
0
0
0
3
15
28
35
34
25
11
1
0
0
0
0
0
0
0
0
0
0
0
0
0
0
0
0
2
14
44
73
84
52
17
1
0
0
0
0
0
0
0
0
0
0
0
0
0
0
0
0
2
13
26
33
32
23
10
1
0
0
0
0
0
0
0
0
0
0
0
0
0
0
0
0
2
12
41
69
80
65
31
2
0
0
0
0
0
0
0
0
0
0
0
0
0
0
0
0
4
30
63
81
79
47
15
0
0
0
0
0
0
0
0
0
0
0
0
0
0
0
0
0
1
11
24
31
30
21
9
0
0
0
0
0
0
0
0
0
0
0
0
0
0
0
0
0
1
11
23
30
29
21
9
0
0
0
0
0
0
0
0
0
0
0
0
0
0
0
0
0
1
10
22
29
29
59
31
1
0
0
0
0
0
0
0
0
0
0
0
0
0
0
0
0
1
10
22
29
28
20
8
0
0
0
0
0
0
0
0
0
0
0
0
0
0
0
0
0
2
38
84
112
109
77
31
0
0
0
0
0
0
0
0
0
0
0
0
0
0
0
0
0
0
8
18
24
24
16
6
0
0
0
0
0
0
0
0
0
0
0
0
0
0
0
0
0
0
7
17
24
23
16
6
0
0
0
0
0
0
0
0
0
0
0
0
0
0
0
0
0
1
17
37
44
33
15
6
0
0
0
0
0
0
0
0
0
0
0
0
0
0
0
0
0
0
6
16
22
22
15
5
0
0
0
0
0
0
0
0
0
0
0
0
0
0
0
0
0
0
24
61
88
86
57
21
0
0
0
0
0
0
0
0
0
0
0
0
0
0
0
0
0
0
23
60
86
83
54
19
0
0
0
0
0
0
0
0
0
0
0
0
0
0
0
0
0
0
6
14
21
21
14
5
0
0
0
0
0
0
0
0
0
0
0
0
0
0
0
0
0
0
21
56
83
82
54
19
0
0
0
0
0
0
0
0
0
0
0
0
0
0
0
0
0
0
20
55
81
81
52
16
0
0
0
0
0
0
0
0
0
0
0
0
0
0
0
0
0
0
18
48
64
51
28
7
0
0
0
0
0
0
0
0
0
0
0
0
0
0
0
0
0
0
5
13
20
19
13
4
0
0
0
0
0
0
0
0
0
0
0
0
0
0
0
0
0
0
17
51
77
77
51
17
0
0
0
0
0
0
0
0
0
0
0
0
0
0
0
0
0
0
17
50
77
77
50
17
0
0
0
0
0
0
0
0
0
0
0
0
0
0
0
0
0
0
4
31
65
72
42
11
0
0
0
0
0
0
0
0
0
0
0
0
0
0
0
0
0
0
10
30
47
48
26
7
0
0
0
0
0
0
0
0
0
0
0
0
0
0
0
0
0
0
4
11
18
18
12
4
0
0
0
0
0
0
0
0
0
0
0
0
0
0
0
0
0
0
9
40
70
73
48
16
0
0
0
0
0
0
0
0
0
0
0
0
0
0
0
0
0
0
3
11
18
18
19
9
0
0
0
0
0
0
0
0
0
0
0
0
0
0
0
0
0
0
3
11
17
18
12
4
0
0
0
0
0
0
0
0
0
0
0
0
0
0
0
0
0
0
11
43
71
73
48
16
0
0
0
0
0
0
0
0
0
0
0
0
0
0
0
0
0
0
8
27
45
46
30
10
0
0
0
0
0
0
0
0
0
0
0
0
0
0
0
0
0
0
3
27
59
68
47
17
0
0
0
0
0
0
0
0
0
0
0
0
0
0
0
0
0
0
3
11
18
18
12
4
0
0
0
0
0
0
0
0
0
0
0
0
0
0
0
0
0
0
3
11
18
18
20
9
0
0
0
0
0
0
0
0
0
0
0
0
0
0
0
0
0
0
7
27
45
47
31
11
0
0
0
0
0
0
0
0
0
0
0
0
0
0
0
0
0
0
3
11
18
18
20
10
0
0
0
0
0
0
0
0
0
0
0
0
0
0
0
0
0
0
11
42
72
75
50
17
0
0
0
0
0
0
0
0
0
0
0
0
0
0
0
0
0
0
7
23
29
19
13
5
0
0
0
0
0
0
0
0
0
0
0
0
0
0
0
0
0
0
3
11
18
19
13
5
0
0
0
0
0
0
0
0
0
0
0
0
0
0
0
0
0
0
3
11
18
19
13
5
0
0
0
0
0
0
0
0
0
0
0
0
0
0
0
0
0
0
3
11
18
19
14
5
0
0
0
0
0
0
0
0
0