last-generated=2020-09-28
statistics-initialization=
{
  "nonlinear": "0, 1, 0, 1",
  "numerical Jacobians": "0"
}
statistics-simulation=
{
  "linear": "0, 0, 0, 0, 0, 0, 0, 0, 0, 0, 0, 0, 0, 0, 0, 0, 0, 0, 0, 0, 0, 0, 0, 0, 0, 0, 0,   0, 0, 0, 0, 0, 0, 0, 0, 0, 0, 0, 0, 0, 0, 0, 0, 0, 0, 0, 0, 0, 0, 0, 0, 0, 0,   0, 0, 0, 0, 0, 0, 0, 0, 0, 0, 0, 0, 0, 0, 0, 0, 0, 0, 0, 0, 0, 0, 0, 0, 0, 0,   0, 0, 0, 0, 0, 0, 0, 0, 0, 0, 0, 0, 0, 0, 0, 0, 0, 0, 0, 0, 0, 0, 0, 0, 0, 0,   0, 0, 0, 0, 0, 0, 0, 0, 0, 0, 0, 0, 0, 0, 0, 0, 0, 0, 0, 0, 0, 0, 0, 0, 0, 0,   0, 0, 0, 0, 0, 0, 0, 0, 0, 0, 0, 0, 0, 0, 0, 0, 0, 0, 0, 0, 0, 0, 0, 0, 0, 0,   0, 0, 0, 0, 0, 0, 0, 0, 0, 0, 0, 0, 0, 0, 0, 0, 0, 0, 0, 0, 0, 0, 0, 0, 0, 0,   0, 0, 0, 0, 0, 0, 0, 0, 0, 0, 0, 0, 0, 0, 0, 0",
  "nonlinear": "9, 8, 7, 8, 7, 8, 9, 8, 9, 8, 10",
  "number of continuous time states": "229",
  "numerical Jacobians": "0"
}
time=[0e+00, 2.592e+07]
totalHeatLoad=[4.72944482421875e+03, 5.441392578125e+03, 5.72725927734375e+03, 5.80738330078125e+03, 5.8403251953125e+03, 5.85606591796875e+03, 5.864048828125e+03, 5.86818701171875e+03, 5.870373046875e+03, 5.87152294921875e+03, 5.87214111328125e+03, 5.87248974609375e+03, 5.872669921875e+03, 5.8727607421875e+03, 5.87281103515625e+03, 5.87283740234375e+03, 5.872849609375e+03, 5.87285888671875e+03, 5.87286279296875e+03, 5.87286376953125e+03, 5.87286474609375e+03, 5.87286572265625e+03, 5.8728662109375e+03, 5.8728662109375e+03, 5.8728662109375e+03, 5.87286669921875e+03, 5.87286669921875e+03, 5.8728671875e+03, 5.8728671875e+03, 5.8728671875e+03, 5.8728671875e+03, 5.8728671875e+03, 5.8728671875e+03, 5.8728671875e+03, 5.8728671875e+03, 5.8728671875e+03, 5.8728671875e+03, 5.8728671875e+03, 5.8728671875e+03, 5.8728671875e+03, 5.8728671875e+03, 5.8728671875e+03, 5.8728671875e+03, 5.8728671875e+03, 5.8728671875e+03, 5.8728671875e+03, 5.8728671875e+03, 5.8728671875e+03, 5.8728671875e+03, 5.8728671875e+03, 5.8728671875e+03, 5.8728671875e+03, 5.8728671875e+03, 5.8728671875e+03, 5.8728671875e+03, 5.8728671875e+03, 5.8728671875e+03, 5.8728671875e+03, 5.8728671875e+03, 5.8728671875e+03, 5.8728671875e+03, 5.8728671875e+03, 5.8728671875e+03, 5.8728671875e+03, 5.8728671875e+03, 5.8728671875e+03, 5.8728671875e+03, 5.8728671875e+03, 5.8728671875e+03, 5.8728671875e+03, 5.8728671875e+03, 5.8728671875e+03, 5.8728671875e+03, 5.8728671875e+03, 5.8728671875e+03, 5.8728671875e+03, 5.8728671875e+03, 5.8728671875e+03, 5.8728671875e+03, 5.8728671875e+03, 5.8728671875e+03, 5.8728671875e+03, 5.8728671875e+03, 5.8728671875e+03, 5.8728671875e+03, 5.8728671875e+03, 5.8728671875e+03, 5.8728671875e+03, 5.8728671875e+03, 5.8728671875e+03, 5.8728671875e+03, 5.8728671875e+03, 5.8728671875e+03, 5.8728671875e+03, 5.8728671875e+03, 5.8728671875e+03, 5.8728671875e+03, 5.8728671875e+03, 5.8728671875e+03, 5.8728671875e+03, 5.8728671875e+03]
roomHeatLoads[1]=[1.091540771484375e+03, 1.060584228515625e+03, 1.098244018554688e+03, 1.111495483398438e+03, 1.117881591796875e+03, 1.121241088867188e+03, 1.123042236328125e+03, 1.124012573242188e+03, 1.124536376953125e+03, 1.12481787109375e+03, 1.124970825195312e+03, 1.125055786132812e+03, 1.125100952148438e+03, 1.125124145507812e+03, 1.125137084960938e+03, 1.12514404296875e+03, 1.125147094726562e+03, 1.125149169921875e+03, 1.125150146484375e+03, 1.125150390625e+03, 1.125150634765625e+03, 1.12515087890625e+03, 1.12515087890625e+03, 1.125151000976562e+03, 1.125151000976562e+03, 1.125151123046875e+03, 1.125151123046875e+03, 1.125151123046875e+03, 1.125151245117188e+03, 1.125151245117188e+03, 1.125151245117188e+03, 1.125151245117188e+03, 1.125151245117188e+03, 1.125151245117188e+03, 1.125151245117188e+03, 1.125151245117188e+03, 1.125151245117188e+03, 1.125151245117188e+03, 1.125151245117188e+03, 1.125151245117188e+03, 1.125151245117188e+03, 1.125151245117188e+03, 1.125151245117188e+03, 1.125151245117188e+03, 1.125151245117188e+03, 1.125151245117188e+03, 1.125151245117188e+03, 1.125151245117188e+03, 1.125151245117188e+03, 1.125151245117188e+03, 1.125151245117188e+03, 1.125151245117188e+03, 1.125151245117188e+03, 1.125151245117188e+03, 1.125151245117188e+03, 1.125151245117188e+03, 1.125151245117188e+03, 1.125151245117188e+03, 1.125151245117188e+03, 1.125151245117188e+03, 1.125151245117188e+03, 1.125151245117188e+03, 1.125151245117188e+03, 1.125151245117188e+03, 1.125151245117188e+03, 1.125151245117188e+03, 1.125151245117188e+03, 1.125151245117188e+03, 1.125151245117188e+03, 1.125151245117188e+03, 1.125151245117188e+03, 1.125151245117188e+03, 1.125151245117188e+03, 1.125151245117188e+03, 1.125151245117188e+03, 1.125151245117188e+03, 1.125151245117188e+03, 1.125151245117188e+03, 1.125151245117188e+03, 1.125151245117188e+03, 1.125151245117188e+03, 1.125151245117188e+03, 1.125151245117188e+03, 1.125151245117188e+03, 1.125151245117188e+03, 1.125151245117188e+03, 1.125151245117188e+03, 1.125151245117188e+03, 1.125151245117188e+03, 1.125151245117188e+03, 1.125151245117188e+03, 1.125151245117188e+03, 1.125151245117188e+03, 1.125151245117188e+03, 1.125151245117188e+03, 1.125151245117188e+03, 1.125151245117188e+03, 1.125151245117188e+03, 1.125151245117188e+03, 1.125151245117188e+03, 1.125151245117188e+03]
roomHeatLoads[2]=[4.780010681152344e+02, 5.242488403320312e+02, 5.539837646484375e+02, 5.626618041992188e+02, 5.665807495117188e+02, 5.686080932617188e+02, 5.69692138671875e+02, 5.702734375e+02, 5.705868530273438e+02, 5.707543334960938e+02, 5.708450317382812e+02, 5.708959350585938e+02, 5.70922607421875e+02, 5.709362182617188e+02, 5.709437255859375e+02, 5.7094775390625e+02, 5.709495849609375e+02, 5.709508666992188e+02, 5.70951416015625e+02, 5.709515991210938e+02, 5.709517211914062e+02, 5.709518432617188e+02, 5.70951904296875e+02, 5.70951904296875e+02, 5.709519653320312e+02, 5.709519653320312e+02, 5.709520263671875e+02, 5.709520263671875e+02, 5.709520874023438e+02, 5.709520874023438e+02, 5.709520874023438e+02, 5.709520874023438e+02, 5.709520874023438e+02, 5.709520874023438e+02, 5.709520874023438e+02, 5.709520874023438e+02, 5.709520874023438e+02, 5.709520874023438e+02, 5.709520874023438e+02, 5.709520874023438e+02, 5.709520874023438e+02, 5.709520874023438e+02, 5.709520874023438e+02, 5.709520874023438e+02, 5.709520874023438e+02, 5.709520874023438e+02, 5.709520874023438e+02, 5.709520874023438e+02, 5.709520874023438e+02, 5.709520874023438e+02, 5.709520874023438e+02, 5.709520874023438e+02, 5.709520874023438e+02, 5.709520874023438e+02, 5.709520874023438e+02, 5.709520874023438e+02, 5.709520874023438e+02, 5.709520874023438e+02, 5.709520874023438e+02, 5.709520874023438e+02, 5.709520874023438e+02, 5.709520874023438e+02, 5.709520874023438e+02, 5.709520874023438e+02, 5.709520874023438e+02, 5.709520874023438e+02, 5.709520874023438e+02, 5.709520874023438e+02, 5.709520874023438e+02, 5.709520874023438e+02, 5.709520874023438e+02, 5.709520874023438e+02, 5.709520874023438e+02, 5.709520874023438e+02, 5.709520874023438e+02, 5.709520874023438e+02, 5.709520874023438e+02, 5.709520874023438e+02, 5.709520874023438e+02, 5.709520874023438e+02, 5.709520874023438e+02, 5.709520874023438e+02, 5.709520874023438e+02, 5.709520874023438e+02, 5.709520874023438e+02, 5.709520874023438e+02, 5.709520874023438e+02, 5.709520874023438e+02, 5.709520874023438e+02, 5.709520874023438e+02, 5.709520874023438e+02, 5.709520874023438e+02, 5.709520874023438e+02, 5.709520874023438e+02, 5.709520874023438e+02, 5.709520874023438e+02, 5.709520874023438e+02, 5.709520874023438e+02, 5.709520874023438e+02, 5.709520874023438e+02, 5.709520874023438e+02]
roomHeatLoads[3]=[-4.256495971679688e+02, 1.487026786804199e+01, 5.443857574462891e+01, 6.695388031005859e+01, 7.259367370605469e+01, 7.546007537841797e+01, 7.697066497802734e+01, 7.777073669433594e+01, 7.819717407226562e+01, 7.842274475097656e+01, 7.854355621337891e+01, 7.861061096191406e+01, 7.864540100097656e+01, 7.866290283203125e+01, 7.86724853515625e+01, 7.867756652832031e+01, 7.867978668212891e+01, 7.868134307861328e+01, 7.868202209472656e+01, 7.868221282958984e+01, 7.868240356445312e+01, 7.868256378173828e+01, 7.868260192871094e+01, 7.868264007568359e+01, 7.868267822265625e+01, 7.868271636962891e+01, 7.868274688720703e+01, 7.868278503417969e+01, 7.868279266357422e+01, 7.868279266357422e+01, 7.868280029296875e+01, 7.868280029296875e+01, 7.868280792236328e+01, 7.868280792236328e+01, 7.868281555175781e+01, 7.868282318115234e+01, 7.868282318115234e+01, 7.868283081054688e+01, 7.868283081054688e+01, 7.868283843994141e+01, 7.868283843994141e+01, 7.868283843994141e+01, 7.868283843994141e+01, 7.868283843994141e+01, 7.868283843994141e+01, 7.868283843994141e+01, 7.868283843994141e+01, 7.868283843994141e+01, 7.868283843994141e+01, 7.868283843994141e+01, 7.868283843994141e+01, 7.868283843994141e+01, 7.868283843994141e+01, 7.868283843994141e+01, 7.868283843994141e+01, 7.868283843994141e+01, 7.868283843994141e+01, 7.868283843994141e+01, 7.868284606933594e+01, 7.868284606933594e+01, 7.868284606933594e+01, 7.868284606933594e+01, 7.868284606933594e+01, 7.868284606933594e+01, 7.868284606933594e+01, 7.868284606933594e+01, 7.868284606933594e+01, 7.868284606933594e+01, 7.868284606933594e+01, 7.868284606933594e+01, 7.868284606933594e+01, 7.868284606933594e+01, 7.868284606933594e+01, 7.868284606933594e+01, 7.868284606933594e+01, 7.868284606933594e+01, 7.868284606933594e+01, 7.868284606933594e+01, 7.868284606933594e+01, 7.868284606933594e+01, 7.868284606933594e+01, 7.868284606933594e+01, 7.868284606933594e+01, 7.868284606933594e+01, 7.868284606933594e+01, 7.868284606933594e+01, 7.868284606933594e+01, 7.868284606933594e+01, 7.868284606933594e+01, 7.868284606933594e+01, 7.868284606933594e+01, 7.868284606933594e+01, 7.868284606933594e+01, 7.868284606933594e+01, 7.868284606933594e+01, 7.868284606933594e+01, 7.868284606933594e+01, 7.868284606933594e+01, 7.868284606933594e+01, 7.868284606933594e+01, 7.868284606933594e+01]
roomHeatLoads[4]=[6.330464477539062e+02, 6.387735595703125e+02, 6.642230834960938e+02, 6.724182739257812e+02, 6.762338256835938e+02, 6.78220703125e+02, 6.792820434570312e+02, 6.798509521484375e+02, 6.801571655273438e+02, 6.803206176757812e+02, 6.804091186523438e+02, 6.804586181640625e+02, 6.804844970703125e+02, 6.804976806640625e+02, 6.805050048828125e+02, 6.805089111328125e+02, 6.805106811523438e+02, 6.805118408203125e+02, 6.805123901367188e+02, 6.805125122070312e+02, 6.805126953125e+02, 6.805128173828125e+02, 6.805128173828125e+02, 6.805128784179688e+02, 6.805128784179688e+02, 6.80512939453125e+02, 6.80512939453125e+02, 6.805130004882812e+02, 6.805130004882812e+02, 6.805130004882812e+02, 6.805130004882812e+02, 6.805130004882812e+02, 6.805130004882812e+02, 6.805130004882812e+02, 6.805130004882812e+02, 6.805130004882812e+02, 6.805130004882812e+02, 6.805130004882812e+02, 6.805130615234375e+02, 6.805130615234375e+02, 6.805130615234375e+02, 6.805130615234375e+02, 6.805130615234375e+02, 6.805130615234375e+02, 6.805130615234375e+02, 6.805130615234375e+02, 6.805130615234375e+02, 6.805130615234375e+02, 6.805130615234375e+02, 6.805130615234375e+02, 6.805130615234375e+02, 6.805130615234375e+02, 6.805130615234375e+02, 6.805130615234375e+02, 6.805130615234375e+02, 6.805130615234375e+02, 6.805130615234375e+02, 6.805130615234375e+02, 6.805130615234375e+02, 6.805130615234375e+02, 6.805130615234375e+02, 6.805130615234375e+02, 6.805130615234375e+02, 6.805130615234375e+02, 6.805130615234375e+02, 6.805130615234375e+02, 6.805130615234375e+02, 6.805130615234375e+02, 6.805130615234375e+02, 6.805130615234375e+02, 6.805130615234375e+02, 6.805130615234375e+02, 6.805130615234375e+02, 6.805130615234375e+02, 6.805130615234375e+02, 6.805130615234375e+02, 6.805130615234375e+02, 6.805130615234375e+02, 6.805130615234375e+02, 6.805130615234375e+02, 6.805130615234375e+02, 6.805130615234375e+02, 6.805130615234375e+02, 6.805130615234375e+02, 6.805130615234375e+02, 6.805130615234375e+02, 6.805130615234375e+02, 6.805130615234375e+02, 6.805130615234375e+02, 6.805130615234375e+02, 6.805130615234375e+02, 6.805130615234375e+02, 6.805130615234375e+02, 6.805130615234375e+02, 6.805130615234375e+02, 6.805130615234375e+02, 6.805130615234375e+02, 6.805130615234375e+02, 6.805130615234375e+02, 6.805130615234375e+02, 6.805130615234375e+02]
roomHeatLoads[5]=[7.749559326171875e+02, 7.532045288085938e+02, 7.870492553710938e+02, 7.9842333984375e+02, 8.037901000976562e+02, 8.065953979492188e+02, 8.080965576171875e+02, 8.089035034179688e+02, 8.093388671875e+02, 8.09572265625e+02, 8.096989135742188e+02, 8.097696533203125e+02, 8.098069458007812e+02, 8.098261108398438e+02, 8.098367309570312e+02, 8.098424682617188e+02, 8.098450317382812e+02, 8.098467407226562e+02, 8.098475341796875e+02, 8.098477172851562e+02, 8.098479614257812e+02, 8.0984814453125e+02, 8.098482055664062e+02, 8.098482055664062e+02, 8.098482666015625e+02, 8.098483276367188e+02, 8.09848388671875e+02, 8.09848388671875e+02, 8.09848388671875e+02, 8.098484497070312e+02, 8.098484497070312e+02, 8.098484497070312e+02, 8.098484497070312e+02, 8.098484497070312e+02, 8.098484497070312e+02, 8.098484497070312e+02, 8.098484497070312e+02, 8.098484497070312e+02, 8.098484497070312e+02, 8.098484497070312e+02, 8.098484497070312e+02, 8.098484497070312e+02, 8.098484497070312e+02, 8.098484497070312e+02, 8.098484497070312e+02, 8.098484497070312e+02, 8.098484497070312e+02, 8.098484497070312e+02, 8.098484497070312e+02, 8.098484497070312e+02, 8.098484497070312e+02, 8.098484497070312e+02, 8.098484497070312e+02, 8.098484497070312e+02, 8.098484497070312e+02, 8.098484497070312e+02, 8.098484497070312e+02, 8.098484497070312e+02, 8.098484497070312e+02, 8.098484497070312e+02, 8.098484497070312e+02, 8.098484497070312e+02, 8.098484497070312e+02, 8.098485107421875e+02, 8.098485107421875e+02, 8.098485107421875e+02, 8.098485107421875e+02, 8.098485107421875e+02, 8.098485107421875e+02, 8.098485107421875e+02, 8.098485107421875e+02, 8.098485107421875e+02, 8.098485107421875e+02, 8.098485107421875e+02, 8.098485107421875e+02, 8.098485107421875e+02, 8.098485107421875e+02, 8.098485107421875e+02, 8.098485107421875e+02, 8.098485107421875e+02, 8.098485107421875e+02, 8.098485107421875e+02, 8.098485107421875e+02, 8.098484497070312e+02, 8.098484497070312e+02, 8.098484497070312e+02, 8.098484497070312e+02, 8.098484497070312e+02, 8.098484497070312e+02, 8.098484497070312e+02, 8.098484497070312e+02, 8.098484497070312e+02, 8.098484497070312e+02, 8.098484497070312e+02, 8.098484497070312e+02, 8.098484497070312e+02, 8.098484497070312e+02, 8.098484497070312e+02, 8.098484497070312e+02, 8.098484497070312e+02, 8.098484497070312e+02]
roomHeatLoads[6]=[7.297745971679688e+02, 7.5100927734375e+02, 7.829683227539062e+02, 7.899723510742188e+02, 7.920858764648438e+02, 7.928165893554688e+02, 7.930925903320312e+02, 7.932030029296875e+02, 7.9325146484375e+02, 7.932723388671875e+02, 7.9328271484375e+02, 7.9328955078125e+02, 7.932922973632812e+02, 7.932933959960938e+02, 7.932940673828125e+02, 7.93294189453125e+02, 7.932944946289062e+02, 7.932947387695312e+02, 7.932948608398438e+02, 7.93294921875e+02, 7.93294921875e+02, 7.932949829101562e+02, 7.932949829101562e+02, 7.932949829101562e+02, 7.932949829101562e+02, 7.932949829101562e+02, 7.932949829101562e+02, 7.932949829101562e+02, 7.932949829101562e+02, 7.932949829101562e+02, 7.932949829101562e+02, 7.932949829101562e+02, 7.932949829101562e+02, 7.932949829101562e+02, 7.932949829101562e+02, 7.932949829101562e+02, 7.932949829101562e+02, 7.932949829101562e+02, 7.932949829101562e+02, 7.932949829101562e+02, 7.932949829101562e+02, 7.932949829101562e+02, 7.932949829101562e+02, 7.932949829101562e+02, 7.932949829101562e+02, 7.932949829101562e+02, 7.932949829101562e+02, 7.932949829101562e+02, 7.932949829101562e+02, 7.932949829101562e+02, 7.932949829101562e+02, 7.932949829101562e+02, 7.932949829101562e+02, 7.932949829101562e+02, 7.932949829101562e+02, 7.932949829101562e+02, 7.932949829101562e+02, 7.932949829101562e+02, 7.932949829101562e+02, 7.932949829101562e+02, 7.932949829101562e+02, 7.932949829101562e+02, 7.932949829101562e+02, 7.932949829101562e+02, 7.932949829101562e+02, 7.932949829101562e+02, 7.932949829101562e+02, 7.932949829101562e+02, 7.932949829101562e+02, 7.932949829101562e+02, 7.932949829101562e+02, 7.932949829101562e+02, 7.932949829101562e+02, 7.932949829101562e+02, 7.932949829101562e+02, 7.932949829101562e+02, 7.932949829101562e+02, 7.932949829101562e+02, 7.932949829101562e+02, 7.932949829101562e+02, 7.932949829101562e+02, 7.932949829101562e+02, 7.932949829101562e+02, 7.932949829101562e+02, 7.932949829101562e+02, 7.932949829101562e+02, 7.932949829101562e+02, 7.932949829101562e+02, 7.932949829101562e+02, 7.932949829101562e+02, 7.932949829101562e+02, 7.932949829101562e+02, 7.932949829101562e+02, 7.932949829101562e+02, 7.932949829101562e+02, 7.932949829101562e+02, 7.932949829101562e+02, 7.932949829101562e+02, 7.932949829101562e+02, 7.932949829101562e+02, 7.932949829101562e+02]
roomHeatLoads[7]=[4.875900268554688e+02, 5.348895263671875e+02, 5.557870483398438e+02, 5.599953002929688e+02, 5.61208740234375e+02, 5.61618408203125e+02, 5.6177197265625e+02, 5.618322143554688e+02, 5.618585205078125e+02, 5.618694458007812e+02, 5.618748168945312e+02, 5.61878662109375e+02, 5.61880126953125e+02, 5.61880615234375e+02, 5.618809204101562e+02, 5.618809204101562e+02, 5.618811645507812e+02, 5.618812866210938e+02, 5.618814086914062e+02, 5.618814086914062e+02, 5.618814086914062e+02, 5.618814697265625e+02, 5.618814697265625e+02, 5.618814697265625e+02, 5.618814697265625e+02, 5.618814697265625e+02, 5.618814697265625e+02, 5.618814697265625e+02, 5.618814697265625e+02, 5.618814697265625e+02, 5.618814697265625e+02, 5.618814697265625e+02, 5.618814697265625e+02, 5.618814697265625e+02, 5.618814697265625e+02, 5.618814697265625e+02, 5.618814697265625e+02, 5.618814697265625e+02, 5.618814697265625e+02, 5.618814697265625e+02, 5.618814697265625e+02, 5.618814697265625e+02, 5.618814697265625e+02, 5.618814697265625e+02, 5.618814697265625e+02, 5.618814697265625e+02, 5.618814697265625e+02, 5.618814697265625e+02, 5.618814697265625e+02, 5.618814697265625e+02, 5.618814697265625e+02, 5.618814697265625e+02, 5.618814697265625e+02, 5.618814697265625e+02, 5.618814697265625e+02, 5.618814697265625e+02, 5.618814697265625e+02, 5.618814697265625e+02, 5.618814697265625e+02, 5.618814697265625e+02, 5.618814697265625e+02, 5.618814697265625e+02, 5.618814697265625e+02, 5.618814697265625e+02, 5.618814697265625e+02, 5.618814697265625e+02, 5.618814697265625e+02, 5.618814697265625e+02, 5.618814697265625e+02, 5.618814697265625e+02, 5.618814697265625e+02, 5.618814697265625e+02, 5.618814697265625e+02, 5.618814697265625e+02, 5.618814697265625e+02, 5.618814697265625e+02, 5.618814697265625e+02, 5.618814697265625e+02, 5.618814697265625e+02, 5.618814697265625e+02, 5.618814697265625e+02, 5.618814697265625e+02, 5.618814697265625e+02, 5.618814697265625e+02, 5.618814697265625e+02, 5.618814697265625e+02, 5.618814697265625e+02, 5.618814697265625e+02, 5.618814697265625e+02, 5.618814697265625e+02, 5.618814697265625e+02, 5.618814697265625e+02, 5.618814697265625e+02, 5.618814697265625e+02, 5.618814697265625e+02, 5.618814697265625e+02, 5.618814697265625e+02, 5.618814697265625e+02, 5.618814697265625e+02, 5.618814697265625e+02, 5.618814697265625e+02]
roomHeatLoads[8]=[-6.375133666992188e+02, -9.688192749023438e+01, -7.063009643554688e+01, -6.510908508300781e+01, -6.345927810668945e+01, -6.287376022338867e+01, -6.263970947265625e+01, -6.254115676879883e+01, -6.249568939208984e+01, -6.247522735595703e+01, -6.246486663818359e+01, -6.245809173583984e+01, -6.245523834228516e+01, -6.245409774780273e+01, -6.245341491699219e+01, -6.245326232910156e+01, -6.245294952392578e+01, -6.245269775390625e+01, -6.245258331298828e+01, -6.245255279541016e+01, -6.24525260925293e+01, -6.24525032043457e+01, -6.245249938964844e+01, -6.245249557495117e+01, -6.245249176025391e+01, -6.245248794555664e+01, -6.245248413085938e+01, -6.245248031616211e+01, -6.245247650146484e+01, -6.245247650146484e+01, -6.245247650146484e+01, -6.245247650146484e+01, -6.245247650146484e+01, -6.245247650146484e+01, -6.245247650146484e+01, -6.245247650146484e+01, -6.245247650146484e+01, -6.245247268676758e+01, -6.245247268676758e+01, -6.245247268676758e+01, -6.245247268676758e+01, -6.245247268676758e+01, -6.245247268676758e+01, -6.245247268676758e+01, -6.245247268676758e+01, -6.245247268676758e+01, -6.245247268676758e+01, -6.245247268676758e+01, -6.245247268676758e+01, -6.245247268676758e+01, -6.245247268676758e+01, -6.245247268676758e+01, -6.245247268676758e+01, -6.245247268676758e+01, -6.245247268676758e+01, -6.245247268676758e+01, -6.245247268676758e+01, -6.245247268676758e+01, -6.245247268676758e+01, -6.245247268676758e+01, -6.245247268676758e+01, -6.245247268676758e+01, -6.245247268676758e+01, -6.245247268676758e+01, -6.245247268676758e+01, -6.245247268676758e+01, -6.245247268676758e+01, -6.245247268676758e+01, -6.245247268676758e+01, -6.245247268676758e+01, -6.245247268676758e+01, -6.245247268676758e+01, -6.245247268676758e+01, -6.245247268676758e+01, -6.245247268676758e+01, -6.245247268676758e+01, -6.245247268676758e+01, -6.245247268676758e+01, -6.245247268676758e+01, -6.245247268676758e+01, -6.245247268676758e+01, -6.245247268676758e+01, -6.245247268676758e+01, -6.245247268676758e+01, -6.245247268676758e+01, -6.245247268676758e+01, -6.245247268676758e+01, -6.245247268676758e+01, -6.245247268676758e+01, -6.245247268676758e+01, -6.245247268676758e+01, -6.245247268676758e+01, -6.245247268676758e+01, -6.245247268676758e+01, -6.245247268676758e+01, -6.245247268676758e+01, -6.245247268676758e+01, -6.245247268676758e+01, -6.245247268676758e+01, -6.245247268676758e+01, -6.245247268676758e+01]
roomHeatLoads[9]=[9.719187622070312e+02, 6.54338623046875e+02, 6.698237915039062e+02, 6.73612548828125e+02, 6.747777709960938e+02, 6.751758422851562e+02, 6.753231201171875e+02, 6.753804931640625e+02, 6.754048461914062e+02, 6.754152221679688e+02, 6.75420166015625e+02, 6.754232788085938e+02, 6.754246215820312e+02, 6.754251098632812e+02, 6.754253540039062e+02, 6.754254150390625e+02, 6.754255981445312e+02, 6.754257202148438e+02, 6.7542578125e+02, 6.7542578125e+02, 6.7542578125e+02, 6.754258422851562e+02, 6.754258422851562e+02, 6.754258422851562e+02, 6.754258422851562e+02, 6.754258422851562e+02, 6.754258422851562e+02, 6.754258422851562e+02, 6.754258422851562e+02, 6.754258422851562e+02, 6.754258422851562e+02, 6.754258422851562e+02, 6.754258422851562e+02, 6.754258422851562e+02, 6.754258422851562e+02, 6.754258422851562e+02, 6.754258422851562e+02, 6.754258422851562e+02, 6.754258422851562e+02, 6.754258422851562e+02, 6.754258422851562e+02, 6.754258422851562e+02, 6.754258422851562e+02, 6.754258422851562e+02, 6.754258422851562e+02, 6.754258422851562e+02, 6.754258422851562e+02, 6.754258422851562e+02, 6.754258422851562e+02, 6.754258422851562e+02, 6.754258422851562e+02, 6.754258422851562e+02, 6.754258422851562e+02, 6.754258422851562e+02, 6.754258422851562e+02, 6.754258422851562e+02, 6.754258422851562e+02, 6.754258422851562e+02, 6.754258422851562e+02, 6.754258422851562e+02, 6.754258422851562e+02, 6.754258422851562e+02, 6.754258422851562e+02, 6.754258422851562e+02, 6.754258422851562e+02, 6.754258422851562e+02, 6.754258422851562e+02, 6.754258422851562e+02, 6.754258422851562e+02, 6.754258422851562e+02, 6.754258422851562e+02, 6.754258422851562e+02, 6.754258422851562e+02, 6.754258422851562e+02, 6.754258422851562e+02, 6.754258422851562e+02, 6.754258422851562e+02, 6.754258422851562e+02, 6.754258422851562e+02, 6.754258422851562e+02, 6.754258422851562e+02, 6.754258422851562e+02, 6.754258422851562e+02, 6.754258422851562e+02, 6.754258422851562e+02, 6.754258422851562e+02, 6.754258422851562e+02, 6.754258422851562e+02, 6.754258422851562e+02, 6.754258422851562e+02, 6.754258422851562e+02, 6.754258422851562e+02, 6.754258422851562e+02, 6.754258422851562e+02, 6.754258422851562e+02, 6.754258422851562e+02, 6.754258422851562e+02, 6.754258422851562e+02, 6.754258422851562e+02, 6.754258422851562e+02, 6.754258422851562e+02]
