402.64575087092817,204.7234364040196,154.6605022288859,131.8541244165972,109.49524541059509,97.05421934626065,89.13518342853058,78.22076348215342,74.3222747487016,65.91349138203077,58.96211641111586,61.02488534367876,51.0642597770493,51.6347525201345,49.06985489022918,41.60547621101432
396.6263441797346,191.24738554190844,151.9470429038629,123.74919447023422,108.07519958587363,95.85376817896031,86.74734730494674,77.34141879045637,69.71710660326062,62.544422253151424,63.89629166282248,52.01976239317446,45.83079794750665
400.77366777323186,197.29870585165918,143.63770817941986,121.07783251674846,104.09045428119134,92.47100565361325,82.32282587024383,73.29758761852281,67.59302944253432,60.491587781201815,55.03024039173033,50.54985985177336,44.936005302050035
