299.9704406261444,194.47078275680542,174.24465811252594,158.72701287269592,144.85759675502777,121.45407110452652,96.77144289016724,82.61046966910362,69.52827763557434,60.805735886096954,52.279202029109,46.639749348163605,39.43337328732014,35.38807435333729,30.68193592131138,26.597801864147186,24.207699812948704,20.27660273388028,18.284763522446156,15.60833939164877,13.24224971793592,11.775920271873474,9.552832273766398,8.428181917406619,7.187833287753165,5.952715380117297,5.172735122963786,4.474135842174292,3.7199773117899895,3.4928726800717413,2.9148202356882393,2.5224207411520183,2.1447151652537286,1.906826313585043,1.6668302749749273,1.5774617765564471,1.3860402591526508,1.3247851324267685,1.1485834277700633,1.059776712441817,0.9968970372574404,0.8976067020557821,0.7934197038412094,0.7305093398317695,0.6679968126118183,0.6280244821682572,0.5954182524001226,0.5392613834701478,0.5115160471759737,0.485405225190334
242.3980736732483,209.73379278182983,209.34732580184937,201.88883709907532,168.59358143806458,138.9947748184204,119.64308393001556,108.64375519752502,99.03748947381973,92.06786149740219,84.91246926784515,78.74461543560028,74.0074911415577,69.21960011124611,64.69239628314972,60.50056201219559,57.02488912642002,52.71137697994709,49.185013830661774,46.38337213546038,42.49462525546551,39.584303095936775,35.95689000189304,33.040634736418724,30.510656900703907,27.765383571386337,25.241152197122574,22.74192988499999,20.909707121551037,18.740954983979464,16.873912643641233,15.008251573890448,13.385031575337052,12.260638751089573,10.957854082807899,9.775348192080855,8.63684638403356,7.748847668990493,6.906214306131005,6.188697439618409,5.570229849778116,4.8297097235918045,4.430047897621989,4.0963598000817,3.7145871622487903,3.3331309091299772,3.0451198196969926,2.7142354641109705,2.447897482663393,2.221822605584748,2.073945492040366,1.868422518717125,1.6793014542199671,1.5835607969202101,1.4600316865835339,1.3379693245515227,1.2271142341196537,1.1598651581443846,1.0771256294101477,1.0108379554003477,0.9559360551647842,0.8958208600524813,0.8348023334983736,0.7911041008774191,0.7532061695819721,0.7159960228018463,0.677505387342535,0.6412297929637134,0.6151789426803589,0.5854734237072989,0.5615560647565871,0.5432908495422453,0.5197325049666688,0.4975944960024208
330.02767276763916,209.38524293899536,207.39733266830444,197.20582020282745,176.9115071296692,155.43427848815918,139.96406757831573,126.07485491037369,107.54448747634888,91.46200969815254,79.19048845767975,69.0368150472641,61.232843071222305,54.28994491696358,48.216511726379395,42.62741115689278,37.87596878409386,33.41209701448679,28.32048786431551,24.004964791238308,20.85203856229782,18.092901218682528,14.8084801658988,12.350299013778567,10.317446812987328,8.487294849008322,7.231229301542044,5.973992859944701,4.832644920796156,3.8316304394975305,3.418243082240224,2.9588545076549053,2.3255776213482022,2.00404630205594,1.6734356270171702,1.4609375488944352,1.3020220797043294,1.1072122803889215,0.9788042488507926,0.8916168429423124,0.8056833471637219,0.7590016974136233,0.666364305652678,0.6313418021891266,0.5783997755497694,0.5348409423604608,0.5000624629901722,0.46979927975917235
