{
    "JSON": {
        "ID": "1eeab034-8ff5-63da-899b-fb6b444455ee",
        "label": "setup_compressor",
        "comment": "created through template"
    },
    "setup": {
        "1ee846ef-4df0-632a-bfdb-ef2ea3181b39": {
            "type": "general",
            "name": "general_info",
            "comment": ""
        },
        "1ee846f1-b588-6d3c-9659-7c3266d530e8": {
            "type": "instrument",
            "name": "raspberry_pi",
            "comment": ""
        },
        "1ee847be-fddd-6ee4-892a-68c4555b0981": {
            "type": "sensor",
            "name": "accelerometer",
            "range": {
                "min": -2,
                "max": 2,
                "units": "standard_gravity"
            },
            "frequency": {
                "value": 800,
                "units": "Hertz"
            },
            "comment": ""
        },
        "1eeab001-0168-62a2-9416-9b5f6ce3c38e": {
            "type": "probe",
            "name": "phone",
            "comment": ""
        }
    }
}