{
	"JSON": {
		"ID": "1ee5ec0c-0b57-68cd-9d39-c9b7e9b18753",
		"label": "",
		"comment": "UUID6 is used"
	},
	"calorimeter": {
		"type": "heat flow calorimeter",
		"manufacturer": "Fluidsystemtechnik",
		"container": {
			"type": "beaker",
			"volume": {
				"value": 600,
				"unit": "milliliter"
			}
		},
		"medium": {
			"type": "water",
			"mass": {
				"value": 405,
				"unit": "gramm",
				"accuracy": {
					"value": 0,
					"type": "absolute",
					"unit": "gramm"
				}
			}
		}
	}
}
