{
    "JSON": {
        "ID": "1eea1a8b-ee1e-66b9-997d-f6a9f2008dc7",
        "label": "my_setup",
        "comment": ""
    },
    "setup": {
        "1ee846ef-4df0-632a-bfdb-ef2ea3181b39": {
            "type": "general",
            "name": "general_info",
            "comment": ""
        },
        "1ee846f1-b588-6d3c-9659-7c3266d530e8": {
            "type": "instrument",
            "name": "raspberry_pi",
            "comment": ""
        },
        "1ee847be-fddd-6ee4-892a-68c4555b0981": {
            "type": "sensor",
            "name": "accelerometer",
            "range": {
                "min": -2,
                "max": 2,
                "units": "standard_gravity"
            },
            "frequency": {
                "value": 800,
                "units": "Hertz"
            },
            "comment": ""
        },
        "1eea1a6f-e896-6eec-99ee-9b454c15749": {
            "type": "probe",
            "name": "fan",
            "comment": ""
        }
    }
}