{
	"JSON": {
		"ID": "1ee86258-ac13-6778-93da-4e29136bc734",
		"label": "",
		"comment": "UUID6 is used"
	},
	"probe": {
        "mass_cup": "299",
		"mass_cold_water": "145",
		"mass_hot_water": "95",
		"units": "grams"
	}
}