{
	"JSON": {
		"ID": "1ee8626a-b673-67ff-b0bc-2dc32d8ae097",
		"label": "",
		"comment": "UUID6 is used"
	},
	"sensor": {
		"name": "Temperature_Sensor",
		"type": "DS18B20",
		"manufacturer": "keyestudio",
		"serial": "3ce104576f35",
		"comment": "sensor_2",
		"range": {
			"min": -55,
			"max": 125,
			"units": "degree_celsius"
		},
		"accuracy": {
			"value": 0.5,
			"type": "absolute",
			"unit": "degree_celsius"
		}
	}
}
