{
	"JSON": {
		"ID": "1ee823ea-d797-6597-b7a5-7622897ad72e",
		"label": "",
		"comment": "UUID6 is used"
	},
	"part": {
		"name": "shaft_testrig_2",
		"material": "20MnVS",
		"young's modulus": {
			"value": 210000,
			"unit": "N/mm**2"
		},
		"dimensions": {
			"length": {
				"value": 0.75,
				"unit": "meter"
			},
			"diameter": {
				"value": 8,
				"unit": "millimeter"
			}
		}
	}
}