{
	"JSON": {
		"ID": "1ee7f06d-c512-6515-8f70-2d882a06fa35",
		"label": "",
		"comment": "UUID6 is used"
	},
	"sensor": {
		"name": "Temperature_Sensor",
		"type": "DS18B20",
		"manufacturer": "keyestudio",
		"serial": "3ce1045743c2",
		"comment": "",
		"range": {
			"min": 0,
			"max": 0,
			"units": "degree_celsius"
		},
		"accuracy": {
			"value": 0.0,
			"type": "absolute(relative/absolute/fromMaximum)",
			"unit": "degree_celsius(degree_celsius/percent)"
		}
	}
}
