{
	"JSON": {
		"ID": "1ee7f0ae-ba6a-69c0-8289-b5f8ce7c797b",
		"label": "",
		"comment": "UUID6 is used"
	},
	"group": {
		"number": "03",
		"author": "Lucas Gomiero",
		"experiment": "Kalorimetrie II-I: Küchentischversuche"
	}
}