{
	"JSON": {
		"ID": "1ee7f0ac-9d5e-6b44-9285-16c5007a27c5",
		"label": "",
		"comment": "UUID6 is used"
	},
	"instrument": {
		"name": "raspberry_pi",
		"type": "single_board_computer",
		"manufacturer": "Raspberry Pi Foundation",
		"model": "Raspberry Pi 4 Model B Rev 1.5",
		"serial": "10000000a5aae4ed",
		"operating_system": "Raspberry Pi OS",
		"comment": "to get model and serial number put this code in the terminal: cat /proc/cpuinfo"
	}
}