{
    "assembly": {
        "uuid": "kpi-4363dd3f-e558-45e9-9efa-5d717debe188",
        "properties": {
            "label": "second car",
            "assembly_method": "stick together a vehicle",
            "manufactor": "Luca Sommer",
            "Masse": 217.09999999999997,
            "Preis": 78.65100000000001,
            "Lieferzeit": 13
        },
        "layer": "kpi-SYSTEM",
        "components": [],
        "assemblies": [
            {
                "assembly": {
                    "uuid": "kpi-e7b6092c-d923-4662-ae66-5662ed0588ed",
                    "properties": {
                        "label": "suspension assembly second car",
                        "assembly_method": "stick together like lego blocks"
                    },
                    "layer": "kpi-SUBASSEMBLY",
                    "components": [
                        {
                            "component": {
                                "uuid": "kpi-269ec5a3-c6b9-44c2-a85b-23efc2ea82cf",
                                "properties": {
                                    "label": "front axle",
                                    "item number": 3737,
                                    "item description": "Axle 10 studs",
                                    "category": "axle",
                                    "price [Euro]": 0.01,
                                    "mass [g]": 1.49,
                                    "delivery time [days]": 7,
                                    "data source": "https://www.bricklink.com/v2/catalog/catalogitem.page?P=3737#T=S&O={%22iconly%22:0}",
                                    "dimension [studs]": 10
                                },
                                "layer": "kpi-COMPONENT"
                            }
                        },
                        {
                            "component": {
                                "uuid": "kpi-a7c27aca-8c77-4db4-ba39-7b42951228eb",
                                "properties": {
                                    "label": "back axle",
                                    "item number": 3737,
                                    "item description": "Axle 10 studs",
                                    "category": "axle",
                                    "price [Euro]": 0.01,
                                    "mass [g]": 1.49,
                                    "delivery time [days]": 7,
                                    "data source": "https://www.bricklink.com/v2/catalog/catalogitem.page?P=3737#T=S&O={%22iconly%22:0}",
                                    "dimension [studs]": 10
                                },
                                "layer": "kpi-COMPONENT"
                            }
                        },
                        {
                            "component": {
                                "uuid": "kpi-181c0de3-e795-4cb4-b562-5fc4ed2228f1",
                                "properties": {
                                    "label": "left front wheel",
                                    "item number": "56904c02",
                                    "item description": "wheel 43,2",
                                    "category": "wheel",
                                    "related items": 30699,
                                    "price [Euro]": 0.11,
                                    "mass [g]": 13.0,
                                    "delivery time [days]": 5,
                                    "data source": "https://www.bricklink.com/v2/catalog/catalogitem.page?P=56904c02#T=C",
                                    "diameter [mm]": 43.2
                                },
                                "layer": "kpi-COMPONENT"
                            }
                        },
                        {
                            "component": {
                                "uuid": "kpi-9921b566-c066-4937-ad45-8ba828bb1028",
                                "properties": {
                                    "label": "right front wheel",
                                    "item number": "56904c02",
                                    "item description": "wheel 43,2",
                                    "category": "wheel",
                                    "related items": 30699,
                                    "price [Euro]": 0.11,
                                    "mass [g]": 13.0,
                                    "delivery time [days]": 5,
                                    "data source": "https://www.bricklink.com/v2/catalog/catalogitem.page?P=56904c02#T=C",
                                    "diameter [mm]": 43.2
                                },
                                "layer": "kpi-COMPONENT"
                            }
                        },
                        {
                            "component": {
                                "uuid": "kpi-6c2c4300-6257-49b3-a79f-51b24ed36d67",
                                "properties": {
                                    "label": "left back wheel",
                                    "item number": "56904c02",
                                    "item description": "wheel 43,2",
                                    "category": "wheel",
                                    "related items": 30699,
                                    "price [Euro]": 0.11,
                                    "mass [g]": 13.0,
                                    "delivery time [days]": 5,
                                    "data source": "https://www.bricklink.com/v2/catalog/catalogitem.page?P=56904c02#T=C",
                                    "diameter [mm]": 43.2
                                },
                                "layer": "kpi-COMPONENT"
                            }
                        },
                        {
                            "component": {
                                "uuid": "kpi-ac11c0bf-d368-44fb-8edf-ece44608e373",
                                "properties": {
                                    "label": "right back wheel",
                                    "item number": "56904c02",
                                    "item description": "wheel 43,2",
                                    "category": "wheel",
                                    "related items": 30699,
                                    "price [Euro]": 0.11,
                                    "mass [g]": 13.0,
                                    "delivery time [days]": 5,
                                    "data source": "https://www.bricklink.com/v2/catalog/catalogitem.page?P=56904c02#T=C",
                                    "diameter [mm]": 43.2
                                },
                                "layer": "kpi-COMPONENT"
                            }
                        },
                        {
                            "component": {
                                "uuid": "kpi-9954a5d8-e6d0-446f-b699-096c8c9a1399",
                                "properties": {
                                    "label": "left front wheel bearing",
                                    "item number": 32123,
                                    "item description": "Technic Bush 1/2 Smooth",
                                    "category": "frame",
                                    "price [Euro]": 0.01,
                                    "mass [g]": 0.01,
                                    "delivery time [days]": 3,
                                    "data source": "https://www.bricklink.com/v2/catalog/catalogitem.page?P=4265c&name=Technic%20Bush%201/2%20Smooth&category=%5BTechnic%5D#T=S&O={%22iconly%22:0}",
                                    "dimension [studs]": 1,
                                    "color": "Light Yellow"
                                },
                                "layer": "kpi-COMPONENT"
                            }
                        },
                        {
                            "component": {
                                "uuid": "kpi-540d69f8-0182-4d2d-bf1a-e07c95b133cc",
                                "properties": {
                                    "label": "right front wheel bearing",
                                    "item number": 32123,
                                    "item description": "Technic Bush 1/2 Smooth",
                                    "category": "frame",
                                    "price [Euro]": 0.01,
                                    "mass [g]": 0.01,
                                    "delivery time [days]": 3,
                                    "data source": "https://www.bricklink.com/v2/catalog/catalogitem.page?P=4265c&name=Technic%20Bush%201/2%20Smooth&category=%5BTechnic%5D#T=S&O={%22iconly%22:0}",
                                    "dimension [studs]": 1,
                                    "color": "Light Yellow"
                                },
                                "layer": "kpi-COMPONENT"
                            }
                        },
                        {
                            "component": {
                                "uuid": "kpi-eedac418-64af-4c10-98dd-a27fca8ac562",
                                "properties": {
                                    "label": "left back wheel bearing",
                                    "item number": 32123,
                                    "item description": "Technic Bush 1/2 Smooth",
                                    "category": "frame",
                                    "price [Euro]": 0.01,
                                    "mass [g]": 0.01,
                                    "delivery time [days]": 3,
                                    "data source": "https://www.bricklink.com/v2/catalog/catalogitem.page?P=4265c&name=Technic%20Bush%201/2%20Smooth&category=%5BTechnic%5D#T=S&O={%22iconly%22:0}",
                                    "dimension [studs]": 1
                                },
                                "layer": "kpi-COMPONENT"
                            }
                        },
                        {
                            "component": {
                                "uuid": "kpi-7cdc1560-aaff-4ef1-a98a-3a16cf6d8fb3",
                                "properties": {
                                    "label": "right back wheel bearing",
                                    "item number": 32123,
                                    "item description": "Technic Bush 1/2 Smooth",
                                    "category": "frame",
                                    "price [Euro]": 0.01,
                                    "mass [g]": 0.01,
                                    "delivery time [days]": 3,
                                    "data source": "https://www.bricklink.com/v2/catalog/catalogitem.page?P=4265c&name=Technic%20Bush%201/2%20Smooth&category=%5BTechnic%5D#T=S&O={%22iconly%22:0}",
                                    "dimension [studs]": 1
                                },
                                "layer": "kpi-COMPONENT"
                            }
                        }
                    ],
                    "assemblies": []
                }
            },
            {
                "assembly": {
                    "uuid": "kpi-069472d0-4c9b-4b4a-9b50-ae599d90ef07",
                    "properties": {
                        "label": "chassis assembly",
                        "assembly_method": "connect lego blocks"
                    },
                    "layer": "kpi-SUBASSEMBLY",
                    "components": [
                        {
                            "component": {
                                "uuid": "kpi-c1dd8fc5-f853-4c8f-8c85-73d99173659d",
                                "properties": {
                                    "label": "front frame",
                                    "item number": 32532,
                                    "item description": "Technic, Brick 6 x 8 Open Center",
                                    "category": "frame",
                                    "price [Euro]": 0.18,
                                    "mass [g]": 8.0,
                                    "delivery time [days]": 3,
                                    "data source": "https://www.bricklink.com/v2/catalog/catalogitem.page?P=32532#T=C",
                                    "dimension [studs]": "6 x 8 x 1",
                                    "color": "Black"
                                },
                                "layer": "kpi-COMPONENT"
                            }
                        },
                        {
                            "component": {
                                "uuid": "kpi-abf08259-9ccb-43cd-bcb6-806424751894",
                                "properties": {
                                    "label": "middle frame",
                                    "item number": 32532,
                                    "item description": "Technic, Brick 6 x 8 Open Center",
                                    "category": "frame",
                                    "price [Euro]": 0.18,
                                    "mass [g]": 8.0,
                                    "delivery time [days]": 3,
                                    "data source": "https://www.bricklink.com/v2/catalog/catalogitem.page?P=32532#T=C",
                                    "dimension [studs]": "6 x 8 x 1",
                                    "color": "Black"
                                },
                                "layer": "kpi-COMPONENT"
                            }
                        },
                        {
                            "component": {
                                "uuid": "kpi-557e4f62-3ed7-407b-bc85-5740e8c3c4b5",
                                "properties": {
                                    "label": "back frame",
                                    "item number": 32532,
                                    "item description": "Technic, Brick 6 x 8 Open Center",
                                    "category": "frame",
                                    "price [Euro]": 0.18,
                                    "mass [g]": 8.0,
                                    "delivery time [days]": 3,
                                    "data source": "https://www.bricklink.com/v2/catalog/catalogitem.page?P=32532#T=C",
                                    "dimension [studs]": "6 x 8 x 1",
                                    "color": "Black"
                                },
                                "layer": "kpi-COMPONENT"
                            }
                        },
                        {
                            "component": {
                                "uuid": "kpi-2b4f4caf-2408-4c77-89e9-17996cd510c2",
                                "properties": {
                                    "label": "cross brace",
                                    "item number": 3701,
                                    "item description": "Technic, Brick 1 x 4 with Holes",
                                    "category": "frame",
                                    "price [Euro]": 0.01,
                                    "mass [g]": 1.46,
                                    "delivery time [days]": 3,
                                    "data source": "https://www.bricklink.com/v2/catalog/catalogitem.page?P=3701#T=C",
                                    "dimension [studs]": "1 x 4 x 1"
                                },
                                "layer": "kpi-COMPONENT"
                            }
                        },
                        {
                            "component": {
                                "uuid": "kpi-2136fd17-6521-4460-81c5-b8df8382c344",
                                "properties": {
                                    "label": "first batterie frame",
                                    "item number": 32531,
                                    "item description": "Technic, Brick 4 x 6 Open Center",
                                    "category": "frame",
                                    "price [Euro]": 0.1,
                                    "mass [g]": 5.0,
                                    "delivery time [days]": 3,
                                    "data source": "https://www.bricklink.com/v2/catalog/catalogitem.page?P=32531&idColor=11#T=C&C=11",
                                    "dimension [studs]": "4 x 6 x 1"
                                },
                                "layer": "kpi-COMPONENT"
                            }
                        },
                        {
                            "component": {
                                "uuid": "kpi-9b9070f8-4319-47be-900c-01455f6e8e0f",
                                "properties": {
                                    "label": "second batterie frame",
                                    "item number": 32531,
                                    "item description": "Technic, Brick 4 x 6 Open Center",
                                    "category": "frame",
                                    "price [Euro]": 0.1,
                                    "mass [g]": 5.0,
                                    "delivery time [days]": 3,
                                    "data source": "https://www.bricklink.com/v2/catalog/catalogitem.page?P=32531&idColor=11#T=C&C=11",
                                    "dimension [studs]": "4 x 6 x 1"
                                },
                                "layer": "kpi-COMPONENT"
                            }
                        },
                        {
                            "component": {
                                "uuid": "kpi-a75b32f0-4416-4310-8f16-5b8c5e1cebce",
                                "properties": {
                                    "label": "pin right front",
                                    "item number": 3673,
                                    "item description": "Technic, Pin without Friction Ridges",
                                    "category": "frame",
                                    "price [Euro]": 0.01,
                                    "mass [g]": 0.16,
                                    "delivery time [days]": 3,
                                    "data source": "https://www.bricklink.com/v2/catalog/catalogitem.page?P=3673&name=Technic,%20Pin%20without%20Friction%20Ridges&category=%5BTechnic,%20Pin%5D#T=S&O={%22iconly%22:0}",
                                    "dimension [studs]": 1
                                },
                                "layer": "kpi-COMPONENT"
                            }
                        },
                        {
                            "component": {
                                "uuid": "kpi-27cd5467-9875-47ce-826f-9273ca476053",
                                "properties": {
                                    "label": "pin left front",
                                    "item number": 3673,
                                    "item description": "Technic, Pin without Friction Ridges",
                                    "category": "frame",
                                    "price [Euro]": 0.01,
                                    "mass [g]": 0.16,
                                    "delivery time [days]": 3,
                                    "data source": "https://www.bricklink.com/v2/catalog/catalogitem.page?P=3673&name=Technic,%20Pin%20without%20Friction%20Ridges&category=%5BTechnic,%20Pin%5D#T=S&O={%22iconly%22:0}",
                                    "dimension [studs]": 1
                                },
                                "layer": "kpi-COMPONENT"
                            }
                        },
                        {
                            "component": {
                                "uuid": "kpi-c875fdb0-b487-4eee-aad4-8c2fbaf41e8d",
                                "properties": {
                                    "label": "pin right back",
                                    "item number": 3673,
                                    "item description": "Technic, Pin without Friction Ridges",
                                    "category": "frame",
                                    "price [Euro]": 0.01,
                                    "mass [g]": 0.16,
                                    "delivery time [days]": 3,
                                    "data source": "https://www.bricklink.com/v2/catalog/catalogitem.page?P=3673&name=Technic,%20Pin%20without%20Friction%20Ridges&category=%5BTechnic,%20Pin%5D#T=S&O={%22iconly%22:0}",
                                    "dimension [studs]": 1
                                },
                                "layer": "kpi-COMPONENT"
                            }
                        },
                        {
                            "component": {
                                "uuid": "kpi-16fe8a70-a2bf-4d8a-8fb7-976685237f0e",
                                "properties": {
                                    "label": "pin left back",
                                    "item number": 3673,
                                    "item description": "Technic, Pin without Friction Ridges",
                                    "category": "frame",
                                    "price [Euro]": 0.01,
                                    "mass [g]": 0.16,
                                    "delivery time [days]": 3,
                                    "data source": "https://www.bricklink.com/v2/catalog/catalogitem.page?P=3673&name=Technic,%20Pin%20without%20Friction%20Ridges&category=%5BTechnic,%20Pin%5D#T=S&O={%22iconly%22:0}",
                                    "dimension [studs]": 1
                                },
                                "layer": "kpi-COMPONENT"
                            }
                        },
                        {
                            "component": {
                                "uuid": "kpi-8a7ee04b-706c-4678-af83-1197ec530a50",
                                "properties": {
                                    "label": "pin cross brace",
                                    "item number": 32556,
                                    "item description": "Technic, Pin 3L without Friction Ridges",
                                    "category": "frame",
                                    "price [Euro]": 0.1,
                                    "mass [g]": 0.25,
                                    "delivery time [days]": 3,
                                    "data source": "https://www.bricklink.com/v2/catalog/catalogitem.page?P=32556&name=Technic,%20Pin%203L%20without%20Friction%20Ridges&category=%5BTechnic,%20Pin%5D#T=S&O={%22iconly%22:0}",
                                    "dimension [studs]": 1
                                },
                                "layer": "kpi-COMPONENT"
                            }
                        }
                    ],
                    "assemblies": []
                }
            },
            {
                "assembly": {
                    "uuid": "kpi-20850e62-729e-4bb8-83d5-13cec50c06c5",
                    "properties": {
                        "label": "power unit assembly second car",
                        "assembly_method": "connect lego blocks and electrical link"
                    },
                    "layer": "kpi-SUBASSEMBLY",
                    "components": [
                        {
                            "component": {
                                "uuid": "kpi-820b8d67-abb6-4a61-a814-4f6d42eec1ca",
                                "properties": {
                                    "label": "motors",
                                    "item number": "8883-1",
                                    "item description": "Power Functions M-Motor",
                                    "category": "motor",
                                    "related items": "8881, 8878, 45517, 88000",
                                    "idle current [mA]": 65,
                                    "idle speed [rev per min]": 405,
                                    "locking torque [Ncm]": 11,
                                    "price [Euro]": 20,
                                    "mass [g]": 35.0,
                                    "delivery time [days]": 5,
                                    "data source": "https://www.bricklink.com/v2/catalog/catalogitem.page?S=8883-1&name=Power%20Functions%20M-Motor&category=%5BPower%20Functions%5D#T=S&O={%22iconly%22:0}",
                                    "compatible battery": "8881, 8878, 45517, 88000",
                                    "input voltage [V]": 9,
                                    "dimensions [cm]": "13.8 x 11.9 x 2.3"
                                },
                                "layer": "kpi-COMPONENT"
                            }
                        },
                        {
                            "component": {
                                "uuid": "kpi-ae006885-4af4-4367-abe5-57e85d0ed01b",
                                "properties": {
                                    "label": "batteries",
                                    "item number": "8878-1",
                                    "item description": "Power Functions Rechargeable Battery Box",
                                    "category": "battery",
                                    "price [Euro]": 55,
                                    "mass [g]": 83.94,
                                    "delivery time [days]": 8,
                                    "data source": "https://www.bricklink.com/v2/catalog/catalogitem.page?S=8878-1#T=S&O={%22iconly%22:0}",
                                    "output voltage [V]": 7.4,
                                    "dimensions [cm]": "15 x 15 x 3,5",
                                    "color": "Light Yellow"
                                },
                                "layer": "kpi-COMPONENT"
                            }
                        },
                        {
                            "component": {
                                "uuid": "kpi-5d07bc4b-0202-4ff1-92bb-5ef9cf4d6147",
                                "properties": {
                                    "label": "motor axle",
                                    "item number": 32073,
                                    "item description": "Axle 5 studs",
                                    "category": "axle",
                                    "price [Euro]": 0.001,
                                    "mass [g]": 0.66,
                                    "delivery time [days]": 3,
                                    "data source": "https://www.bricklink.com/v2/catalog/catalogitem.page?P=32073#T=S&O={%22iconly%22:0}",
                                    "dimension [studs]": 5
                                },
                                "layer": "kpi-COMPONENT"
                            }
                        }
                    ],
                    "assemblies": []
                }
            },
            {
                "assembly": {
                    "uuid": "kpi-c33f2c1e-f24d-42a7-b191-fa5ee2486dd2",
                    "properties": {
                        "label": "transmission assembly second car",
                        "assembly_method": "create a mechanical connection"
                    },
                    "layer": "kpi-SUBASSEMBLY",
                    "components": [
                        {
                            "component": {
                                "uuid": "kpi-101eb197-0153-4e00-ab4f-9cf19d64c12e",
                                "properties": {
                                    "label": "primary gear",
                                    "item number": 3650,
                                    "item description": "Gear 24 Tooth Crown",
                                    "category": "gear",
                                    "price [Euro]": 0.09,
                                    "mass [g]": 1.03,
                                    "delivery time [days]": 13,
                                    "data source": "https://www.bricklink.com/v2/catalog/catalogitem.page?P=3650#T=C"
                                },
                                "layer": "kpi-COMPONENT"
                            }
                        },
                        {
                            "component": {
                                "uuid": "kpi-720b366a-92f2-474f-8a08-59645f06bea7",
                                "properties": {
                                    "label": "secondary worm gear",
                                    "item number": 4716,
                                    "item description": "Gear Worm Screw",
                                    "category": "gear",
                                    "price [Euro]": 0.54,
                                    "mass [g]": 0.6,
                                    "delivery time [days]": 12,
                                    "data source": "https://www.bricklink.com/v2/catalog/catalogitem.page?P=4716#T=C"
                                },
                                "layer": "kpi-COMPONENT"
                            }
                        },
                        {
                            "component": {
                                "uuid": "kpi-1330ff5c-9b9e-4160-bcbb-b07535c643c5",
                                "properties": {
                                    "label": "worm gear box",
                                    "item number": 6588,
                                    "item description": "Gear Worm Gearbox",
                                    "category": "gear",
                                    "price [Euro]": 1.63,
                                    "mass [g]": 4.5,
                                    "delivery time [days]": 11,
                                    "data source": "https://www.bricklink.com/v2/catalog/catalogitem.page?P=6588#T=C",
                                    "color": "Blue"
                                },
                                "layer": "kpi-COMPONENT"
                            }
                        }
                    ],
                    "assemblies": []
                }
            }
        ]
    }
}