{
	"JSON": {
		"ID": "1ee5ec0a-1830-63f5-ac3e-6f8ce4468546",
		"label": "",
		"comment": "UUID6 is used"
	},
	"group": {
		"number": "Group31",
		"author": [
			"Dennis_Dibbern_member01",
			"Luca_Sommer_member02"
		],
		"experiment": "calorimetry",
		"testrig_number": "5"
	}
}
