{
	"JSON": {
		"ID": "1ee7fb90-57c4-6657-b390-d93f6a2e3a10",
		"label": "",
		"comment": "UUID6 is used"
	},
    "comment": "here you can write down something important about this setup file",
    "info": "List below ALL components, you used in your experiment. By using the UUID there is no possibility to mix something up.",
	"setup": {
		"1ee7fb82-c357-6c2e-89bb-b03169cf70a1": {
            "type": "group_info",
			"name": "group_info",
            "comment": ""
        },
		"1ee7fb85-4e57-6e0b-8339-65e4978d47d2": {
            "type": "instrument",
			"name": "raspberry_pi",
            "comment": ""
        },
		"1ee7fb5e-19af-6f08-b1a0-14eba101c74e": {
            "type": "sensor",
			"name": "sensor1",
            "comment": ""
        },
		"1ee7fb6d-2193-6f0c-8cad-5cdbedbaae70": {
            "type": "sensor",
			"name": "sensor2",
            "comment": ""
        },
		"1ee7fb8c-9d3f-64c4-90a6-0eebded634d9": {
            "type": "probe",
			"name": "probe_description",
            "comment": ""
        },
		"add_more_here_if_you_need": {
			"type": "choose your own type, if you miss one",
			"name": "",
			"comment": ""
		}
	}
}