{
  "things-style@@h2-underline": false,
  "things-style@@h2-color": "#EED53C",
  "things-style@@h4-color": "#67E5A1",
  "things-style@@strong-color": "#DF4343",
  "things-style@@em-color": "#1DA4E5",
  "things-style@@h5-color": "#C65CAF",
  "things-style@@h1-color": "#FFFFFF"
}