{
  "main": {
    "id": "a9a78b44812f26fc",
    "type": "split",
    "children": [
      {
        "id": "30d3988f76183813",
        "type": "tabs",
        "children": [
          {
            "id": "d666a671a8f676f2",
            "type": "leaf",
            "state": {
              "type": "markdown",
              "state": {
                "file": "01 Notes/RRT*.md",
                "mode": "source",
                "source": false
              }
            }
          }
        ]
      }
    ],
    "direction": "vertical"
  },
  "left": {
    "id": "cf494326c647c174",
    "type": "split",
    "children": [
      {
        "id": "56902aa731f658ec",
        "type": "tabs",
        "children": [
          {
            "id": "470e46a0cc04d136",
            "type": "leaf",
            "state": {
              "type": "file-explorer",
              "state": {
                "sortOrder": "alphabetical"
              }
            }
          },
          {
            "id": "1bc9b2b5843a3cad",
            "type": "leaf",
            "state": {
              "type": "search",
              "state": {
                "query": "",
                "matchingCase": false,
                "explainSearch": false,
                "collapseAll": false,
                "extraContext": false,
                "sortOrder": "alphabetical"
              }
            }
          },
          {
            "id": "9be9c7d79315e9f0",
            "type": "leaf",
            "state": {
              "type": "bookmarks",
              "state": {}
            }
          }
        ]
      }
    ],
    "direction": "horizontal",
    "width": 300,
    "collapsed": true
  },
  "right": {
    "id": "aeb3c20b14d17bd7",
    "type": "split",
    "children": [
      {
        "id": "256c98858a2938ed",
        "type": "tabs",
        "children": [
          {
            "id": "455520179a61a842",
            "type": "leaf",
            "state": {
              "type": "backlink",
              "state": {
                "file": "01 Notes/RRT*.md",
                "collapseAll": false,
                "extraContext": false,
                "sortOrder": "alphabetical",
                "showSearch": false,
                "searchQuery": "",
                "backlinkCollapsed": false,
                "unlinkedCollapsed": true
              }
            }
          },
          {
            "id": "c17a721d1f5abcab",
            "type": "leaf",
            "state": {
              "type": "outgoing-link",
              "state": {
                "file": "01 Notes/RRT*.md",
                "linksCollapsed": false,
                "unlinkedCollapsed": true
              }
            }
          },
          {
            "id": "ac88062af3b6891f",
            "type": "leaf",
            "state": {
              "type": "tag",
              "state": {
                "sortOrder": "frequency",
                "useHierarchy": true
              }
            }
          },
          {
            "id": "ae9365ab54241719",
            "type": "leaf",
            "state": {
              "type": "outline",
              "state": {
                "file": "01 Notes/RRT*.md"
              }
            }
          }
        ]
      }
    ],
    "direction": "horizontal",
    "width": 300,
    "collapsed": true
  },
  "left-ribbon": {
    "hiddenItems": {
      "switcher:Open quick switcher": false,
      "graph:Open graph view": false,
      "canvas:Create new canvas": false,
      "daily-notes:Open today's daily note": false,
      "templates:Insert template": false,
      "command-palette:Open command palette": false
    }
  },
  "active": "d666a671a8f676f2",
  "lastOpenFiles": [
    "Attachments/Pasted image 20231122145541.png",
    "Attachments/Pasted image 20231122145329.png",
    "Attachments/Pasted image 20231122145103.png",
    "00 MOC/MOC.md",
    "01 Notes/RRT*.md",
    "Attachments/Pasted image 20231122142253.png",
    "Attachments/Pasted image 20231122142225.png",
    "01 Notes/Possible Architectures.md",
    "01 Notes/RRT-style Algorithms.md",
    "01 Notes/Path and Trajectory Planning.md",
    "01 Notes/SPG21.md",
    "01 Notes/Dynamic Window Approach (DWA).md",
    "01 Notes/Fragen and Björn und Till.md",
    "Attachments/Pasted image 20231019091554.png",
    "Attachments/Pasted image 20231019115256.png",
    "Attachments/Pasted image 20231019141134.png",
    "Attachments/Pasted image 20231019123448.png",
    "Untitled.canvas",
    "Attachments",
    "Attachments/Pasted image 20231019123102.png",
    "Attachments/Pasted image 20231019121027.png",
    "00 MOC",
    "01 Notes",
    "2023-10-18.md",
    "General Notes",
    "Lit Review/Path Planning and Obstacle Avoidance/Surveys and Overviews",
    "Lit Review/Path Planning and Obstacle Avoidance",
    "Spec",
    "Implementation",
    "Lit Review"
  ]
}