{
    "assembly": {
        "uuid": "kpi-69cd8624-7ae0-4c18-b91e-e71c55396985",
        "properties": {
            "label": "car",
            "mass [g]": 258.56,
            "delivery time [days]": 13,
            "price [Euro]": 17.78100000000002
        },
        "layer": "kpi-SYSTEM",
        "components": [],
        "assemblies": [
            {
                "assembly": {
                    "uuid": "kpi-ef66d921-a91e-4653-88b4-bae0c305dbca",
                    "properties": {
                        "label": "drive unit",
                        "assembly_method": "stick together like blocks"
                    },
                    "layer": "kpi-ASSEMBLY",
                    "components": [
                        {
                            "component": {
                                "uuid": "kpi-da01de48-9dd2-440b-b78c-96c95657cf62",
                                "properties": {
                                    "label": "battery",
                                    "item number": "2847c01",
                                    "item description": "Electric 9V Battery Box",
                                    "category": "battery",
                                    "price [Euro]": 2,
                                    "mass [g]": 172.7,
                                    "delivery time [days]": 3,
                                    "data source": "https://www.bricklink.com/v2/catalog/catalogitem.page?P=2847c01&name=Electric%209V%20Battery%20Box%204%20x%2014%20x%204%20with%20Red%20Buttons%20and%20Contact%20Plate%20with%20Dark%20Gray%20Base%20(2846%20/%202847c00)&category=%5BElectric,%20Battery%20Box%5D#T=S&O={%22iconly%22:0}",
                                    "output voltage [V]": 9.0,
                                    "dimensions [cm]": "11,2 x 3,2 x 3,2"
                                },
                                "layer": "kpi-COMPONENT"
                            }
                        }
                    ],
                    "assemblies": [
                        {
                            "assembly": {
                                "uuid": "kpi-28656402-abad-4ce5-bc95-cd2388d343d9",
                                "properties": {
                                    "label": "motor assembly",
                                    "assembly_method": "stick together like blocks"
                                },
                                "layer": "kpi-SUBASSEMBLY",
                                "components": [
                                    {
                                        "component": {
                                            "uuid": "kpi-2c27442d-95c9-4e4e-b9e7-af0b6d554edf",
                                            "properties": {
                                                "label": "pin_l",
                                                "item number": 3673,
                                                "item description": "Technic, Pin without Friction Ridges",
                                                "category": "frame",
                                                "price [Euro]": 0.01,
                                                "mass [g]": 0.16,
                                                "delivery time [days]": 3,
                                                "data source": "https://www.bricklink.com/v2/catalog/catalogitem.page?P=3673&name=Technic,%20Pin%20without%20Friction%20Ridges&category=%5BTechnic,%20Pin%5D#T=S&O={%22iconly%22:0}",
                                                "dimension [studs]": 1
                                            },
                                            "layer": "kpi-COMPONENT"
                                        }
                                    },
                                    {
                                        "component": {
                                            "uuid": "kpi-2bebec38-a7f0-486f-b049-d79cd18bb3a6",
                                            "properties": {
                                                "label": "pin_r",
                                                "item number": 3673,
                                                "item description": "Technic, Pin without Friction Ridges",
                                                "category": "frame",
                                                "price [Euro]": 0.01,
                                                "mass [g]": 0.16,
                                                "delivery time [days]": 3,
                                                "data source": "https://www.bricklink.com/v2/catalog/catalogitem.page?P=3673&name=Technic,%20Pin%20without%20Friction%20Ridges&category=%5BTechnic,%20Pin%5D#T=S&O={%22iconly%22:0}",
                                                "dimension [studs]": 1
                                            },
                                            "layer": "kpi-COMPONENT"
                                        }
                                    },
                                    {
                                        "component": {
                                            "uuid": "kpi-6efddfb4-8841-44cd-8a37-4cbcb3d6dd8c",
                                            "properties": {
                                                "label": "motor_9V",
                                                "item number": "88003-1",
                                                "item description": "Power Functions L-Motor",
                                                "category": "motor",
                                                "related items": "8881, 8878, 88000",
                                                "idle current [mA]": 120,
                                                "idle speed [rev per min]": 390,
                                                "locking torque [Ncm]": 18,
                                                "price [Euro]": 15,
                                                "mass [g]": 48.0,
                                                "delivery time [days]": 3,
                                                "data source": "https://www.bricklink.com/v2/catalog/catalogitem.page?S=88003-1&name=Power%20Functions%20L-Motor&category=%5BPower%20Functions%5D#T=S&O={%22iconly%22:0}",
                                                "compatible battery": "8881, 8878, 88000",
                                                "input voltage [V]": 9,
                                                "dimensions [cm]": "13 x 11 x 2.5"
                                            },
                                            "layer": "kpi-COMPONENT"
                                        }
                                    }
                                ],
                                "assemblies": []
                            }
                        },
                        {
                            "assembly": {
                                "uuid": "kpi-badec1f0-ae2a-472f-b011-5bfe39807fdb",
                                "properties": {
                                    "label": "transmission assembly",
                                    "assembly_method": "stick together like blocks"
                                },
                                "layer": "kpi-SUBASSEMBLY",
                                "components": [
                                    {
                                        "component": {
                                            "uuid": "kpi-2c13da07-96ab-4d50-8ed3-d1b0a3ed8706",
                                            "properties": {
                                                "label": "gear_motor",
                                                "item number": 3647,
                                                "item description": "Gear 8 Tooth",
                                                "category": "gear",
                                                "price [Euro]": 0.14,
                                                "mass [g]": 0.16,
                                                "delivery time [days]": 11,
                                                "data source": "https://www.bricklink.com/v2/catalog/catalogitem.page?P=3647#T=C"
                                            },
                                            "layer": "kpi-COMPONENT"
                                        }
                                    },
                                    {
                                        "component": {
                                            "uuid": "kpi-6060fc22-a596-4c4f-b31b-1560cf89cb9a",
                                            "properties": {
                                                "label": "gear_axle",
                                                "item number": 32269,
                                                "item description": "Gear 20 Tooth",
                                                "category": "gear",
                                                "price [Euro]": 0.36,
                                                "mass [g]": 1.4,
                                                "delivery time [days]": 13,
                                                "data source": "https://www.bricklink.com/v2/catalog/catalogitem.page?P=32269#T=C"
                                            },
                                            "layer": "kpi-COMPONENT"
                                        }
                                    },
                                    {
                                        "component": {
                                            "uuid": "kpi-56bee7e7-a9bb-4284-8171-660604583607",
                                            "properties": {
                                                "label": "motor_axle",
                                                "item number": 32073,
                                                "item description": "Axle 5 studs",
                                                "category": "axle",
                                                "price [Euro]": 0.001,
                                                "mass [g]": 0.66,
                                                "delivery time [days]": 3,
                                                "data source": "https://www.bricklink.com/v2/catalog/catalogitem.page?P=32073#T=S&O={%22iconly%22:0}",
                                                "dimension [studs]": 5
                                            },
                                            "layer": "kpi-COMPONENT"
                                        }
                                    }
                                ],
                                "assemblies": []
                            }
                        }
                    ]
                }
            },
            {
                "assembly": {
                    "uuid": "kpi-1544b24b-3367-42c0-b1ed-a83625e38f9c",
                    "properties": {
                        "label": "frame assembly",
                        "assembly_method": "stick together like blocks"
                    },
                    "layer": "kpi-ASSEMBLY",
                    "components": [
                        {
                            "component": {
                                "uuid": "kpi-6338d624-f525-4ef8-ba4a-91eaa56814b9",
                                "properties": {
                                    "label": "frame2_f_l",
                                    "item number": 3700,
                                    "item description": "Technic, Brick 1 x 2 with Hole",
                                    "category": "frame",
                                    "price [Euro]": 0.01,
                                    "mass [g]": 0.82,
                                    "delivery time [days]": 3,
                                    "data source": "https://www.bricklink.com/v2/catalog/catalogitem.page?P=3700#T=C",
                                    "dimension [studs]": "1 x 2"
                                },
                                "layer": "kpi-COMPONENT"
                            }
                        },
                        {
                            "component": {
                                "uuid": "kpi-a3d6a6bc-ca30-4ccf-bcbf-f5d497d5ebeb",
                                "properties": {
                                    "label": "frame2_f_r",
                                    "item number": 3700,
                                    "item description": "Technic, Brick 1 x 2 with Hole",
                                    "category": "frame",
                                    "price [Euro]": 0.01,
                                    "mass [g]": 0.82,
                                    "delivery time [days]": 3,
                                    "data source": "https://www.bricklink.com/v2/catalog/catalogitem.page?P=3700#T=C",
                                    "dimension [studs]": "1 x 2"
                                },
                                "layer": "kpi-COMPONENT"
                            }
                        },
                        {
                            "component": {
                                "uuid": "kpi-826b8d06-8df2-4889-97ad-615a2400e779",
                                "properties": {
                                    "label": "frame2_r_l",
                                    "item number": 3700,
                                    "item description": "Technic, Brick 1 x 2 with Hole",
                                    "category": "frame",
                                    "price [Euro]": 0.01,
                                    "mass [g]": 0.82,
                                    "delivery time [days]": 3,
                                    "data source": "https://www.bricklink.com/v2/catalog/catalogitem.page?P=3700#T=C",
                                    "dimension [studs]": "1 x 2"
                                },
                                "layer": "kpi-COMPONENT"
                            }
                        },
                        {
                            "component": {
                                "uuid": "kpi-2e8345ab-d518-4c73-a2fe-e78b7bc66807",
                                "properties": {
                                    "label": "frame2_r_r",
                                    "item number": 3700,
                                    "item description": "Technic, Brick 1 x 2 with Hole",
                                    "category": "frame",
                                    "price [Euro]": 0.01,
                                    "mass [g]": 0.82,
                                    "delivery time [days]": 3,
                                    "data source": "https://www.bricklink.com/v2/catalog/catalogitem.page?P=3700#T=C",
                                    "dimension [studs]": "1 x 2"
                                },
                                "layer": "kpi-COMPONENT"
                            }
                        },
                        {
                            "component": {
                                "uuid": "kpi-cc481b06-e23a-4bae-bceb-6ad8172e068b",
                                "properties": {
                                    "label": "frame8_r",
                                    "item number": 3702,
                                    "item description": "Technic, Brick 1 x 8 with Holes",
                                    "category": "frame",
                                    "price [Euro]": 0.01,
                                    "mass [g]": 2.85,
                                    "delivery time [days]": 5,
                                    "data source": "https://www.bricklink.com/v2/catalog/catalogitem.page?P=3702#T=C",
                                    "dimension [studs]": "1 x 8 x 1"
                                },
                                "layer": "kpi-COMPONENT"
                            }
                        },
                        {
                            "component": {
                                "uuid": "kpi-6ce607bb-54cc-4349-820e-c48c013133d2",
                                "properties": {
                                    "label": "frame8_f",
                                    "item number": 3702,
                                    "item description": "Technic, Brick 1 x 8 with Holes",
                                    "category": "frame",
                                    "price [Euro]": 0.01,
                                    "mass [g]": 2.85,
                                    "delivery time [days]": 5,
                                    "data source": "https://www.bricklink.com/v2/catalog/catalogitem.page?P=3702#T=C",
                                    "dimension [studs]": "1 x 8 x 1"
                                },
                                "layer": "kpi-COMPONENT"
                            }
                        },
                        {
                            "component": {
                                "uuid": "kpi-bcb907a0-f32b-4f41-b8a2-7d692d9752ef",
                                "properties": {
                                    "label": "frame16_l",
                                    "item number": 3703,
                                    "item description": "Technic, Brick 1 x 16 with Holes",
                                    "category": "frame",
                                    "price [Euro]": 0.07,
                                    "mass [g]": 5.87,
                                    "delivery time [days]": 5,
                                    "data source": "https://www.bricklink.com/v2/catalog/catalogitem.page?P=3703#T=C",
                                    "dimension [studs]": "1 x 16 x 1",
                                    "color": "dark grey"
                                },
                                "layer": "kpi-COMPONENT"
                            }
                        },
                        {
                            "component": {
                                "uuid": "kpi-5418e0f2-6e6a-4802-a787-7723ce5cc00d",
                                "properties": {
                                    "label": "frame16_r",
                                    "item number": 3703,
                                    "item description": "Technic, Brick 1 x 16 with Holes",
                                    "category": "frame",
                                    "price [Euro]": 0.07,
                                    "mass [g]": 5.87,
                                    "delivery time [days]": 5,
                                    "data source": "https://www.bricklink.com/v2/catalog/catalogitem.page?P=3703#T=C",
                                    "dimension [studs]": "1 x 16 x 1",
                                    "color": "dark grey"
                                },
                                "layer": "kpi-COMPONENT"
                            }
                        }
                    ],
                    "assemblies": []
                }
            },
            {
                "assembly": {
                    "uuid": "kpi-63e92fee-db2f-4dce-8259-6e6ccea5c8d2",
                    "properties": {
                        "label": "axle assembly"
                    },
                    "layer": "kpi-ASSEMBLY",
                    "components": [],
                    "assemblies": [
                        {
                            "assembly": {
                                "uuid": "kpi-2eb64b1b-7103-44c4-aaf6-09937eda29aa",
                                "properties": {
                                    "label": "front axle assembly",
                                    "assembly_method": "stick together like blocks"
                                },
                                "layer": "kpi-SUBASSEMBLY",
                                "components": [
                                    {
                                        "component": {
                                            "uuid": "kpi-b05f3308-5561-4411-a509-7215451f7e91",
                                            "properties": {
                                                "label": "front wheel l",
                                                "item number": "3482c01",
                                                "item description": "wheel 24",
                                                "category": "wheel",
                                                "related items": 3483,
                                                "price [Euro]": 0.01,
                                                "mass [g]": 3.0,
                                                "delivery time [days]": 5,
                                                "data source": "https://www.bricklink.com/v2/catalog/catalogitem.page?P=3482c01#T=C",
                                                "diameter [mm]": 24.0
                                            },
                                            "layer": "kpi-COMPONENT"
                                        }
                                    },
                                    {
                                        "component": {
                                            "uuid": "kpi-62f38c55-e3eb-433b-82e2-d0d9035bb9ca",
                                            "properties": {
                                                "label": "front wheel r",
                                                "item number": "3482c01",
                                                "item description": "wheel 24",
                                                "category": "wheel",
                                                "related items": 3483,
                                                "price [Euro]": 0.01,
                                                "mass [g]": 3.0,
                                                "delivery time [days]": 5,
                                                "data source": "https://www.bricklink.com/v2/catalog/catalogitem.page?P=3482c01#T=C",
                                                "diameter [mm]": 24.0
                                            },
                                            "layer": "kpi-COMPONENT"
                                        }
                                    },
                                    {
                                        "component": {
                                            "uuid": "kpi-ecf57461-01c7-4b22-9995-7f6dd836cb37",
                                            "properties": {
                                                "label": "front axle",
                                                "item number": 60485,
                                                "item description": "Axle 9 studs",
                                                "category": "axle",
                                                "price [Euro]": 0.01,
                                                "mass [g]": 1.3,
                                                "delivery time [days]": 7,
                                                "data source": "https://www.bricklink.com/v2/catalog/catalogitem.page?P=60485#T=S&O={%22iconly%22:0}",
                                                "dimension [studs]": 9
                                            },
                                            "layer": "kpi-COMPONENT"
                                        }
                                    }
                                ],
                                "assemblies": []
                            }
                        },
                        {
                            "assembly": {
                                "uuid": "kpi-245f1106-2450-4051-9554-3bcec4f82c79",
                                "properties": {
                                    "label": "rear axle assembly",
                                    "assembly_method": "stick together like blocks"
                                },
                                "layer": "kpi-SUBASSEMBLY",
                                "components": [
                                    {
                                        "component": {
                                            "uuid": "kpi-7889faba-e323-403e-bbbf-501de4d148b4",
                                            "properties": {
                                                "label": "front wheel l",
                                                "item number": "3482c01",
                                                "item description": "wheel 24",
                                                "category": "wheel",
                                                "related items": 3483,
                                                "price [Euro]": 0.01,
                                                "mass [g]": 3.0,
                                                "delivery time [days]": 5,
                                                "data source": "https://www.bricklink.com/v2/catalog/catalogitem.page?P=3482c01#T=C",
                                                "diameter [mm]": 24.0
                                            },
                                            "layer": "kpi-COMPONENT"
                                        }
                                    },
                                    {
                                        "component": {
                                            "uuid": "kpi-10660cbb-a7eb-42ed-8791-86fb7fe01cf9",
                                            "properties": {
                                                "label": "front wheel r",
                                                "item number": "3482c01",
                                                "item description": "wheel 24",
                                                "category": "wheel",
                                                "related items": 3483,
                                                "price [Euro]": 0.01,
                                                "mass [g]": 3.0,
                                                "delivery time [days]": 5,
                                                "data source": "https://www.bricklink.com/v2/catalog/catalogitem.page?P=3482c01#T=C",
                                                "diameter [mm]": 24.0
                                            },
                                            "layer": "kpi-COMPONENT"
                                        }
                                    },
                                    {
                                        "component": {
                                            "uuid": "kpi-54be99ff-8c9c-4c58-a86b-bdfc93575df1",
                                            "properties": {
                                                "label": "front axle",
                                                "item number": 60485,
                                                "item description": "Axle 9 studs",
                                                "category": "axle",
                                                "price [Euro]": 0.01,
                                                "mass [g]": 1.3,
                                                "delivery time [days]": 7,
                                                "data source": "https://www.bricklink.com/v2/catalog/catalogitem.page?P=60485#T=S&O={%22iconly%22:0}",
                                                "dimension [studs]": 9
                                            },
                                            "layer": "kpi-COMPONENT"
                                        }
                                    }
                                ],
                                "assemblies": []
                            }
                        }
                    ]
                }
            }
        ]
    }
}