{
    "assembly": {
        "uuid": "kpi-1ddcf945-bf66-4f48-8884-23d1a7c82c3e",
        "properties": {
            "label": "car no.2",
            "mass [g]": 346.45,
            "delivery time [days]": 12,
            "price [Euro]": 37.141000000000005
        },
        "layer": "kpi-SYSTEM",
        "components": [],
        "assemblies": [
            {
                "assembly": {
                    "uuid": "kpi-b68ec13b-7c1d-4c9d-9ebe-fb86c629d533",
                    "properties": {
                        "label": "drivetrain assembly"
                    },
                    "layer": "kpi-ASSEMBLY",
                    "components": [
                        {
                            "component": {
                                "uuid": "kpi-2fe4e768-7b72-40b7-842c-800440b99f83",
                                "properties": {
                                    "label": "battery",
                                    "item number": "8881-1",
                                    "item description": "Power Functions Battery Box",
                                    "category": "battery",
                                    "price [Euro]": 12,
                                    "mass [g]": 179.4,
                                    "delivery time [days]": 3,
                                    "data source": "https://www.bricklink.com/v2/catalog/catalogitem.page?S=8881-1#T=S&O={%22iconly%22:0}",
                                    "output voltage [V]": 9.0,
                                    "dimensions [cm]": "8,8 x 6,3 x 3,2"
                                },
                                "layer": "kpi-COMPONENT"
                            }
                        }
                    ],
                    "assemblies": [
                        {
                            "assembly": {
                                "uuid": "kpi-a7eea4c4-c330-4a57-8614-fe7d07a1461a",
                                "properties": {
                                    "label": "motor with axle"
                                },
                                "layer": "kpi-SUBASSEMBLY",
                                "components": [
                                    {
                                        "component": {
                                            "uuid": "kpi-0d1ef34a-c1f7-4748-a9f1-b440a0039ffd",
                                            "properties": {
                                                "label": "motor axle",
                                                "item number": 32073,
                                                "item description": "Axle 5 studs",
                                                "category": "axle",
                                                "price [Euro]": 0.001,
                                                "mass [g]": 0.66,
                                                "delivery time [days]": 3,
                                                "data source": "https://www.bricklink.com/v2/catalog/catalogitem.page?P=32073#T=S&O={%22iconly%22:0}",
                                                "dimension [studs]": 5
                                            },
                                            "layer": "kpi-COMPONENT"
                                        }
                                    },
                                    {
                                        "component": {
                                            "uuid": "kpi-43662ba2-40d2-461c-a430-052999556b74",
                                            "properties": {
                                                "label": "motor",
                                                "item number": "8883-1",
                                                "item description": "Power Functions M-Motor",
                                                "category": "motor",
                                                "related items": "8881, 8878, 45517, 88000",
                                                "idle current [mA]": 65,
                                                "idle speed [rev per min]": 405,
                                                "locking torque [Ncm]": 11,
                                                "price [Euro]": 20,
                                                "mass [g]": 35.0,
                                                "delivery time [days]": 5,
                                                "data source": "https://www.bricklink.com/v2/catalog/catalogitem.page?S=8883-1&name=Power%20Functions%20M-Motor&category=%5BPower%20Functions%5D#T=S&O={%22iconly%22:0}",
                                                "compatible battery": "8881, 8878, 45517, 88000",
                                                "input voltage [V]": 9,
                                                "dimensions [cm]": "13.8 x 11.9 x 2.3"
                                            },
                                            "layer": "kpi-COMPONENT"
                                        }
                                    }
                                ],
                                "assemblies": []
                            }
                        },
                        {
                            "assembly": {
                                "uuid": "kpi-f7aaa13e-aa5d-4098-96e7-9475b40f4fc9",
                                "properties": {
                                    "label": "gearbox"
                                },
                                "layer": "kpi-SUBASSEMBLY",
                                "components": [
                                    {
                                        "component": {
                                            "uuid": "kpi-d6003329-d038-4ced-ba31-301516bc2c23",
                                            "properties": {
                                                "label": "gear motor",
                                                "item number": 3648,
                                                "item description": "Gear 24 Tooth",
                                                "category": "gear",
                                                "price [Euro]": 0.32,
                                                "mass [g]": 1.17,
                                                "delivery time [days]": 11,
                                                "data source": "https://www.bricklink.com/v2/catalog/catalogitem.page?P=3648#T=C"
                                            },
                                            "layer": "kpi-COMPONENT"
                                        }
                                    },
                                    {
                                        "component": {
                                            "uuid": "kpi-0affdbfb-a467-4c53-9a04-5ca0f673806b",
                                            "properties": {
                                                "label": "worm gear box",
                                                "item number": 6588,
                                                "item description": "Gear Worm Gearbox",
                                                "category": "gear",
                                                "price [Euro]": 1.63,
                                                "mass [g]": 4.5,
                                                "delivery time [days]": 11,
                                                "data source": "https://www.bricklink.com/v2/catalog/catalogitem.page?P=6588#T=C"
                                            },
                                            "layer": "kpi-COMPONENT"
                                        }
                                    },
                                    {
                                        "component": {
                                            "uuid": "kpi-b75037ac-9637-4b39-b50a-c3fc1c12dbd7",
                                            "properties": {
                                                "label": "worm gear screw",
                                                "item number": 4716,
                                                "item description": "Gear Worm Screw",
                                                "category": "gear",
                                                "price [Euro]": 0.54,
                                                "mass [g]": 0.6,
                                                "delivery time [days]": 12,
                                                "data source": "https://www.bricklink.com/v2/catalog/catalogitem.page?P=4716#T=C"
                                            },
                                            "layer": "kpi-COMPONENT"
                                        }
                                    }
                                ],
                                "assemblies": []
                            }
                        }
                    ]
                }
            },
            {
                "assembly": {
                    "uuid": "kpi-fa7e87ea-fcd1-48c9-ac1d-3b89a9295990",
                    "properties": {
                        "label": "axle assembly 2"
                    },
                    "layer": "kpi-ASSEMBLY",
                    "components": [],
                    "assemblies": [
                        {
                            "assembly": {
                                "uuid": "kpi-57d8e986-250c-462e-8c2f-9629f9cbcb2f",
                                "properties": {
                                    "label": [
                                        "rear axle 2 assembly"
                                    ]
                                },
                                "layer": "kpi-SUBASSEMBLY",
                                "components": [
                                    {
                                        "component": {
                                            "uuid": "kpi-82df0a1e-1a4b-4e19-9b2d-042e92e30995",
                                            "properties": {
                                                "label": "wheel l",
                                                "item number": "41896c04",
                                                "item description": "wheel 56",
                                                "category": "wheel",
                                                "related items": 41897,
                                                "price [Euro]": 0.45,
                                                "mass [g]": 23.0,
                                                "delivery time [days]": 5,
                                                "data source": "https://www.bricklink.com/v2/catalog/catalogitem.page?P=41896c04#T=C",
                                                "diameter [mm]": 56.0
                                            },
                                            "layer": "kpi-COMPONENT"
                                        }
                                    },
                                    {
                                        "component": {
                                            "uuid": "kpi-d38b046d-caaa-4fa2-93fc-74e47e7e8361",
                                            "properties": {
                                                "label": "wheel r",
                                                "item number": "41896c04",
                                                "item description": "wheel 56",
                                                "category": "wheel",
                                                "related items": 41897,
                                                "price [Euro]": 0.45,
                                                "mass [g]": 23.0,
                                                "delivery time [days]": 5,
                                                "data source": "https://www.bricklink.com/v2/catalog/catalogitem.page?P=41896c04#T=C",
                                                "diameter [mm]": 56.0
                                            },
                                            "layer": "kpi-COMPONENT"
                                        }
                                    },
                                    {
                                        "component": {
                                            "uuid": "kpi-d9168f87-204c-4bef-b94f-111585645529",
                                            "properties": {
                                                "label": "axle",
                                                "item number": 3708,
                                                "item description": "Axle 12 studs",
                                                "category": "axle",
                                                "price [Euro]": 0.02,
                                                "mass [g]": 1.82,
                                                "delivery time [days]": 7,
                                                "data source": "https://www.bricklink.com/v2/catalog/catalogitem.page?P=3708#T=S&O={%22iconly%22:0}",
                                                "dimension [studs]": 12
                                            },
                                            "layer": "kpi-COMPONENT"
                                        }
                                    }
                                ],
                                "assemblies": []
                            }
                        },
                        {
                            "assembly": {
                                "uuid": "kpi-9a3a5f3e-6a02-4487-9d05-54868903ec3c",
                                "properties": {
                                    "label": "front axle 2 assembly"
                                },
                                "layer": "kpi-SUBASSEMBLY",
                                "components": [
                                    {
                                        "component": {
                                            "uuid": "kpi-f6d95943-c15e-45ff-85ce-4752d4e95688",
                                            "properties": {
                                                "label": "wheel l",
                                                "item number": "41896c04",
                                                "item description": "wheel 56",
                                                "category": "wheel",
                                                "related items": 41897,
                                                "price [Euro]": 0.45,
                                                "mass [g]": 23.0,
                                                "delivery time [days]": 5,
                                                "data source": "https://www.bricklink.com/v2/catalog/catalogitem.page?P=41896c04#T=C",
                                                "diameter [mm]": 56.0
                                            },
                                            "layer": "kpi-COMPONENT"
                                        }
                                    },
                                    {
                                        "component": {
                                            "uuid": "kpi-cdabc198-d99e-4d31-bbf0-e997989254ff",
                                            "properties": {
                                                "label": "wheel r",
                                                "item number": "41896c04",
                                                "item description": "wheel 56",
                                                "category": "wheel",
                                                "related items": 41897,
                                                "price [Euro]": 0.45,
                                                "mass [g]": 23.0,
                                                "delivery time [days]": 5,
                                                "data source": "https://www.bricklink.com/v2/catalog/catalogitem.page?P=41896c04#T=C",
                                                "diameter [mm]": 56.0
                                            },
                                            "layer": "kpi-COMPONENT"
                                        }
                                    },
                                    {
                                        "component": {
                                            "uuid": "kpi-0832eeef-0369-4e41-b608-f43e8e45d19b",
                                            "properties": {
                                                "label": "axle",
                                                "item number": 3708,
                                                "item description": "Axle 12 studs",
                                                "category": "axle",
                                                "price [Euro]": 0.02,
                                                "mass [g]": 1.82,
                                                "delivery time [days]": 7,
                                                "data source": "https://www.bricklink.com/v2/catalog/catalogitem.page?P=3708#T=S&O={%22iconly%22:0}",
                                                "dimension [studs]": 12
                                            },
                                            "layer": "kpi-COMPONENT"
                                        }
                                    }
                                ],
                                "assemblies": []
                            }
                        }
                    ]
                }
            },
            {
                "assembly": {
                    "uuid": "kpi-8f489fc9-3a0b-410c-958f-58d14f76a31c",
                    "properties": {
                        "label": "Frame 2"
                    },
                    "layer": "kpi-ASSEMBLY",
                    "components": [
                        {
                            "component": {
                                "uuid": "kpi-309f5183-cbf3-40a3-80f4-0ef861454460",
                                "properties": {
                                    "label": "frame front",
                                    "item number": 32531,
                                    "item description": "Technic, Brick 4 x 6 Open Center",
                                    "category": "frame",
                                    "price [Euro]": 0.1,
                                    "mass [g]": 5.0,
                                    "delivery time [days]": 3,
                                    "data source": "https://www.bricklink.com/v2/catalog/catalogitem.page?P=32531&idColor=11#T=C&C=11",
                                    "dimension [studs]": "4 x 6 x 1"
                                },
                                "layer": "kpi-COMPONENT"
                            }
                        },
                        {
                            "component": {
                                "uuid": "kpi-45fa4c61-b780-45c9-ac1e-9ea2eee40a3a",
                                "properties": {
                                    "label": [
                                        "frame front up"
                                    ],
                                    "item number": 32531,
                                    "item description": "Technic, Brick 4 x 6 Open Center",
                                    "category": "frame",
                                    "price [Euro]": 0.1,
                                    "mass [g]": 5.0,
                                    "delivery time [days]": 3,
                                    "data source": "https://www.bricklink.com/v2/catalog/catalogitem.page?P=32531&idColor=11#T=C&C=11",
                                    "dimension [studs]": "4 x 6 x 1"
                                },
                                "layer": "kpi-COMPONENT"
                            }
                        },
                        {
                            "component": {
                                "uuid": "kpi-b583ae73-43ac-470c-8670-8bf071875fbc",
                                "properties": {
                                    "label": [
                                        "frame rear"
                                    ],
                                    "item number": 32531,
                                    "item description": "Technic, Brick 4 x 6 Open Center",
                                    "category": "frame",
                                    "price [Euro]": 0.1,
                                    "mass [g]": 5.0,
                                    "delivery time [days]": 3,
                                    "data source": "https://www.bricklink.com/v2/catalog/catalogitem.page?P=32531&idColor=11#T=C&C=11",
                                    "dimension [studs]": "4 x 6 x 1"
                                },
                                "layer": "kpi-COMPONENT"
                            }
                        },
                        {
                            "component": {
                                "uuid": "kpi-6444bb08-d8b2-4734-99f3-8432f3dbafad",
                                "properties": {
                                    "label": "crossblock pin",
                                    "item number": 48989,
                                    "item description": "Technic, Pin Connector Perpendicular 3L with 4 Pins",
                                    "category": "frame",
                                    "price [Euro]": 0.01,
                                    "mass [g]": 1.22,
                                    "delivery time [days]": 5,
                                    "data source": "https://www.bricklink.com/v2/catalog/catalogitem.page?P=48989&name=Technic,%20Pin%20Connector%20Perpendicular%203L%20with%204%20Pins&category=%5BTechnic,%20Connector%5D#T=S&O={%22iconly%22:0}",
                                    "dimension [studs]": "3 x 3 x 1"
                                },
                                "layer": "kpi-COMPONENT"
                            }
                        },
                        {
                            "component": {
                                "uuid": "kpi-51d5a0bf-bebb-453d-a7d4-7789032475c7",
                                "properties": {
                                    "label": "pin",
                                    "item number": 32556,
                                    "item description": "Technic, Pin 3L without Friction Ridges",
                                    "category": "frame",
                                    "price [Euro]": 0.1,
                                    "mass [g]": 0.25,
                                    "delivery time [days]": 3,
                                    "data source": "https://www.bricklink.com/v2/catalog/catalogitem.page?P=32556&name=Technic,%20Pin%203L%20without%20Friction%20Ridges&category=%5BTechnic,%20Pin%5D#T=S&O={%22iconly%22:0}",
                                    "dimension [studs]": 1
                                },
                                "layer": "kpi-COMPONENT"
                            }
                        },
                        {
                            "component": {
                                "uuid": "kpi-5dd6fa79-1226-4c45-b06a-ac01b439ac8b",
                                "properties": {
                                    "label": [
                                        "pin_1_2"
                                    ],
                                    "item number": 32556,
                                    "item description": "Technic, Pin 3L without Friction Ridges",
                                    "category": "frame",
                                    "price [Euro]": 0.1,
                                    "mass [g]": 0.25,
                                    "delivery time [days]": 3,
                                    "data source": "https://www.bricklink.com/v2/catalog/catalogitem.page?P=32556&name=Technic,%20Pin%203L%20without%20Friction%20Ridges&category=%5BTechnic,%20Pin%5D#T=S&O={%22iconly%22:0}",
                                    "dimension [studs]": 1
                                },
                                "layer": "kpi-COMPONENT"
                            }
                        },
                        {
                            "component": {
                                "uuid": "kpi-34f925f1-4c95-42a3-8ffe-6843ff7ab78c",
                                "properties": {
                                    "label": [
                                        "pin_2_1"
                                    ],
                                    "item number": 32556,
                                    "item description": "Technic, Pin 3L without Friction Ridges",
                                    "category": "frame",
                                    "price [Euro]": 0.1,
                                    "mass [g]": 0.25,
                                    "delivery time [days]": 3,
                                    "data source": "https://www.bricklink.com/v2/catalog/catalogitem.page?P=32556&name=Technic,%20Pin%203L%20without%20Friction%20Ridges&category=%5BTechnic,%20Pin%5D#T=S&O={%22iconly%22:0}",
                                    "dimension [studs]": 1
                                },
                                "layer": "kpi-COMPONENT"
                            }
                        },
                        {
                            "component": {
                                "uuid": "kpi-bbb480d2-683d-4adf-9e47-066ea78f1f75",
                                "properties": {
                                    "label": [
                                        "pin_2_2"
                                    ],
                                    "item number": 32556,
                                    "item description": "Technic, Pin 3L without Friction Ridges",
                                    "category": "frame",
                                    "price [Euro]": 0.1,
                                    "mass [g]": 0.25,
                                    "delivery time [days]": 3,
                                    "data source": "https://www.bricklink.com/v2/catalog/catalogitem.page?P=32556&name=Technic,%20Pin%203L%20without%20Friction%20Ridges&category=%5BTechnic,%20Pin%5D#T=S&O={%22iconly%22:0}",
                                    "dimension [studs]": 1
                                },
                                "layer": "kpi-COMPONENT"
                            }
                        }
                    ],
                    "assemblies": [
                        {
                            "assembly": {
                                "uuid": "kpi-2d020492-fa77-410c-b85d-5ec6293ff9e0",
                                "properties": {
                                    "label": "inbetween r"
                                },
                                "layer": "kpi-SUBASSEMBLY",
                                "components": [
                                    {
                                        "component": {
                                            "uuid": "kpi-d1e1a310-ea1b-40d1-b82a-eb9f84a57689",
                                            "properties": {
                                                "label": "Brick 1x8",
                                                "item number": 3702,
                                                "item description": "Technic, Brick 1 x 8 with Holes",
                                                "category": "frame",
                                                "price [Euro]": 0.01,
                                                "mass [g]": 2.85,
                                                "delivery time [days]": 5,
                                                "data source": "https://www.bricklink.com/v2/catalog/catalogitem.page?P=3702#T=C",
                                                "dimension [studs]": "1 x 8 x 1"
                                            },
                                            "layer": "kpi-COMPONENT"
                                        }
                                    }
                                ],
                                "assemblies": [
                                    {
                                        "assembly": {
                                            "uuid": "kpi-c8061c38-258a-4fcb-8a92-8f538e107fb5",
                                            "properties": {
                                                "label": "Bricks"
                                            },
                                            "layer": "kpi-SUBASSEMBLY",
                                            "components": [
                                                {
                                                    "component": {
                                                        "uuid": "kpi-88ae91ab-df2d-4a75-8d0d-1969f535c2ec",
                                                        "properties": {
                                                            "label": [
                                                                "brick 2_2"
                                                            ],
                                                            "item number": 3700,
                                                            "item description": "Technic, Brick 1 x 2 with Hole",
                                                            "category": "frame",
                                                            "price [Euro]": 0.01,
                                                            "mass [g]": 0.82,
                                                            "delivery time [days]": 3,
                                                            "data source": "https://www.bricklink.com/v2/catalog/catalogitem.page?P=3700#T=C",
                                                            "dimension [studs]": "1 x 2"
                                                        },
                                                        "layer": "kpi-COMPONENT"
                                                    }
                                                },
                                                {
                                                    "component": {
                                                        "uuid": "kpi-349f3024-2cbe-42ae-b93c-1189c016b594",
                                                        "properties": {
                                                            "label": "Brick 2_1",
                                                            "item number": 3700,
                                                            "item description": "Technic, Brick 1 x 2 with Hole",
                                                            "category": "frame",
                                                            "price [Euro]": 0.01,
                                                            "mass [g]": 0.82,
                                                            "delivery time [days]": 3,
                                                            "data source": "https://www.bricklink.com/v2/catalog/catalogitem.page?P=3700#T=C",
                                                            "dimension [studs]": "1 x 2"
                                                        },
                                                        "layer": "kpi-COMPONENT"
                                                    }
                                                }
                                            ],
                                            "assemblies": []
                                        }
                                    },
                                    {
                                        "assembly": {
                                            "uuid": "kpi-c4989709-1603-4cb0-9eac-478d607b5ae9",
                                            "properties": {
                                                "label": [
                                                    "bricks 2"
                                                ]
                                            },
                                            "layer": "kpi-SUBASSEMBLY",
                                            "components": [
                                                {
                                                    "component": {
                                                        "uuid": "kpi-e90b86db-7c5c-4008-bc28-9c092a82ee94",
                                                        "properties": {
                                                            "label": [
                                                                "brick 2_2"
                                                            ],
                                                            "item number": 3700,
                                                            "item description": "Technic, Brick 1 x 2 with Hole",
                                                            "category": "frame",
                                                            "price [Euro]": 0.01,
                                                            "mass [g]": 0.82,
                                                            "delivery time [days]": 3,
                                                            "data source": "https://www.bricklink.com/v2/catalog/catalogitem.page?P=3700#T=C",
                                                            "dimension [studs]": "1 x 2"
                                                        },
                                                        "layer": "kpi-COMPONENT"
                                                    }
                                                },
                                                {
                                                    "component": {
                                                        "uuid": "kpi-27fa4b84-58ca-4551-8dd0-7765563005b0",
                                                        "properties": {
                                                            "label": "Brick 2_1",
                                                            "item number": 3700,
                                                            "item description": "Technic, Brick 1 x 2 with Hole",
                                                            "category": "frame",
                                                            "price [Euro]": 0.01,
                                                            "mass [g]": 0.82,
                                                            "delivery time [days]": 3,
                                                            "data source": "https://www.bricklink.com/v2/catalog/catalogitem.page?P=3700#T=C",
                                                            "dimension [studs]": "1 x 2"
                                                        },
                                                        "layer": "kpi-COMPONENT"
                                                    }
                                                }
                                            ],
                                            "assemblies": []
                                        }
                                    }
                                ]
                            }
                        },
                        {
                            "assembly": {
                                "uuid": "kpi-14cf11bd-a055-4bd8-82fd-b722e993139b",
                                "properties": {
                                    "label": [
                                        "inbetween l"
                                    ]
                                },
                                "layer": "kpi-SUBASSEMBLY",
                                "components": [
                                    {
                                        "component": {
                                            "uuid": "kpi-fd52f854-48c1-482a-bdc3-0b56b87efb18",
                                            "properties": {
                                                "label": "Brick 1x8",
                                                "item number": 3702,
                                                "item description": "Technic, Brick 1 x 8 with Holes",
                                                "category": "frame",
                                                "price [Euro]": 0.01,
                                                "mass [g]": 2.85,
                                                "delivery time [days]": 5,
                                                "data source": "https://www.bricklink.com/v2/catalog/catalogitem.page?P=3702#T=C",
                                                "dimension [studs]": "1 x 8 x 1"
                                            },
                                            "layer": "kpi-COMPONENT"
                                        }
                                    }
                                ],
                                "assemblies": [
                                    {
                                        "assembly": {
                                            "uuid": "kpi-3e321295-9e87-4ee8-a98a-5499a087b47f",
                                            "properties": {
                                                "label": "Bricks"
                                            },
                                            "layer": "kpi-SUBASSEMBLY",
                                            "components": [
                                                {
                                                    "component": {
                                                        "uuid": "kpi-d75056d5-10ae-4e9a-8173-1ba8f9fbb868",
                                                        "properties": {
                                                            "label": [
                                                                "brick 2_2"
                                                            ],
                                                            "item number": 3700,
                                                            "item description": "Technic, Brick 1 x 2 with Hole",
                                                            "category": "frame",
                                                            "price [Euro]": 0.01,
                                                            "mass [g]": 0.82,
                                                            "delivery time [days]": 3,
                                                            "data source": "https://www.bricklink.com/v2/catalog/catalogitem.page?P=3700#T=C",
                                                            "dimension [studs]": "1 x 2"
                                                        },
                                                        "layer": "kpi-COMPONENT"
                                                    }
                                                },
                                                {
                                                    "component": {
                                                        "uuid": "kpi-483b4bb2-5e53-4fd3-a1f3-131fc79ab295",
                                                        "properties": {
                                                            "label": "Brick 2_1",
                                                            "item number": 3700,
                                                            "item description": "Technic, Brick 1 x 2 with Hole",
                                                            "category": "frame",
                                                            "price [Euro]": 0.01,
                                                            "mass [g]": 0.82,
                                                            "delivery time [days]": 3,
                                                            "data source": "https://www.bricklink.com/v2/catalog/catalogitem.page?P=3700#T=C",
                                                            "dimension [studs]": "1 x 2"
                                                        },
                                                        "layer": "kpi-COMPONENT"
                                                    }
                                                }
                                            ],
                                            "assemblies": []
                                        }
                                    },
                                    {
                                        "assembly": {
                                            "uuid": "kpi-4895085c-6b79-45e4-a1b0-9202f1fa88b5",
                                            "properties": {
                                                "label": [
                                                    "bricks 2"
                                                ]
                                            },
                                            "layer": "kpi-SUBASSEMBLY",
                                            "components": [
                                                {
                                                    "component": {
                                                        "uuid": "kpi-1fb2f8b4-89ee-47ea-ad42-18ef155b4795",
                                                        "properties": {
                                                            "label": [
                                                                "brick 2_2"
                                                            ],
                                                            "item number": 3700,
                                                            "item description": "Technic, Brick 1 x 2 with Hole",
                                                            "category": "frame",
                                                            "price [Euro]": 0.01,
                                                            "mass [g]": 0.82,
                                                            "delivery time [days]": 3,
                                                            "data source": "https://www.bricklink.com/v2/catalog/catalogitem.page?P=3700#T=C",
                                                            "dimension [studs]": "1 x 2"
                                                        },
                                                        "layer": "kpi-COMPONENT"
                                                    }
                                                },
                                                {
                                                    "component": {
                                                        "uuid": "kpi-6291b41a-6f0b-4314-a1ed-ddb79987fffa",
                                                        "properties": {
                                                            "label": "Brick 2_1",
                                                            "item number": 3700,
                                                            "item description": "Technic, Brick 1 x 2 with Hole",
                                                            "category": "frame",
                                                            "price [Euro]": 0.01,
                                                            "mass [g]": 0.82,
                                                            "delivery time [days]": 3,
                                                            "data source": "https://www.bricklink.com/v2/catalog/catalogitem.page?P=3700#T=C",
                                                            "dimension [studs]": "1 x 2"
                                                        },
                                                        "layer": "kpi-COMPONENT"
                                                    }
                                                }
                                            ],
                                            "assemblies": []
                                        }
                                    }
                                ]
                            }
                        }
                    ]
                }
            }
        ]
    }
}