review_id,label,scores,predictions,predictions_youden
280,human,2.2024301870260388e-05,human,human
413,human,2.091140231641475e-05,human,human
1171,human,0.7116852402687073,llm,llm
484,human,5.614270776277408e-05,human,human
357,human,1.9322162188473158e-05,human,human
496,human,2.476212102919817e-05,human,human
928,human,2.2653030100627802e-05,human,human
942,human,3.50455375155434e-05,human,human
869,human,0.95756596326828,llm,llm
866,human,2.3976544980541803e-05,human,human
939,human,4.594147685565986e-05,human,human
1070,human,0.9995602965354919,llm,llm
896,human,2.740397394518368e-05,human,human
968,human,4.65071207145229e-05,human,human
414,human,2.376862357778009e-05,human,human
1067,human,3.2014460884965956e-05,human,human
430,human,0.39306536316871643,human,human
901,human,5.698600580217317e-05,human,human
1146,human,2.388120446994435e-05,human,human
1275,human,2.460640280332882e-05,human,human
1298,human,2.691390363906976e-05,human,human
1350,human,7.583552360301837e-05,human,human
249,human,2.3725027858745307e-05,human,human
344,human,0.00010081384243676439,human,human
394,human,2.498113644833211e-05,human,human
419,human,1.859676012827549e-05,human,human
457,human,2.741830212471541e-05,human,human
492,human,3.0396560759982094e-05,human,human
390,human,2.168647370126564e-05,human,human
495,human,2.767247315205168e-05,human,human
505,human,2.323734952369705e-05,human,human
266,human,2.0392022634041496e-05,human,human
333,human,2.419654992991127e-05,human,human
384,human,6.557791493833065e-05,human,human
468,human,2.3192031221697107e-05,human,human
937,human,2.2142427042126656e-05,human,human
1132,human,5.0692553486442193e-05,human,human
1190,human,2.544174094509799e-05,human,human
1121,human,3.331011612317525e-05,human,human
1094,human,2.553040576458443e-05,human,human
1135,human,0.0001379341265419498,human,human
355,human,3.103578637819737e-05,human,human
405,human,2.4876202587620355e-05,human,human
293,human,2.086831045744475e-05,human,human
425,human,2.9839286071364768e-05,human,human
462,human,2.327363472431898e-05,human,human
504,human,2.3423353923135437e-05,human,human
877,human,8.768818224780262e-05,human,human
1002,human,3.412044679862447e-05,human,human
1013,human,1.789251109585166e-05,human,human
1022,human,6.646200199611485e-05,human,human
1037,human,2.5488005121587776e-05,human,human
1065,human,3.368138277437538e-05,human,human
1080,human,2.7350924938218668e-05,human,human
1093,human,3.452605233178474e-05,human,human
1096,human,4.161538527114317e-05,human,human
1145,human,4.7715082473587245e-05,human,human
925,human,2.376032898609992e-05,human,human
1142,human,2.138594754796941e-05,human,human
1178,human,2.892136399168521e-05,human,human
316,human,2.399919139861595e-05,human,human
418,human,8.721841732040048e-05,human,human
303,human,2.1426938474178314e-05,human,human
1012,human,5.025655627832748e-05,human,human
1074,human,2.2419035303755663e-05,human,human
257,human,2.9189581255195662e-05,human,human
290,human,0.9760802984237671,llm,llm
441,human,2.1077157725812867e-05,human,human
447,human,3.38756617566105e-05,human,human
1174,human,4.804826676263474e-05,human,human
959,human,2.460586438246537e-05,human,human
1110,human,4.1011979192262515e-05,human,human
1189,human,2.762495932984166e-05,human,human
332,human,4.530920705292374e-05,human,human
887,human,3.613837907323614e-05,human,human
931,human,7.394299609586596e-05,human,human
914,human,2.255778781545814e-05,human,human
1055,human,3.817945616901852e-05,human,human
1086,human,4.3412583181634545e-05,human,human
1160,human,0.040488969534635544,human,human
886,human,7.876145537011325e-05,human,human
918,human,3.915678462362848e-05,human,human
998,human,2.195510023739189e-05,human,human
958,human,0.9980629086494446,llm,llm
1186,human,7.876145537011325e-05,human,human
1127,human,2.520019916119054e-05,human,human
1130,human,2.0781704733963124e-05,human,human
1119,human,2.5454019123571925e-05,human,human
876,human,0.8529059290885925,llm,llm
982,human,4.7905796236591414e-05,human,human
1137,human,2.502549068594817e-05,human,human
962,human,3.1483115890296176e-05,human,human
513,human,2.2885322323418222e-05,human,human
1052,human,2.212442268501036e-05,human,human
1172,human,1.9127897758153267e-05,human,human
1211,human,3.633999949670397e-05,human,human
1208,human,2.444003439450171e-05,human,human
302,human,0.0036924881860613823,human,human
979,human,2.76943883363856e-05,human,human
977,human,3.516515425872058e-05,human,human
988,human,2.1221079805400223e-05,human,human
948,human,2.5909652322297916e-05,human,human
974,human,2.8851669412688352e-05,human,human
1017,human,2.3404752937494777e-05,human,human
1007,human,2.3608095943927765e-05,human,human
852,human,3.091845064773224e-05,human,human
870,human,2.859787127817981e-05,human,human
1034,human,3.165302041452378e-05,human,human
