review_id,label,scores,predictions,predictions_youden
393,human,0.003859468037262559,human,human
1106,human,0.030265972018241882,human,human
456,human,0.00042785811820067465,human,human
381,human,0.0006447576452046633,human,human
250,human,0.002867621835321188,human,human
1091,human,0.019333714619278908,human,human
322,human,0.001190866925753653,human,human
899,human,0.0007632514461874962,human,human
1025,human,0.00041896995389834046,human,human
1033,human,0.0005500718834809959,human,human
1175,human,0.004320349544286728,human,human
934,human,0.003214175347238779,human,human
960,human,0.00023485574638471007,human,human
1045,human,0.0002970006607938558,human,human
328,human,0.902000367641449,llm,llm
265,human,0.0001670274359639734,human,human
1169,human,0.0005230291280895472,human,human
857,human,0.0031996092293411493,human,human
1043,human,0.0024536079727113247,human,human
480,human,0.038382068276405334,human,human
861,human,0.0002556693507358432,human,human
446,human,0.004614169243723154,human,human
956,human,0.00025448109954595566,human,human
488,human,0.00024952212697826326,human,human
856,human,0.000560168584343046,human,human
894,human,0.0008461972465738654,human,human
1321,human,0.001057584653608501,human,human
1305,human,0.00023849736317060888,human,human
1307,human,0.0029421483632177114,human,human
1319,human,0.00037833445821888745,human,human
1357,human,0.09585636109113693,human,human
1339,human,0.0013956809416413307,human,human
353,human,0.0006717920769006014,human,human
364,human,0.3585164546966553,human,llm
253,human,0.00022884942882228643,human,human
481,human,0.7633180618286133,llm,llm
494,human,0.00022577017080038786,human,human
334,human,0.005321005824953318,human,human
270,human,0.0006944701890461147,human,human
370,human,0.0002847100840881467,human,human
374,human,0.0014640158042311668,human,human
459,human,0.03775777295231819,human,human
499,human,0.0002462328120600432,human,human
506,human,0.0002362558589084074,human,human
511,human,0.0003788512840401381,human,human
1150,human,0.0033597955480217934,human,human
1101,human,0.00026994923246093094,human,human
1072,human,0.01106403861194849,human,human
1083,human,0.002509316196665168,human,human
1112,human,0.0003925758646801114,human,human
906,human,0.0006189938285388052,human,human
1079,human,0.0029034637846052647,human,human
1156,human,0.00848578941076994,human,human
336,human,0.0002629363152664155,human,human
401,human,0.00033317680936306715,human,human
503,human,0.6859188079833984,llm,llm
274,human,0.0015155741712078452,human,human
286,human,0.0004529762372840196,human,human
289,human,0.0002299397310707718,human,human
347,human,0.0002375417243456468,human,human
373,human,0.00031841330928727984,human,human
382,human,0.000490895239636302,human,human
395,human,0.000892501964699477,human,human
400,human,0.0007619906682521105,human,human
369,human,0.28644537925720215,human,human
945,human,0.00042177102295681834,human,human
1053,human,0.0005203538457863033,human,human
1054,human,0.00018452186486683786,human,human
1061,human,0.0003665552940219641,human,human
1147,human,0.00020240794401615858,human,human
1084,human,0.0026098249945789576,human,human
1191,human,0.0038213636726140976,human,human
261,human,0.015507366508245468,human,human
507,human,0.0005402276292443275,human,human
1069,human,0.0004792408144567162,human,human
1141,human,0.0002791276201605797,human,human
1209,human,0.0010550795122981071,human,human
912,human,0.0013051056303083897,human,human
1035,human,0.00041927318670786917,human,human
1148,human,0.00045939022675156593,human,human
423,human,0.0003634385939221829,human,human
1031,human,0.00018005972378887236,human,human
1082,human,0.0005147031042724848,human,human
310,human,0.0005559747223742306,human,human
356,human,0.0007670781924389303,human,human
389,human,0.000261216948274523,human,human
470,human,0.00029455189360305667,human,human
478,human,0.0003624797973316163,human,human
377,human,0.00019799986330326647,human,human
515,human,0.00020304869394749403,human,human
1109,human,0.027967384085059166,human,human
300,human,0.0004904678207822144,human,human
483,human,0.0023805866949260235,human,human
444,human,0.0008966317400336266,human,human
315,human,0.00024776544887572527,human,human
929,human,0.0002949042245745659,human,human
1115,human,0.00035138163366355,human,human
1154,human,0.00023185570898931473,human,human
1173,human,0.11837588250637054,human,human
1206,human,0.004160755779594183,human,human
907,human,0.00035460226354189217,human,human
1044,human,0.00336154131218791,human,human
255,human,0.00025982203078456223,human,human
1158,human,0.0025426053907722235,human,human
853,human,0.003876954084262252,human,human
1165,human,0.0032238997519016266,human,human
885,human,0.00040270554018206894,human,human
1194,human,0.0007912087603472173,human,human
