review_id,label,scores,predictions,predictions_youden
254,human,1.3406379366642796e-05,human,human
449,human,1.2417972357070539e-05,human,human
863,human,0.00014139004633761942,human,human
497,human,1.1409399121475872e-05,human,human
915,human,1.993820296775084e-05,human,human
1077,human,1.4648026990471408e-05,human,human
1188,human,1.7470589227741584e-05,human,human
335,human,1.7303189451922663e-05,human,human
1021,human,1.0698438018152956e-05,human,human
1197,human,2.133036105078645e-05,human,human
1075,human,1.073269231710583e-05,human,human
329,human,1.0339128493797034e-05,human,human
482,human,1.551785862830002e-05,human,human
953,human,1.0341731467633508e-05,human,human
1062,human,1.5600418919348158e-05,human,human
950,human,1.3100168871460482e-05,human,human
1027,human,1.9261669876868837e-05,human,human
903,human,1.2108375813113526e-05,human,human
1117,human,1.7495465726824477e-05,human,human
952,human,1.0431751434225589e-05,human,human
859,human,9.647452316130511e-06,human,human
252,human,1.2460332982300315e-05,human,human
295,human,1.0121319974132348e-05,human,human
1071,human,1.499640529800672e-05,human,human
487,human,1.0629811185935978e-05,human,human
298,human,1.1221338354516774e-05,human,human
415,human,1.4388279851118568e-05,human,human
486,human,1.9316081306897104e-05,human,human
880,human,1.1541092135303188e-05,human,human
1003,human,2.7629226678982377e-05,human,human
981,human,1.734801298880484e-05,human,human
1133,human,1.3697725989914034e-05,human,human
1294,human,1.1717247616616078e-05,human,human
1316,human,1.4091137018112931e-05,human,human
1310,human,9.988247256842442e-06,human,human
1355,human,2.921977466030512e-05,human,human
273,human,2.9346863811952062e-05,human,human
318,human,1.171782878373051e-05,human,human
460,human,1.8097929569194093e-05,human,human
396,human,9.758453415997792e-06,human,human
304,human,1.1413578249630518e-05,human,human
323,human,1.0658192877599504e-05,human,human
339,human,1.1872358300024644e-05,human,human
376,human,1.0614829079713672e-05,human,human
463,human,1.1716355402313638e-05,human,human
516,human,1.2742298167722765e-05,human,human
406,human,9.881789083010517e-06,human,human
983,human,1.1602992344705854e-05,human,human
1092,human,1.2990641153010074e-05,human,human
961,human,3.343391654198058e-05,human,human
1124,human,1.0642470442689955e-05,human,human
1125,human,1.0464203114679549e-05,human,human
313,human,9.946347745426465e-06,human,human
448,human,2.9427323170239106e-05,human,human
392,human,1.1306035048619378e-05,human,human
420,human,1.1546640052984003e-05,human,human
451,human,2.8076197850168683e-05,human,human
973,human,1.0998456673405599e-05,human,human
1024,human,1.3373126421356574e-05,human,human
1058,human,9.570742804498877e-06,human,human
1199,human,1.9171176973031834e-05,human,human
1201,human,3.5287368518766016e-05,human,human
922,human,1.47779119288316e-05,human,human
971,human,1.1004194675479084e-05,human,human
985,human,1.1299557627353352e-05,human,human
1099,human,1.064852131094085e-05,human,human
1207,human,1.1602859558479395e-05,human,human
409,human,1.1858679499709979e-05,human,human
476,human,1.0317241503798869e-05,human,human
306,human,1.3769314136879984e-05,human,human
317,human,1.1894661838596221e-05,human,human
455,human,1.1586063919821754e-05,human,human
1162,human,0.00015641220670659095,human,human
1163,human,1.673451879469212e-05,human,human
1019,human,2.6676189008867368e-05,human,human
1131,human,1.3631008187076077e-05,human,human
269,human,1.1453073057055008e-05,human,human
439,human,1.1279317732260097e-05,human,human
338,human,1.536140189273283e-05,human,human
421,human,1.048427202476887e-05,human,human
970,human,1.942736707860604e-05,human,human
978,human,1.2031910955556668e-05,human,human
1018,human,1.103194517781958e-05,human,human
1068,human,6.175463204272091e-05,human,human
1090,human,1.422850982635282e-05,human,human
1118,human,2.6770019758259878e-05,human,human
1134,human,1.3504748494597152e-05,human,human
1195,human,3.670003934530541e-05,human,human
1203,human,1.0091960575664416e-05,human,human
1205,human,1.85849148692796e-05,human,human
1212,human,1.0315873623767402e-05,human,human
1138,human,1.9550219803932123e-05,human,human
285,human,9.84403413895052e-06,human,human
438,human,4.814389831153676e-05,human,human
1151,human,1.0819137969519943e-05,human,human
485,human,1.0266792742186226e-05,human,human
890,human,1.487828376411926e-05,human,human
1187,human,1.111615802074084e-05,human,human
932,human,1.0634425052558072e-05,human,human
854,human,1.13249752757838e-05,human,human
1184,human,6.138953904155642e-05,human,human
1105,human,1.1900902791239787e-05,human,human
1168,human,9.759374734130688e-06,human,human
1050,human,1.4720048056915402e-05,human,human
904,human,1.215117663377896e-05,human,human
1023,human,1.181689731311053e-05,human,human
1032,human,1.1326259482302703e-05,human,human
855,human,1.0429584108351264e-05,human,human
