review_id,label,scores,predictions,predictions_youden
280,human,9.04830958461389e-05,human,human
413,human,6.756594666512683e-05,human,human
1171,human,0.0009730735328048468,human,human
484,human,0.00034317956306040287,human,human
357,human,5.168309871805832e-05,human,human
496,human,0.0001134457706939429,human,human
928,human,7.491306314477697e-05,human,human
942,human,0.0004003321810159832,human,human
869,human,0.6413079500198364,llm,llm
866,human,7.816580182407051e-05,human,human
939,human,0.0001094151521101594,human,human
1070,human,0.0010846416698768735,human,human
896,human,5.5096897995099425e-05,human,human
968,human,0.00041026106919161975,human,human
414,human,6.411861249944195e-05,human,human
1067,human,6.58770150039345e-05,human,human
430,human,0.9985517859458923,llm,llm
901,human,0.00011099842231487855,human,human
1146,human,8.01773348939605e-05,human,human
1275,human,6.199128984007984e-05,human,human
1298,human,5.6663040595594794e-05,human,human
1350,human,0.0011028102599084377,human,human
249,human,6.817797111580148e-05,human,human
344,human,0.0011623179307207465,human,human
394,human,6.49238791083917e-05,human,human
419,human,5.279012839309871e-05,human,human
457,human,9.105280332732946e-05,human,human
492,human,6.704850238747895e-05,human,human
390,human,6.422919977921993e-05,human,human
495,human,5.9319703723303974e-05,human,human
505,human,6.0190865042386577e-05,human,human
266,human,4.514228930929676e-05,human,human
333,human,6.670029688393697e-05,human,human
384,human,0.47395193576812744,human,human
468,human,7.783836190355942e-05,human,human
937,human,6.390063936123624e-05,human,human
1132,human,9.751044126460329e-05,human,human
1190,human,6.925062189111486e-05,human,human
1121,human,6.421290891012177e-05,human,human
1094,human,8.171514491550624e-05,human,human
1135,human,0.002196480520069599,human,human
355,human,8.021105895750225e-05,human,human
405,human,7.329627987928689e-05,human,human
293,human,6.405554449884221e-05,human,human
425,human,7.553627801826224e-05,human,human
462,human,8.458973024971783e-05,human,human
504,human,9.346231672680005e-05,human,human
877,human,0.005377521272748709,human,human
1002,human,0.00010699412086978555,human,human
1013,human,4.610399264493026e-05,human,human
1022,human,0.00010629124153638259,human,human
1037,human,7.76365923229605e-05,human,human
1065,human,8.605364564573392e-05,human,human
1080,human,0.00010111952724400908,human,human
1093,human,5.263937055133283e-05,human,human
1096,human,0.00011380202340660617,human,human
1145,human,0.00017454949556849897,human,human
925,human,5.885473728994839e-05,human,human
1142,human,6.150508852442726e-05,human,human
1178,human,7.951005682116374e-05,human,human
316,human,9.641045471653342e-05,human,human
418,human,0.09340166300535202,human,human
303,human,9.15652999537997e-05,human,human
1012,human,0.00011506617011036724,human,human
1074,human,6.926700007170439e-05,human,human
257,human,6.694333569612354e-05,human,human
290,human,0.00014176683907862753,human,human
441,human,5.452580808196217e-05,human,human
447,human,8.759950287640095e-05,human,human
1174,human,0.00010799126175697893,human,human
959,human,6.222577212611213e-05,human,human
1110,human,9.606924140825868e-05,human,human
1189,human,6.314604252111167e-05,human,human
332,human,8.414724288741127e-05,human,human
887,human,6.28130292170681e-05,human,human
931,human,7.596421346534044e-05,human,human
914,human,5.990140562062152e-05,human,human
1055,human,0.39609992504119873,human,human
1086,human,0.00013396293797995895,human,human
1160,human,0.0001909986458485946,human,human
886,human,0.0004939539358019829,human,human
918,human,0.00019487016834318638,human,human
998,human,5.412596510723233e-05,human,human
958,human,0.7778608798980713,llm,llm
1186,human,0.0004939539358019829,human,human
1127,human,7.01912576914765e-05,human,human
1130,human,5.2918505389243364e-05,human,human
1119,human,6.71694433549419e-05,human,human
876,human,0.001112179714255035,human,human
982,human,9.086320642381907e-05,human,human
1137,human,8.037353109102696e-05,human,human
962,human,9.531024261377752e-05,human,human
513,human,7.281676516868174e-05,human,human
1052,human,5.0717408157652244e-05,human,human
1172,human,7.626906153745949e-05,human,human
1211,human,8.393894677283242e-05,human,human
1208,human,7.323815225390717e-05,human,human
302,human,0.8441230058670044,llm,llm
979,human,0.000192682578926906,human,human
977,human,0.00012070947559550405,human,human
988,human,6.930300878593698e-05,human,human
948,human,5.1553746743593365e-05,human,human
974,human,8.295747102238238e-05,human,human
1017,human,6.94248519721441e-05,human,human
1007,human,6.293773913057521e-05,human,human
852,human,8.2142032624688e-05,human,human
870,human,0.000103086291346699,human,human
1034,human,5.984237577649765e-05,human,human
