review_id,label,scores,predictions,predictions_youden
267,human,0.00013410099199973047,human,human
284,human,0.9925761222839355,llm,llm
383,human,0.3762875199317932,human,human
954,human,0.00010731734073488042,human,human
351,human,0.00012473826063796878,human,human
867,human,0.00018666645337361842,human,human
860,human,0.00027856958331540227,human,human
862,human,0.00013551664596889168,human,human
881,human,0.10816237330436707,human,human
1198,human,0.00018935253319796175,human,human
872,human,0.0003789833281189203,human,human
1097,human,0.0002437429066048935,human,human
865,human,0.00014145208115223795,human,human
868,human,0.00019138767675030977,human,human
1006,human,0.0001106543350033462,human,human
936,human,0.0002308157127117738,human,human
858,human,0.00019736711692530662,human,human
957,human,0.00013985861733090132,human,human
909,human,0.00012164634244982153,human,human
888,human,0.00012168301327619702,human,human
1269,human,0.00011786613322328776,human,human
1276,human,0.0001453803270123899,human,human
1301,human,0.00012469093780964613,human,human
1315,human,0.0003643895615823567,human,human
1318,human,0.0001846153027145192,human,human
292,human,0.00010809532250277698,human,human
346,human,0.000100304554507602,human,human
366,human,0.00022139609791338444,human,human
371,human,0.00010291157377650961,human,human
399,human,0.00013771529484074563,human,human
435,human,0.0001399962930008769,human,human
466,human,0.999183714389801,llm,llm
490,human,0.0002625034539960325,human,human
431,human,0.00010018057946581393,human,human
348,human,0.00011577110853977501,human,human
262,human,0.00015517178690060973,human,human
305,human,0.00012424348096828908,human,human
279,human,0.00012881583825219423,human,human
301,human,0.00033249048283323646,human,human
309,human,0.00015865937166381627,human,human
1047,human,0.00013977701019030064,human,human
1157,human,0.014005569741129875,human,human
1204,human,0.00010330090299248695,human,human
385,human,0.0001314124237978831,human,human
387,human,0.0001940186193678528,human,human
429,human,0.00012603311915881932,human,human
471,human,0.00011613885726546869,human,human
500,human,0.00014864928380120546,human,human
871,human,0.0001327398349530995,human,human
900,human,0.0054543400183320045,human,human
964,human,0.00018068647477775812,human,human
1010,human,0.00012854124361183494,human,human
1011,human,0.0001388177479384467,human,human
1059,human,0.0003412986407056451,human,human
1089,human,0.00015100219752639532,human,human
1104,human,0.00017635927360970527,human,human
1139,human,0.0003177737526129931,human,human
1185,human,0.00017887353897094727,human,human
1196,human,0.0001821537152864039,human,human
1202,human,0.00035096248029731214,human,human
967,human,0.00012736204371321946,human,human
1038,human,0.00012761061952915043,human,human
359,human,0.00014381101937033236,human,human
433,human,0.00017717707669362426,human,human
287,human,0.00011182473826920614,human,human
331,human,0.0008623505127616227,human,human
465,human,0.00023763142235111445,human,human
517,human,0.0002038910606643185,human,human
916,human,0.00022232836636248976,human,human
949,human,0.000110938839497976,human,human
1015,human,0.0002101253776345402,human,human
898,human,0.9991456270217896,llm,llm
947,human,0.0001173127893707715,human,human
403,human,0.0001138005027314648,human,human
436,human,0.0001260909193661064,human,human
440,human,0.002391920890659094,human,human
1128,human,0.0001429772237315774,human,human
908,human,0.00022289782646112144,human,human
930,human,9.709918958833441e-05,human,human
975,human,0.950393795967102,llm,llm
1029,human,0.00014405502588488162,human,human
1049,human,0.9763972759246826,llm,llm
1078,human,0.0004081059596501291,human,human
1081,human,0.9990536570549011,llm,llm
1113,human,0.00012208573753014207,human,human
1180,human,0.00014608513447456062,human,human
895,human,0.00013554857287090272,human,human
965,human,0.0001380287139909342,human,human
1014,human,0.00023987109307199717,human,human
1020,human,0.00015270047879312187,human,human
1076,human,0.00016984844114631414,human,human
941,human,0.00010692539217416197,human,human
1100,human,0.0001380287139909342,human,human
992,human,0.00017564503650646657,human,human
1041,human,0.00014700194878969342,human,human
1064,human,0.00013336798292584717,human,human
999,human,0.0001067475022864528,human,human
993,human,0.00011210511001991108,human,human
864,human,0.0007956566987559199,human,human
910,human,0.00012395958765409887,human,human
1140,human,0.00010822836338775232,human,human
1144,human,0.00022062235802877694,human,human
951,human,0.00011354360322002321,human,human
893,human,0.0004144292906858027,human,human
889,human,0.00013134077016729861,human,human
1129,human,0.0001533139729872346,human,human
980,human,0.00012591756239999086,human,human
1103,human,0.00010053639562102035,human,human
