review_id,label,scores,predictions,predictions_youden
280,human,2.1522741008084267e-05,human,human
413,human,2.165276964660734e-05,human,human
1171,human,0.0005762370419688523,human,human
484,human,3.503838524920866e-05,human,human
357,human,1.842160418163985e-05,human,human
496,human,2.4243276129709557e-05,human,human
928,human,2.1814414139953442e-05,human,human
942,human,2.4039161871769466e-05,human,human
869,human,3.882407327182591e-05,human,human
866,human,2.2339087081491016e-05,human,human
939,human,2.848543408617843e-05,human,human
1070,human,2.7019936169381253e-05,human,human
896,human,1.9534265447873622e-05,human,human
968,human,2.929049514932558e-05,human,human
414,human,2.0751658666995354e-05,human,human
1067,human,2.1885551177547313e-05,human,human
430,human,3.8703856262145564e-05,human,human
901,human,2.5990919311880134e-05,human,human
1146,human,2.1046947949798778e-05,human,human
1275,human,2.287917050125543e-05,human,human
1298,human,2.3334949219133705e-05,human,human
1350,human,2.385498009971343e-05,human,human
249,human,2.0347228200989775e-05,human,human
344,human,3.235456460970454e-05,human,human
394,human,2.04999068955658e-05,human,human
419,human,1.6484587831655517e-05,human,human
457,human,2.3484548364649527e-05,human,human
492,human,2.1110146917635575e-05,human,human
390,human,2.1257257685647346e-05,human,human
495,human,2.4650487830513157e-05,human,human
505,human,2.2131787773105316e-05,human,human
266,human,2.0230518202879466e-05,human,human
333,human,2.4474717065459117e-05,human,human
384,human,3.990522236563265e-05,human,human
468,human,2.3656481062062085e-05,human,human
937,human,1.7925067368196324e-05,human,human
1132,human,2.47979951382149e-05,human,human
1190,human,2.06495969905518e-05,human,human
1121,human,2.3008724383544177e-05,human,human
1094,human,2.2772659576730803e-05,human,human
1135,human,3.752094926312566e-05,human,human
355,human,2.6818239348358475e-05,human,human
405,human,2.10796879400732e-05,human,human
293,human,2.1857395040569827e-05,human,human
425,human,2.1521263988688588e-05,human,human
462,human,2.0853907699347474e-05,human,human
504,human,2.471517291269265e-05,human,human
877,human,5.760488420492038e-05,human,human
1002,human,2.1231120626907796e-05,human,human
1013,human,1.7947470041690394e-05,human,human
1022,human,2.4939507056842558e-05,human,human
1037,human,2.3987111489987e-05,human,human
1065,human,2.0356001186883077e-05,human,human
1080,human,2.05999913305277e-05,human,human
1093,human,1.9283505025669e-05,human,human
1096,human,2.4681234208401293e-05,human,human
1145,human,2.892445081670303e-05,human,human
925,human,1.9526871255948208e-05,human,human
1142,human,1.9243787392042577e-05,human,human
1178,human,2.2417623767978512e-05,human,human
316,human,2.0377987311803736e-05,human,human
418,human,4.2343890527263284e-05,human,human
303,human,1.8949673176393844e-05,human,human
1012,human,2.5323421141365543e-05,human,human
1074,human,2.0742834749398753e-05,human,human
257,human,2.237552143924404e-05,human,human
290,human,4.440890552359633e-05,human,human
441,human,2.0501334802247584e-05,human,human
447,human,2.0884755940642208e-05,human,human
1174,human,2.546251744206529e-05,human,human
959,human,2.187789141316898e-05,human,human
1110,human,2.783408126560971e-05,human,human
1189,human,2.5114763047895394e-05,human,human
332,human,2.663330997165758e-05,human,human
887,human,2.1674810341210105e-05,human,human
931,human,2.5033223209902644e-05,human,human
914,human,1.9172861357219517e-05,human,human
1055,human,3.7551373679889366e-05,human,human
1086,human,4.6421951992670074e-05,human,human
1160,human,8.850750600686297e-05,human,human
886,human,2.9456579795805737e-05,human,human
918,human,3.213133095414378e-05,human,human
998,human,2.2528292902279645e-05,human,human
958,human,0.000337396893883124,human,human
1186,human,2.9456579795805737e-05,human,human
1127,human,2.1038338672951795e-05,human,human
1130,human,2.2876638468005694e-05,human,human
1119,human,1.94786462088814e-05,human,human
876,human,3.563173959264532e-05,human,human
982,human,2.7136995413457043e-05,human,human
1137,human,2.3839607820264064e-05,human,human
962,human,2.7676485842675902e-05,human,human
513,human,2.057217170658987e-05,human,human
1052,human,2.1253143131616525e-05,human,human
1172,human,2.0791714632650837e-05,human,human
1211,human,3.080684473388828e-05,human,human
1208,human,2.363763087487314e-05,human,human
302,human,3.8995352952042595e-05,human,human
979,human,2.3142851205193438e-05,human,human
977,human,2.2769989300286397e-05,human,human
988,human,1.9730212443391792e-05,human,human
948,human,2.4370512619498186e-05,human,human
974,human,2.2636271751252934e-05,human,human
1017,human,2.1197740352363326e-05,human,human
1007,human,1.956107371370308e-05,human,human
852,human,2.3380347556667402e-05,human,human
870,human,2.225182470283471e-05,human,human
1034,human,2.1228104742476717e-05,human,human
