// mesh element size
lc = 1; // one micrometer
lc_fine_internal = lc/1000000;
lc_boundary = lc/1000000;
h = 2; // length of refinement
hjl = 0.1; // length of refinement junction layer
thickness = 100; // boundary layer thickness [1mu]
//memb_thickness = 50.0; // membrane thickness [1mu]
memb_CEM_thickness = 100.0; // membrane thickness [1mu]
memb_AEM_thickness = 100.0; // membrane thickness [1mu]
jl_thickness = 5.0; // junction layer thickness
Point(1) = {0.0, 0.0, 0.0, lc_boundary}; // {position x, position y, position z, mesh Feinheit (Volumeneinheit)}
Point(2) = {h,0,0,lc};
Point(3) = {thickness-h, 0.0, 0.0, lc};
Point(4) = {thickness, 0.0, 0.0, lc_fine_internal};
Point(5) = {thickness+h, 0.0, 0.0, lc};
Point(6) = {thickness+memb_AEM_thickness-h, 0.0, 0.0, lc};                 // membrane 1
Point(7) = {thickness+memb_AEM_thickness, 0.0, 0.0, lc_fine_internal};          // membrane 1
Point(8) = {thickness+memb_AEM_thickness+h, 0.0, 0.0, lc};                 // membrane 1
Point(9) = {thickness+memb_AEM_thickness+jl_thickness-hjl, 0.0, 0.0, lc};               // junction layer
Point(10) = {thickness+memb_AEM_thickness+jl_thickness, 0.0, 0.0, lc_fine_internal};    // junction layer
Point(11) = {thickness+memb_AEM_thickness+jl_thickness+hjl, 0.0, 0.0, lc};              // junction layer
Point(12) = {thickness+memb_AEM_thickness+jl_thickness+memb_CEM_thickness-h, 0.0, 0.0, lc};               // membrane 2
Point(13) = {thickness+memb_AEM_thickness+jl_thickness+memb_CEM_thickness, 0.0, 0.0, lc_fine_internal};  // membrane 2
Point(14) = {thickness+memb_AEM_thickness+jl_thickness+memb_CEM_thickness+h, 0.0, 0.0, lc};              // membrane 2
Point(15) = {thickness+memb_AEM_thickness+jl_thickness+memb_CEM_thickness+thickness-h, 0.0, 0.0, lc};
Point(16) = {thickness+memb_AEM_thickness+jl_thickness+memb_CEM_thickness+thickness, 0.0, 0.0, lc_boundary};

Line(1) = {1,2};
Line(2) = {2,3};
Line(3) = {3,4};
Line(4) = {4,5};
Line(5) = {5,6};
Line(6) = {6,7};
Line(7) = {7,8};
Line(8) = {8,9};
Line(9) = {9,10};
Line(10) = {10,11};
Line(11) = {11,12};
Line(12) = {12,13};
Line(13) = {13,14};
Line(14) = {14,15};
Line(15) = {15,16};


Physical Line ("LEFT") = {1,2,3};
Physical Line ("AEM") = {4,5,6};
Physical Line ("WDL") = {7,8,9};
Physical Line ("CEM") = {10,11,12};
Physical Line ("RIGHT") = {13,14,15};