$MeshFormat
2.2 0 8
$EndMeshFormat
$PhysicalNames
3
1 1 "LEFT"
1 2 "MEMBRANE"
1 3 "RIGHT"
$EndPhysicalNames
$Nodes
475
1 0 0 0
2 2 0 0
3 98 0 0
4 100 0 0
5 102 0 0
6 198 0 0
7 200 0 0
8 202 0 0
9 298 0 0
10 300 0 0
11 0.01128396036085036 0 0
12 0.02691795465114639 0 0
13 0.04857894983332688 0 0
14 0.0785903924268361 0 0
15 0.1201714218894382 0 0
16 0.1777822008810301 0 0
17 0.257602273184468 0 0
18 0.3681934734608431 0 0
19 0.5214182548480282 0 0
20 0.7337121383161894 0 0
21 1.027846539429259 0 0
22 1.435371625359904 0 0
23 2.999999999995464 0 0
24 3.999999999990929 0 0
25 4.999999999986393 0 0
26 5.999999999981857 0 0
27 6.999999999977321 0 0
28 7.999999999972959 0 0
29 8.999999999969177 0 0
30 9.999999999965564 0 0
31 10.99999999996195 0 0
32 11.99999999995834 0 0
33 12.99999999995473 0 0
34 13.99999999995078 0 0
35 14.99999999994566 0 0
36 15.99999999994066 0 0
37 16.99999999993682 0 0
38 17.99999999993321 0 0
39 18.9999999999296 0 0
40 19.99999999992599 0 0
41 20.99999999992239 0 0
42 21.99999999991878 0 0
43 22.99999999991517 0 0
44 23.99999999991156 0 0
45 24.99999999990795 0 0
46 25.99999999990434 0 0
47 26.99999999990074 0 0
48 27.99999999989713 0 0
49 28.99999999989352 0 0
50 29.99999999988992 0 0
51 30.9999999998863 0 0
52 31.99999999988269 0 0
53 32.99999999987909 0 0
54 33.99999999987547 0 0
55 34.99999999987187 0 0
56 35.99999999986826 0 0
57 36.99999999986465 0 0
58 37.99999999986104 0 0
59 38.99999999985743 0 0
60 39.99999999985383 0 0
61 40.99999999985022 0 0
62 41.99999999984661 0 0
63 42.999999999843 0 0
64 43.99999999983939 0 0
65 44.99999999983578 0 0
66 45.99999999983218 0 0
67 46.99999999982857 0 0
68 47.99999999982496 0 0
69 48.99999999982135 0 0
70 49.99999999981912 0 0
71 50.99999999982153 0 0
72 51.99999999982533 0 0
73 52.99999999982911 0 0
74 53.99999999983291 0 0
75 54.99999999983669 0 0
76 55.99999999984048 0 0
77 56.99999999984427 0 0
78 57.99999999984807 0 0
79 58.99999999985187 0 0
80 59.99999999985565 0 0
81 60.99999999985943 0 0
82 61.99999999986322 0 0
83 62.99999999986701 0 0
84 63.99999999987082 0 0
85 64.9999999998746 0 0
86 65.9999999998784 0 0
87 66.99999999988219 0 0
88 67.999999999886 0 0
89 68.99999999988981 0 0
90 69.9999999998936 0 0
91 70.9999999998974 0 0
92 71.99999999990119 0 0
93 72.999999999905 0 0
94 73.99999999990879 0 0
95 74.99999999991259 0 0
96 75.99999999991638 0 0
97 76.99999999992019 0 0
98 77.999999999924 0 0
99 78.99999999992781 0 0
100 79.9999999999316 0 0
101 80.9999999999354 0 0
102 81.99999999993921 0 0
103 82.999999999943 0 0
104 83.99999999994679 0 0
105 84.9999999999506 0 0
106 85.9999999999544 0 0
107 86.99999999995819 0 0
108 87.999999999962 0 0
109 88.99999999996579 0 0
110 89.99999999996962 0 0
111 90.99999999997341 0 0
112 91.99999999997721 0 0
113 92.999999999981 0 0
114 93.99999999998481 0 0
115 94.9999999999886 0 0
116 95.9999999999924 0 0
117 96.99999999999619 0 0
118 98.57056417926758 0 0
119 98.97835692057481 0 0
120 99.26981381329419 0 0
121 99.4781234220621 0 0
122 99.62700609329116 0 0
123 99.73341527144204 0 0
124 99.80946784964654 0 0
125 99.863824023275 0 0
126 99.90267336962903 0 0
127 99.93043971313071 0 0
128 99.95028482602476 0 0
129 99.96446849008031 0 0
130 99.97460581466592 0 0
131 99.98185114641009 0 0
132 99.98702951742493 0 0
133 99.99073059382023 0 0
134 99.99337582064854 0 0
135 99.99526641295309 0 0
136 99.99661765371877 0 0
137 99.99758341032417 0 0
138 99.99827365415247 0 0
139 99.99876698406595 0 0
140 99.99911957598221 0 0
141 99.99937157988215 0 0
142 99.99955169167833 0 0
143 99.99968042086209 0 0
144 99.99977242599233 0 0
145 99.9998381837169 0 0
146 99.99988518198043 0 0
147 99.99991877249333 0 0
148 99.99994278025154 0 0
149 99.99995993903129 0 0
150 99.99997220272458 0 0
151 99.99998096780882 0 0
152 99.99998723237341 0 0
153 99.99999170977398 0 0
154 99.9999949098486 0 0
155 99.9999971970061 0 0
156 99.99999883165957 0 0
157 100.0000011683404 0 0
158 100.0000028029939 0 0
159 100.0000050901514 0 0
160 100.000008290226 0 0
161 100.0000127676266 0 0
162 100.0000190321912 0 0
163 100.0000277972754 0 0
164 100.0000400609687 0 0
165 100.0000572197485 0 0
166 100.0000812275067 0 0
167 100.0001148180196 0 0
168 100.0001618162831 0 0
169 100.0002275740077 0 0
170 100.0003195791379 0 0
171 100.0004483083217 0 0
172 100.0006284201178 0 0
173 100.0008804240178 0 0
174 100.001233015934 0 0
175 100.0017263458475 0 0
176 100.0024165896758 0 0
177 100.0033823462812 0 0
178 100.0047335870469 0 0
179 100.0066241793515 0 0
180 100.0092694061798 0 0
181 100.0129704825751 0 0
182 100.0181488535899 0 0
183 100.0253941853341 0 0
184 100.0355315099197 0 0
185 100.0497151739752 0 0
186 100.0695602868693 0 0
187 100.097326630371 0 0
188 100.136175976725 0 0
189 100.1905321503534 0 0
190 100.266584728558 0 0
191 100.3729939067088 0 0
192 100.5218765779379 0 0
193 100.7301861867058 0 0
194 101.0216430794252 0 0
195 101.4294358207324 0 0
196 102.9999999999868 0 0
197 103.9999999999735 0 0
198 104.9999999999603 0 0
199 105.999999999947 0 0
200 106.9999999999338 0 0
201 107.9999999999233 0 0
202 108.9999999999221 0 0
203 109.9999999999236 0 0
204 110.9999999999252 0 0
205 111.9999999999268 0 0
206 112.9999999999283 0 0
207 113.9999999999271 0 0
208 114.9999999999166 0 0
209 115.9999999999034 0 0
210 116.9999999998902 0 0
211 117.9999999998788 0 0
212 118.9999999998766 0 0
213 119.9999999998782 0 0
214 120.9999999998797 0 0
215 121.9999999998813 0 0
216 122.9999999998828 0 0
217 123.9999999998844 0 0
218 124.999999999886 0 0
219 125.9999999998875 0 0
220 126.9999999998891 0 0
221 127.9999999998906 0 0
222 128.9999999998922 0 0
223 129.9999999998938 0 0
224 130.9999999998953 0 0
225 131.9999999998969 0 0
226 132.9999999998984 0 0
227 133.9999999999 0 0
228 134.9999999999015 0 0
229 135.9999999999031 0 0
230 136.9999999999047 0 0
231 137.9999999999062 0 0
232 138.9999999999078 0 0
233 139.9999999999093 0 0
234 140.9999999999109 0 0
235 141.9999999999125 0 0
236 142.999999999914 0 0
237 143.9999999999156 0 0
238 144.9999999999171 0 0
239 145.9999999999187 0 0
240 146.9999999999202 0 0
241 147.9999999999218 0 0
242 148.9999999999233 0 0
243 149.9999999999249 0 0
244 150.9999999999265 0 0
245 151.999999999928 0 0
246 152.9999999999296 0 0
247 153.9999999999312 0 0
248 154.9999999999327 0 0
249 155.9999999999343 0 0
250 156.9999999999358 0 0
251 157.9999999999374 0 0
252 158.9999999999389 0 0
253 159.9999999999405 0 0
254 160.999999999942 0 0
255 161.9999999999436 0 0
256 162.9999999999451 0 0
257 163.9999999999467 0 0
258 164.9999999999483 0 0
259 165.9999999999498 0 0
260 166.9999999999514 0 0
261 167.999999999953 0 0
262 168.9999999999545 0 0
263 169.9999999999561 0 0
264 170.9999999999577 0 0
265 171.9999999999592 0 0
266 172.9999999999608 0 0
267 173.9999999999624 0 0
268 174.999999999964 0 0
269 175.9999999999655 0 0
270 176.9999999999671 0 0
271 177.9999999999687 0 0
272 178.9999999999702 0 0
273 179.9999999999718 0 0
274 180.9999999999734 0 0
275 181.9999999999749 0 0
276 182.9999999999765 0 0
277 183.9999999999781 0 0
278 184.9999999999796 0 0
279 185.9999999999812 0 0
280 186.9999999999827 0 0
281 187.9999999999843 0 0
282 188.9999999999859 0 0
283 189.9999999999874 0 0
284 190.999999999989 0 0
285 191.9999999999906 0 0
286 192.9999999999922 0 0
287 193.9999999999937 0 0
288 194.9999999999953 0 0
289 195.9999999999969 0 0
290 196.9999999999984 0 0
291 198.5705641792676 0 0
292 198.9783569205748 0 0
293 199.2698138132942 0 0
294 199.4781234220621 0 0
295 199.6270060932912 0 0
296 199.733415271442 0 0
297 199.8094678496466 0 0
298 199.863824023275 0 0
299 199.902673369629 0 0
300 199.9304397131307 0 0
301 199.9502848260248 0 0
302 199.9644684900803 0 0
303 199.9746058146659 0 0
304 199.9818511464101 0 0
305 199.9870295174249 0 0
306 199.9907305938202 0 0
307 199.9933758206485 0 0
308 199.9952664129531 0 0
309 199.9966176537188 0 0
310 199.9975834103242 0 0
311 199.9982736541525 0 0
312 199.998766984066 0 0
313 199.9991195759822 0 0
314 199.9993715798821 0 0
315 199.9995516916783 0 0
316 199.9996804208621 0 0
317 199.9997724259923 0 0
318 199.9998381837169 0 0
319 199.9998851819804 0 0
320 199.9999187724933 0 0
321 199.9999427802515 0 0
322 199.9999599390313 0 0
323 199.9999722027246 0 0
324 199.9999809678088 0 0
325 199.9999872323734 0 0
326 199.999991709774 0 0
327 199.9999949098486 0 0
328 199.9999971970061 0 0
329 199.9999988316596 0 0
330 200.0000011683404 0 0
331 200.0000028029939 0 0
332 200.0000050901514 0 0
333 200.000008290226 0 0
334 200.0000127676266 0 0
335 200.0000190321912 0 0
336 200.0000277972754 0 0
337 200.0000400609687 0 0
338 200.0000572197485 0 0
339 200.0000812275067 0 0
340 200.0001148180196 0 0
341 200.0001618162831 0 0
342 200.0002275740077 0 0
343 200.0003195791379 0 0
344 200.0004483083217 0 0
345 200.0006284201179 0 0
346 200.0008804240178 0 0
347 200.001233015934 0 0
348 200.0017263458475 0 0
349 200.0024165896758 0 0
350 200.0033823462812 0 0
351 200.0047335870469 0 0
352 200.0066241793515 0 0
353 200.0092694061798 0 0
354 200.0129704825751 0 0
355 200.0181488535899 0 0
356 200.0253941853341 0 0
357 200.0355315099197 0 0
358 200.0497151739752 0 0
359 200.0695602868693 0 0
360 200.097326630371 0 0
361 200.136175976725 0 0
362 200.1905321503534 0 0
363 200.266584728558 0 0
364 200.3729939067088 0 0
365 200.5218765779379 0 0
366 200.7301861867058 0 0
367 201.0216430794252 0 0
368 201.4294358207324 0 0
369 202.999999999987 0 0
370 203.9999999999741 0 0
371 204.9999999999611 0 0
372 205.9999999999482 0 0
373 206.9999999999352 0 0
374 207.9999999999223 0 0
375 208.9999999999093 0 0
376 209.9999999998964 0 0
377 210.9999999998834 0 0
378 211.9999999998705 0 0
379 212.9999999998575 0 0
380 213.9999999998446 0 0
381 214.9999999998316 0 0
382 215.9999999998187 0 0
383 216.9999999998057 0 0
384 217.9999999997927 0 0
385 218.9999999997798 0 0
386 219.9999999997669 0 0
387 220.9999999997539 0 0
388 221.9999999997409 0 0
389 222.999999999728 0 0
390 223.999999999715 0 0
391 224.9999999997021 0 0
392 225.9999999996891 0 0
393 226.9999999996762 0 0
394 227.9999999996632 0 0
395 228.9999999996503 0 0
396 229.9999999996373 0 0
397 230.9999999996244 0 0
398 231.9999999996114 0 0
399 232.9999999995985 0 0
400 233.9999999995855 0 0
401 234.9999999995726 0 0
402 235.9999999995596 0 0
403 236.9999999995467 0 0
404 237.9999999995337 0 0
405 238.9999999995208 0 0
406 239.9999999995078 0 0
407 240.9999999994949 0 0
408 241.9999999994819 0 0
409 242.9999999994689 0 0
410 243.999999999456 0 0
411 244.999999999443 0 0
412 245.9999999994301 0 0
413 246.9999999994171 0 0
414 247.9999999994042 0 0
415 248.9999999993912 0 0
416 249.9999999993783 0 0
417 250.9999999993653 0 0
418 251.9999999993524 0 0
419 252.9999999993394 0 0
420 253.9999999993265 0 0
421 254.9999999993135 0 0
422 255.9999999993061 0 0
423 256.9999999993172 0 0
424 257.9999999993339 0 0
425 258.9999999993505 0 0
426 259.9999999993672 0 0
427 260.9999999993838 0 0
428 261.9999999994005 0 0
429 262.9999999994171 0 0
430 263.9999999994338 0 0
431 264.9999999994504 0 0
432 265.9999999994671 0 0
433 266.9999999994837 0 0
434 267.9999999995004 0 0
435 268.9999999995171 0 0
436 269.9999999995337 0 0
437 270.9999999995504 0 0
438 271.999999999567 0 0
439 272.9999999995837 0 0
440 273.9999999996003 0 0
441 274.999999999617 0 0
442 275.9999999996336 0 0
443 276.9999999996503 0 0
444 277.999999999667 0 0
445 278.9999999996836 0 0
446 279.9999999997003 0 0
447 280.9999999997169 0 0
448 281.9999999997335 0 0
449 282.9999999997502 0 0
450 283.9999999997668 0 0
451 284.9999999997835 0 0
452 285.9999999998001 0 0
453 286.9999999998169 0 0
454 287.9999999998334 0 0
455 288.9999999998501 0 0
456 289.9999999998668 0 0
457 290.9999999998834 0 0
458 291.9999999999001 0 0
459 292.9999999999167 0 0
460 293.9999999999334 0 0
461 294.99999999995 0 0
462 295.9999999999667 0 0
463 296.9999999999833 0 0
464 298.5646283746714 0 0
465 298.9721534606149 0 0
466 299.2662878617315 0 0
467 299.4785817451972 0 0
468 299.631806526579 0 0
469 299.7423977268487 0 0
470 299.8222177991453 0 0
471 299.8798285781306 0 0
472 299.9214096075876 0 0
473 299.9514210501765 0 0
474 299.9730820453547 0 0
475 299.9887160396418 0 0
$EndNodes
$Elements
474
1 1 2 1 1 1 11
2 1 2 1 1 11 12
3 1 2 1 1 12 13
4 1 2 1 1 13 14
5 1 2 1 1 14 15
6 1 2 1 1 15 16
7 1 2 1 1 16 17
8 1 2 1 1 17 18
9 1 2 1 1 18 19
10 1 2 1 1 19 20
11 1 2 1 1 20 21
12 1 2 1 1 21 22
13 1 2 1 1 22 2
14 1 2 1 2 2 23
15 1 2 1 2 23 24
16 1 2 1 2 24 25
17 1 2 1 2 25 26
18 1 2 1 2 26 27
19 1 2 1 2 27 28
20 1 2 1 2 28 29
21 1 2 1 2 29 30
22 1 2 1 2 30 31
23 1 2 1 2 31 32
24 1 2 1 2 32 33
25 1 2 1 2 33 34
26 1 2 1 2 34 35
27 1 2 1 2 35 36
28 1 2 1 2 36 37
29 1 2 1 2 37 38
30 1 2 1 2 38 39
31 1 2 1 2 39 40
32 1 2 1 2 40 41
33 1 2 1 2 41 42
34 1 2 1 2 42 43
35 1 2 1 2 43 44
36 1 2 1 2 44 45
37 1 2 1 2 45 46
38 1 2 1 2 46 47
39 1 2 1 2 47 48
40 1 2 1 2 48 49
41 1 2 1 2 49 50
42 1 2 1 2 50 51
43 1 2 1 2 51 52
44 1 2 1 2 52 53
45 1 2 1 2 53 54
46 1 2 1 2 54 55
47 1 2 1 2 55 56
48 1 2 1 2 56 57
49 1 2 1 2 57 58
50 1 2 1 2 58 59
51 1 2 1 2 59 60
52 1 2 1 2 60 61
53 1 2 1 2 61 62
54 1 2 1 2 62 63
55 1 2 1 2 63 64
56 1 2 1 2 64 65
57 1 2 1 2 65 66
58 1 2 1 2 66 67
59 1 2 1 2 67 68
60 1 2 1 2 68 69
61 1 2 1 2 69 70
62 1 2 1 2 70 71
63 1 2 1 2 71 72
64 1 2 1 2 72 73
65 1 2 1 2 73 74
66 1 2 1 2 74 75
67 1 2 1 2 75 76
68 1 2 1 2 76 77
69 1 2 1 2 77 78
70 1 2 1 2 78 79
71 1 2 1 2 79 80
72 1 2 1 2 80 81
73 1 2 1 2 81 82
74 1 2 1 2 82 83
75 1 2 1 2 83 84
76 1 2 1 2 84 85
77 1 2 1 2 85 86
78 1 2 1 2 86 87
79 1 2 1 2 87 88
80 1 2 1 2 88 89
81 1 2 1 2 89 90
82 1 2 1 2 90 91
83 1 2 1 2 91 92
84 1 2 1 2 92 93
85 1 2 1 2 93 94
86 1 2 1 2 94 95
87 1 2 1 2 95 96
88 1 2 1 2 96 97
89 1 2 1 2 97 98
90 1 2 1 2 98 99
91 1 2 1 2 99 100
92 1 2 1 2 100 101
93 1 2 1 2 101 102
94 1 2 1 2 102 103
95 1 2 1 2 103 104
96 1 2 1 2 104 105
97 1 2 1 2 105 106
98 1 2 1 2 106 107
99 1 2 1 2 107 108
100 1 2 1 2 108 109
101 1 2 1 2 109 110
102 1 2 1 2 110 111
103 1 2 1 2 111 112
104 1 2 1 2 112 113
105 1 2 1 2 113 114
106 1 2 1 2 114 115
107 1 2 1 2 115 116
108 1 2 1 2 116 117
109 1 2 1 2 117 3
110 1 2 1 3 3 118
111 1 2 1 3 118 119
112 1 2 1 3 119 120
113 1 2 1 3 120 121
114 1 2 1 3 121 122
115 1 2 1 3 122 123
116 1 2 1 3 123 124
117 1 2 1 3 124 125
118 1 2 1 3 125 126
119 1 2 1 3 126 127
120 1 2 1 3 127 128
121 1 2 1 3 128 129
122 1 2 1 3 129 130
123 1 2 1 3 130 131
124 1 2 1 3 131 132
125 1 2 1 3 132 133
126 1 2 1 3 133 134
127 1 2 1 3 134 135
128 1 2 1 3 135 136
129 1 2 1 3 136 137
130 1 2 1 3 137 138
131 1 2 1 3 138 139
132 1 2 1 3 139 140
133 1 2 1 3 140 141
134 1 2 1 3 141 142
135 1 2 1 3 142 143
136 1 2 1 3 143 144
137 1 2 1 3 144 145
138 1 2 1 3 145 146
139 1 2 1 3 146 147
140 1 2 1 3 147 148
141 1 2 1 3 148 149
142 1 2 1 3 149 150
143 1 2 1 3 150 151
144 1 2 1 3 151 152
145 1 2 1 3 152 153
146 1 2 1 3 153 154
147 1 2 1 3 154 155
148 1 2 1 3 155 156
149 1 2 1 3 156 4
150 1 2 2 4 4 157
151 1 2 2 4 157 158
152 1 2 2 4 158 159
153 1 2 2 4 159 160
154 1 2 2 4 160 161
155 1 2 2 4 161 162
156 1 2 2 4 162 163
157 1 2 2 4 163 164
158 1 2 2 4 164 165
159 1 2 2 4 165 166
160 1 2 2 4 166 167
161 1 2 2 4 167 168
162 1 2 2 4 168 169
163 1 2 2 4 169 170
164 1 2 2 4 170 171
165 1 2 2 4 171 172
166 1 2 2 4 172 173
167 1 2 2 4 173 174
168 1 2 2 4 174 175
169 1 2 2 4 175 176
170 1 2 2 4 176 177
171 1 2 2 4 177 178
172 1 2 2 4 178 179
173 1 2 2 4 179 180
174 1 2 2 4 180 181
175 1 2 2 4 181 182
176 1 2 2 4 182 183
177 1 2 2 4 183 184
178 1 2 2 4 184 185
179 1 2 2 4 185 186
180 1 2 2 4 186 187
181 1 2 2 4 187 188
182 1 2 2 4 188 189
183 1 2 2 4 189 190
184 1 2 2 4 190 191
185 1 2 2 4 191 192
186 1 2 2 4 192 193
187 1 2 2 4 193 194
188 1 2 2 4 194 195
189 1 2 2 4 195 5
190 1 2 2 5 5 196
191 1 2 2 5 196 197
192 1 2 2 5 197 198
193 1 2 2 5 198 199
194 1 2 2 5 199 200
195 1 2 2 5 200 201
196 1 2 2 5 201 202
197 1 2 2 5 202 203
198 1 2 2 5 203 204
199 1 2 2 5 204 205
200 1 2 2 5 205 206
201 1 2 2 5 206 207
202 1 2 2 5 207 208
203 1 2 2 5 208 209
204 1 2 2 5 209 210
205 1 2 2 5 210 211
206 1 2 2 5 211 212
207 1 2 2 5 212 213
208 1 2 2 5 213 214
209 1 2 2 5 214 215
210 1 2 2 5 215 216
211 1 2 2 5 216 217
212 1 2 2 5 217 218
213 1 2 2 5 218 219
214 1 2 2 5 219 220
215 1 2 2 5 220 221
216 1 2 2 5 221 222
217 1 2 2 5 222 223
218 1 2 2 5 223 224
219 1 2 2 5 224 225
220 1 2 2 5 225 226
221 1 2 2 5 226 227
222 1 2 2 5 227 228
223 1 2 2 5 228 229
224 1 2 2 5 229 230
225 1 2 2 5 230 231
226 1 2 2 5 231 232
227 1 2 2 5 232 233
228 1 2 2 5 233 234
229 1 2 2 5 234 235
230 1 2 2 5 235 236
231 1 2 2 5 236 237
232 1 2 2 5 237 238
233 1 2 2 5 238 239
234 1 2 2 5 239 240
235 1 2 2 5 240 241
236 1 2 2 5 241 242
237 1 2 2 5 242 243
238 1 2 2 5 243 244
239 1 2 2 5 244 245
240 1 2 2 5 245 246
241 1 2 2 5 246 247
242 1 2 2 5 247 248
243 1 2 2 5 248 249
244 1 2 2 5 249 250
245 1 2 2 5 250 251
246 1 2 2 5 251 252
247 1 2 2 5 252 253
248 1 2 2 5 253 254
249 1 2 2 5 254 255
250 1 2 2 5 255 256
251 1 2 2 5 256 257
252 1 2 2 5 257 258
253 1 2 2 5 258 259
254 1 2 2 5 259 260
255 1 2 2 5 260 261
256 1 2 2 5 261 262
257 1 2 2 5 262 263
258 1 2 2 5 263 264
259 1 2 2 5 264 265
260 1 2 2 5 265 266
261 1 2 2 5 266 267
262 1 2 2 5 267 268
263 1 2 2 5 268 269
264 1 2 2 5 269 270
265 1 2 2 5 270 271
266 1 2 2 5 271 272
267 1 2 2 5 272 273
268 1 2 2 5 273 274
269 1 2 2 5 274 275
270 1 2 2 5 275 276
271 1 2 2 5 276 277
272 1 2 2 5 277 278
273 1 2 2 5 278 279
274 1 2 2 5 279 280
275 1 2 2 5 280 281
276 1 2 2 5 281 282
277 1 2 2 5 282 283
278 1 2 2 5 283 284
279 1 2 2 5 284 285
280 1 2 2 5 285 286
281 1 2 2 5 286 287
282 1 2 2 5 287 288
283 1 2 2 5 288 289
284 1 2 2 5 289 290
285 1 2 2 5 290 6
286 1 2 2 6 6 291
287 1 2 2 6 291 292
288 1 2 2 6 292 293
289 1 2 2 6 293 294
290 1 2 2 6 294 295
291 1 2 2 6 295 296
292 1 2 2 6 296 297
293 1 2 2 6 297 298
294 1 2 2 6 298 299
295 1 2 2 6 299 300
296 1 2 2 6 300 301
297 1 2 2 6 301 302
298 1 2 2 6 302 303
299 1 2 2 6 303 304
300 1 2 2 6 304 305
301 1 2 2 6 305 306
302 1 2 2 6 306 307
303 1 2 2 6 307 308
304 1 2 2 6 308 309
305 1 2 2 6 309 310
306 1 2 2 6 310 311
307 1 2 2 6 311 312
308 1 2 2 6 312 313
309 1 2 2 6 313 314
310 1 2 2 6 314 315
311 1 2 2 6 315 316
312 1 2 2 6 316 317
313 1 2 2 6 317 318
314 1 2 2 6 318 319
315 1 2 2 6 319 320
316 1 2 2 6 320 321
317 1 2 2 6 321 322
318 1 2 2 6 322 323
319 1 2 2 6 323 324
320 1 2 2 6 324 325
321 1 2 2 6 325 326
322 1 2 2 6 326 327
323 1 2 2 6 327 328
324 1 2 2 6 328 329
325 1 2 2 6 329 7
326 1 2 3 7 7 330
327 1 2 3 7 330 331
328 1 2 3 7 331 332
329 1 2 3 7 332 333
330 1 2 3 7 333 334
331 1 2 3 7 334 335
332 1 2 3 7 335 336
333 1 2 3 7 336 337
334 1 2 3 7 337 338
335 1 2 3 7 338 339
336 1 2 3 7 339 340
337 1 2 3 7 340 341
338 1 2 3 7 341 342
339 1 2 3 7 342 343
340 1 2 3 7 343 344
341 1 2 3 7 344 345
342 1 2 3 7 345 346
343 1 2 3 7 346 347
344 1 2 3 7 347 348
345 1 2 3 7 348 349
346 1 2 3 7 349 350
347 1 2 3 7 350 351
348 1 2 3 7 351 352
349 1 2 3 7 352 353
350 1 2 3 7 353 354
351 1 2 3 7 354 355
352 1 2 3 7 355 356
353 1 2 3 7 356 357
354 1 2 3 7 357 358
355 1 2 3 7 358 359
356 1 2 3 7 359 360
357 1 2 3 7 360 361
358 1 2 3 7 361 362
359 1 2 3 7 362 363
360 1 2 3 7 363 364
361 1 2 3 7 364 365
362 1 2 3 7 365 366
363 1 2 3 7 366 367
364 1 2 3 7 367 368
365 1 2 3 7 368 8
366 1 2 3 8 8 369
367 1 2 3 8 369 370
368 1 2 3 8 370 371
369 1 2 3 8 371 372
370 1 2 3 8 372 373
371 1 2 3 8 373 374
372 1 2 3 8 374 375
373 1 2 3 8 375 376
374 1 2 3 8 376 377
375 1 2 3 8 377 378
376 1 2 3 8 378 379
377 1 2 3 8 379 380
378 1 2 3 8 380 381
379 1 2 3 8 381 382
380 1 2 3 8 382 383
381 1 2 3 8 383 384
382 1 2 3 8 384 385
383 1 2 3 8 385 386
384 1 2 3 8 386 387
385 1 2 3 8 387 388
386 1 2 3 8 388 389
387 1 2 3 8 389 390
388 1 2 3 8 390 391
389 1 2 3 8 391 392
390 1 2 3 8 392 393
391 1 2 3 8 393 394
392 1 2 3 8 394 395
393 1 2 3 8 395 396
394 1 2 3 8 396 397
395 1 2 3 8 397 398
396 1 2 3 8 398 399
397 1 2 3 8 399 400
398 1 2 3 8 400 401
399 1 2 3 8 401 402
400 1 2 3 8 402 403
401 1 2 3 8 403 404
402 1 2 3 8 404 405
403 1 2 3 8 405 406
404 1 2 3 8 406 407
405 1 2 3 8 407 408
406 1 2 3 8 408 409
407 1 2 3 8 409 410
408 1 2 3 8 410 411
409 1 2 3 8 411 412
410 1 2 3 8 412 413
411 1 2 3 8 413 414
412 1 2 3 8 414 415
413 1 2 3 8 415 416
414 1 2 3 8 416 417
415 1 2 3 8 417 418
416 1 2 3 8 418 419
417 1 2 3 8 419 420
418 1 2 3 8 420 421
419 1 2 3 8 421 422
420 1 2 3 8 422 423
421 1 2 3 8 423 424
422 1 2 3 8 424 425
423 1 2 3 8 425 426
424 1 2 3 8 426 427
425 1 2 3 8 427 428
426 1 2 3 8 428 429
427 1 2 3 8 429 430
428 1 2 3 8 430 431
429 1 2 3 8 431 432
430 1 2 3 8 432 433
431 1 2 3 8 433 434
432 1 2 3 8 434 435
433 1 2 3 8 435 436
434 1 2 3 8 436 437
435 1 2 3 8 437 438
436 1 2 3 8 438 439
437 1 2 3 8 439 440
438 1 2 3 8 440 441
439 1 2 3 8 441 442
440 1 2 3 8 442 443
441 1 2 3 8 443 444
442 1 2 3 8 444 445
443 1 2 3 8 445 446
444 1 2 3 8 446 447
445 1 2 3 8 447 448
446 1 2 3 8 448 449
447 1 2 3 8 449 450
448 1 2 3 8 450 451
449 1 2 3 8 451 452
450 1 2 3 8 452 453
451 1 2 3 8 453 454
452 1 2 3 8 454 455
453 1 2 3 8 455 456
454 1 2 3 8 456 457
455 1 2 3 8 457 458
456 1 2 3 8 458 459
457 1 2 3 8 459 460
458 1 2 3 8 460 461
459 1 2 3 8 461 462
460 1 2 3 8 462 463
461 1 2 3 8 463 9
462 1 2 3 9 9 464
463 1 2 3 9 464 465
464 1 2 3 9 465 466
465 1 2 3 9 466 467
466 1 2 3 9 467 468
467 1 2 3 9 468 469
468 1 2 3 9 469 470
469 1 2 3 9 470 471
470 1 2 3 9 471 472
471 1 2 3 9 472 473
472 1 2 3 9 473 474
473 1 2 3 9 474 475
474 1 2 3 9 475 10
$EndElements
