{
	"JSON": {
		"ID": "1ee82398-0056-698f-8809-248cede81c54",
		"label": "",
		"comment": "UUID6 is used"
	},
	"actor": {
		"name": "motor_controller",
		"type": "57BLF03",
		"manufacturer": "ACT-Motor",
		"max rpms": "3000",
		"power_supply": {
			"voltage": "24",
			"type": "DC voltage"
		}
	}
}