{
	"JSON": {
		"ID": "1ee5ec0a-1830-63f5-ac3e-6f8ce4468546",
		"label": "",
		"comment": "UUID6 is used"
	},
	"group": {
		"number": "Group79",
		"author": [
			"2801210_PatrickSchell",
			"2690926_LeoMensler",
			"2652566_ErwinDurasow"
		],
		"experiment": "calorimetry",
		"testrig_number": "4"
	}
}
