Update installOrBuild.sh

1 job for feature/boost_as_git in 5 minutes and 54 seconds (queued for 1 second)
Status Job ID Name Coverage
  Build
failed #476554
build

00:05:54

 
Name Stage Failure
failed
build Build There is an unknown failure, please try again
Makefile.Release:9161: recipe for target 'release/device.o' failed
Makefile.Release:8259: recipe for target 'release/controlitemdata.o' failed
make[1]: *** [release/controlitemdata.o] Error 1
make[1]: *** [release/controlitem.o] Error 1
Makefile.Release:7823: recipe for target 'release/controlitem.o' failed
make[1]: Leaving directory '/builds/leander.schulten/Lichtsteuerung/build'
make: *** [release] Error 2
Makefile:38: recipe for target 'release' failed
ERROR: Job failed: exit code 1