{
    "assembly": {
        "uuid": "kpi-12bcb990-572f-4b3a-a0a4-bc05a1b7bede",
        "properties": {
            "label": "Car 2",
            "assembly_method": "stick together like lego blocks",
            "total_mass [g]": 233.04999999999995,
            "lead_time [days]": 13,
            "total_cost [Euro]": 74.00100000000002,
            "number_of_components": 45
        },
        "layer": "kpi-SYSTEM",
        "components": [],
        "assemblies": [
            {
                "assembly": {
                    "uuid": "kpi-97ef3ccb-2fb2-4438-a8d4-fbcc971c9e9a",
                    "properties": {
                        "label": "Frame Assembly",
                        "assembly_method": "stick together like lego blocks"
                    },
                    "layer": "kpi-ASSEMBLY",
                    "components": [
                        {
                            "component": {
                                "uuid": "kpi-90be3d4b-b0c5-4d7c-a093-24ef2509358b",
                                "properties": {
                                    "label": "Technic Brick Horizontal Back Top",
                                    "item number": 2730,
                                    "item description": "Technic, Brick 1 x 10 with Holes",
                                    "category": "frame",
                                    "price [Euro]": 0.01,
                                    "mass [g]": 3.67,
                                    "delivery time [days]": 5,
                                    "data source": "https://www.bricklink.com/v2/catalog/catalogitem.page?P=2730#T=C",
                                    "dimension [studs]": "1 x 10 x 1",
                                    "color": "grey"
                                },
                                "layer": "kpi-COMPONENT"
                            }
                        },
                        {
                            "component": {
                                "uuid": "kpi-c6b4750b-06ce-4746-b14b-aa2d84093687",
                                "properties": {
                                    "label": "Technic Brick Horizontal Back Bottom",
                                    "item number": 2730,
                                    "item description": "Technic, Brick 1 x 10 with Holes",
                                    "category": "frame",
                                    "price [Euro]": 0.01,
                                    "mass [g]": 3.67,
                                    "delivery time [days]": 5,
                                    "data source": "https://www.bricklink.com/v2/catalog/catalogitem.page?P=2730#T=C",
                                    "dimension [studs]": "1 x 10 x 1",
                                    "color": "grey"
                                },
                                "layer": "kpi-COMPONENT"
                            }
                        },
                        {
                            "component": {
                                "uuid": "kpi-3fb0fafe-b143-4e82-a325-fcdf588df329",
                                "properties": {
                                    "label": "Technic Brick Horizontal Front",
                                    "item number": 2730,
                                    "item description": "Technic, Brick 1 x 10 with Holes",
                                    "category": "frame",
                                    "price [Euro]": 0.01,
                                    "mass [g]": 3.67,
                                    "delivery time [days]": 5,
                                    "data source": "https://www.bricklink.com/v2/catalog/catalogitem.page?P=2730#T=C",
                                    "dimension [studs]": "1 x 10 x 1",
                                    "color": "grey"
                                },
                                "layer": "kpi-COMPONENT"
                            }
                        },
                        {
                            "component": {
                                "uuid": "kpi-e8b9c712-3080-4e10-a001-526b266b6596",
                                "properties": {
                                    "label": "Technic Brick Batterie Right",
                                    "item number": 3703,
                                    "item description": "Technic, Brick 1 x 16 with Holes",
                                    "category": "frame",
                                    "price [Euro]": 0.07,
                                    "mass [g]": 5.87,
                                    "delivery time [days]": 5,
                                    "data source": "https://www.bricklink.com/v2/catalog/catalogitem.page?P=3703#T=C",
                                    "dimension [studs]": "1 x 16 x 1",
                                    "color": "grey"
                                },
                                "layer": "kpi-COMPONENT"
                            }
                        },
                        {
                            "component": {
                                "uuid": "kpi-7d446c75-a641-4c9c-a682-93aea46be940",
                                "properties": {
                                    "label": "Technic Brick Batterie Left",
                                    "item number": 3703,
                                    "item description": "Technic, Brick 1 x 16 with Holes",
                                    "category": "frame",
                                    "price [Euro]": 0.07,
                                    "mass [g]": 5.87,
                                    "delivery time [days]": 5,
                                    "data source": "https://www.bricklink.com/v2/catalog/catalogitem.page?P=3703#T=C",
                                    "dimension [studs]": "1 x 16 x 1",
                                    "color": "grey"
                                },
                                "layer": "kpi-COMPONENT"
                            }
                        },
                        {
                            "component": {
                                "uuid": "kpi-2ee7ce38-af6a-4663-ad17-1596ec47969c",
                                "properties": {
                                    "label": "Technic Brick Front Top Right",
                                    "item number": 3702,
                                    "item description": "Technic, Brick 1 x 8 with Holes",
                                    "category": "frame",
                                    "price [Euro]": 0.01,
                                    "mass [g]": 2.85,
                                    "delivery time [days]": 5,
                                    "data source": "https://www.bricklink.com/v2/catalog/catalogitem.page?P=3702#T=C",
                                    "dimension [studs]": "1 x 8 x 1",
                                    "color": "grey"
                                },
                                "layer": "kpi-COMPONENT"
                            }
                        },
                        {
                            "component": {
                                "uuid": "kpi-16d6dac4-96ac-4af3-94bb-af821a1c4f1c",
                                "properties": {
                                    "label": "Technic Brick Front Top Left",
                                    "item number": 3702,
                                    "item description": "Technic, Brick 1 x 8 with Holes",
                                    "category": "frame",
                                    "price [Euro]": 0.01,
                                    "mass [g]": 2.85,
                                    "delivery time [days]": 5,
                                    "data source": "https://www.bricklink.com/v2/catalog/catalogitem.page?P=3702#T=C",
                                    "dimension [studs]": "1 x 8 x 1",
                                    "color": "grey"
                                },
                                "layer": "kpi-COMPONENT"
                            }
                        },
                        {
                            "component": {
                                "uuid": "kpi-7b2461cf-d68e-4931-94e4-8bcbce6c7acd",
                                "properties": {
                                    "label": "Technic Brick Front Bottom Right",
                                    "item number": 3701,
                                    "item description": "Technic, Brick 1 x 4 with Holes",
                                    "category": "frame",
                                    "price [Euro]": 0.01,
                                    "mass [g]": 1.46,
                                    "delivery time [days]": 3,
                                    "data source": "https://www.bricklink.com/v2/catalog/catalogitem.page?P=3701#T=C",
                                    "dimension [studs]": "1 x 4 x 1",
                                    "color": "grey"
                                },
                                "layer": "kpi-COMPONENT"
                            }
                        },
                        {
                            "component": {
                                "uuid": "kpi-a4029676-3d64-46a9-83c1-2f942cd4e0fa",
                                "properties": {
                                    "label": "Technic Brick Front Bottom Left",
                                    "item number": 3701,
                                    "item description": "Technic, Brick 1 x 4 with Holes",
                                    "category": "frame",
                                    "price [Euro]": 0.01,
                                    "mass [g]": 1.46,
                                    "delivery time [days]": 3,
                                    "data source": "https://www.bricklink.com/v2/catalog/catalogitem.page?P=3701#T=C",
                                    "dimension [studs]": "1 x 4 x 1",
                                    "color": "grey"
                                },
                                "layer": "kpi-COMPONENT"
                            }
                        },
                        {
                            "component": {
                                "uuid": "kpi-a7a6e2c1-bd8a-47af-846c-627196acffcb",
                                "properties": {
                                    "label": "Technic Brick Front Middle Right",
                                    "item number": 3700,
                                    "item description": "Technic, Brick 1 x 2 with Hole",
                                    "category": "frame",
                                    "price [Euro]": 0.01,
                                    "mass [g]": 0.82,
                                    "delivery time [days]": 3,
                                    "data source": "https://www.bricklink.com/v2/catalog/catalogitem.page?P=3700#T=C",
                                    "dimension [studs]": "1 x 2",
                                    "color": "grey"
                                },
                                "layer": "kpi-COMPONENT"
                            }
                        },
                        {
                            "component": {
                                "uuid": "kpi-8cb01243-4fa1-44d2-94e6-bde9328ef5a9",
                                "properties": {
                                    "label": "Technic Brick Front Middle Left",
                                    "item number": 3700,
                                    "item description": "Technic, Brick 1 x 2 with Hole",
                                    "category": "frame",
                                    "price [Euro]": 0.01,
                                    "mass [g]": 0.82,
                                    "delivery time [days]": 3,
                                    "data source": "https://www.bricklink.com/v2/catalog/catalogitem.page?P=3700#T=C",
                                    "dimension [studs]": "1 x 2",
                                    "color": "grey"
                                },
                                "layer": "kpi-COMPONENT"
                            }
                        },
                        {
                            "component": {
                                "uuid": "kpi-bc287141-8e06-4be3-9c2d-732b12a23212",
                                "properties": {
                                    "label": "Technic Brick Back Middle Right",
                                    "item number": 3700,
                                    "item description": "Technic, Brick 1 x 2 with Hole",
                                    "category": "frame",
                                    "price [Euro]": 0.01,
                                    "mass [g]": 0.82,
                                    "delivery time [days]": 3,
                                    "data source": "https://www.bricklink.com/v2/catalog/catalogitem.page?P=3700#T=C",
                                    "dimension [studs]": "1 x 2",
                                    "color": "grey"
                                },
                                "layer": "kpi-COMPONENT"
                            }
                        },
                        {
                            "component": {
                                "uuid": "kpi-c075cd47-5140-4f5f-ab1b-759d79ae36d5",
                                "properties": {
                                    "label": "Technic Brick Back Middle Left",
                                    "item number": 3700,
                                    "item description": "Technic, Brick 1 x 2 with Hole",
                                    "category": "frame",
                                    "price [Euro]": 0.01,
                                    "mass [g]": 0.82,
                                    "delivery time [days]": 3,
                                    "data source": "https://www.bricklink.com/v2/catalog/catalogitem.page?P=3700#T=C",
                                    "dimension [studs]": "1 x 2",
                                    "color": "grey"
                                },
                                "layer": "kpi-COMPONENT"
                            }
                        },
                        {
                            "component": {
                                "uuid": "kpi-a2df3995-d968-439e-9788-48a61e143b5d",
                                "properties": {
                                    "label": "Technic Cross Block Motor",
                                    "item number": 48989,
                                    "item description": "Technic, Pin Connector Perpendicular 3L with 4 Pins",
                                    "category": "frame",
                                    "price [Euro]": 0.01,
                                    "mass [g]": 1.22,
                                    "delivery time [days]": 5,
                                    "data source": "https://www.bricklink.com/v2/catalog/catalogitem.page?P=48989&name=Technic,%20Pin%20Connector%20Perpendicular%203L%20with%204%20Pins&category=%5BTechnic,%20Connector%5D#T=S&O={%22iconly%22:0}",
                                    "dimension [studs]": "3 x 3 x 1",
                                    "color": "grey"
                                },
                                "layer": "kpi-COMPONENT"
                            }
                        },
                        {
                            "component": {
                                "uuid": "kpi-d32dd822-3c2f-4928-ae9f-7dd3f57d058b",
                                "properties": {
                                    "label": "Technic Cross Block Axle Back Right",
                                    "item number": 6536,
                                    "item description": "Technic, Axle and Pin Connector Perpendicular",
                                    "category": "frame",
                                    "price [Euro]": 0.01,
                                    "mass [g]": 0.39,
                                    "delivery time [days]": 7,
                                    "data source": "https://www.bricklink.com/v2/catalog/catalogitem.page?P=6536&name=Technic,%20Axle%20and%20Pin%20Connector%20Perpendicular&category=%5BTechnic,%20Connector%5D#T=S&O={%22iconly%22:0}",
                                    "dimension [studs]": "1x 2 x 1",
                                    "color": "grey"
                                },
                                "layer": "kpi-COMPONENT"
                            }
                        },
                        {
                            "component": {
                                "uuid": "kpi-9d20db17-4914-4502-90c4-a07abf3aad8f",
                                "properties": {
                                    "label": "Technic Cross Block Axle Back Left",
                                    "item number": 6536,
                                    "item description": "Technic, Axle and Pin Connector Perpendicular",
                                    "category": "frame",
                                    "price [Euro]": 0.01,
                                    "mass [g]": 0.39,
                                    "delivery time [days]": 7,
                                    "data source": "https://www.bricklink.com/v2/catalog/catalogitem.page?P=6536&name=Technic,%20Axle%20and%20Pin%20Connector%20Perpendicular&category=%5BTechnic,%20Connector%5D#T=S&O={%22iconly%22:0}",
                                    "dimension [studs]": "1x 2 x 1",
                                    "color": "grey"
                                },
                                "layer": "kpi-COMPONENT"
                            }
                        },
                        {
                            "component": {
                                "uuid": "kpi-5076aa2b-34ad-4eb2-896c-9f55bbcd456a",
                                "properties": {
                                    "label": "Technic Bush Frame Front Right",
                                    "item number": 32123,
                                    "item description": "Technic Bush 1/2 Smooth",
                                    "category": "frame",
                                    "price [Euro]": 0.01,
                                    "mass [g]": 0.01,
                                    "delivery time [days]": 3,
                                    "data source": "https://www.bricklink.com/v2/catalog/catalogitem.page?P=4265c&name=Technic%20Bush%201/2%20Smooth&category=%5BTechnic%5D#T=S&O={%22iconly%22:0}",
                                    "dimension [studs]": 1,
                                    "color": "grey"
                                },
                                "layer": "kpi-COMPONENT"
                            }
                        },
                        {
                            "component": {
                                "uuid": "kpi-bf99cd42-40a4-4db6-a75a-f971d6aef323",
                                "properties": {
                                    "label": "Technic Bush Frame Front Left",
                                    "item number": 32123,
                                    "item description": "Technic Bush 1/2 Smooth",
                                    "category": "frame",
                                    "price [Euro]": 0.01,
                                    "mass [g]": 0.01,
                                    "delivery time [days]": 3,
                                    "data source": "https://www.bricklink.com/v2/catalog/catalogitem.page?P=4265c&name=Technic%20Bush%201/2%20Smooth&category=%5BTechnic%5D#T=S&O={%22iconly%22:0}",
                                    "dimension [studs]": 1,
                                    "color": "grey"
                                },
                                "layer": "kpi-COMPONENT"
                            }
                        },
                        {
                            "component": {
                                "uuid": "kpi-76bb0824-87fb-4863-83c0-01cfc822ef22",
                                "properties": {
                                    "label": "Technic Bush Frame Back Right",
                                    "item number": 32123,
                                    "item description": "Technic Bush 1/2 Smooth",
                                    "category": "frame",
                                    "price [Euro]": 0.01,
                                    "mass [g]": 0.01,
                                    "delivery time [days]": 3,
                                    "data source": "https://www.bricklink.com/v2/catalog/catalogitem.page?P=4265c&name=Technic%20Bush%201/2%20Smooth&category=%5BTechnic%5D#T=S&O={%22iconly%22:0}",
                                    "dimension [studs]": 1,
                                    "color": "grey"
                                },
                                "layer": "kpi-COMPONENT"
                            }
                        },
                        {
                            "component": {
                                "uuid": "kpi-16379798-882c-419b-b2bd-d885c562544f",
                                "properties": {
                                    "label": "Technic Bush Frame Back Left",
                                    "item number": 32123,
                                    "item description": "Technic Bush 1/2 Smooth",
                                    "category": "frame",
                                    "price [Euro]": 0.01,
                                    "mass [g]": 0.01,
                                    "delivery time [days]": 3,
                                    "data source": "https://www.bricklink.com/v2/catalog/catalogitem.page?P=4265c&name=Technic%20Bush%201/2%20Smooth&category=%5BTechnic%5D#T=S&O={%22iconly%22:0}",
                                    "dimension [studs]": 1,
                                    "color": "grey"
                                },
                                "layer": "kpi-COMPONENT"
                            }
                        },
                        {
                            "component": {
                                "uuid": "kpi-5da384e7-e648-420a-9d30-8c894597da81",
                                "properties": {
                                    "label": "Technic Pin First Right",
                                    "item number": 3673,
                                    "item description": "Technic, Pin without Friction Ridges",
                                    "category": "frame",
                                    "price [Euro]": 0.01,
                                    "mass [g]": 0.16,
                                    "delivery time [days]": 3,
                                    "data source": "https://www.bricklink.com/v2/catalog/catalogitem.page?P=3673&name=Technic,%20Pin%20without%20Friction%20Ridges&category=%5BTechnic,%20Pin%5D#T=S&O={%22iconly%22:0}",
                                    "dimension [studs]": 1,
                                    "color": "grey"
                                },
                                "layer": "kpi-COMPONENT"
                            }
                        },
                        {
                            "component": {
                                "uuid": "kpi-5ef04e8d-4b80-45d5-9cd5-a11f1875df53",
                                "properties": {
                                    "label": "Technic Pin First Left",
                                    "item number": 3673,
                                    "item description": "Technic, Pin without Friction Ridges",
                                    "category": "frame",
                                    "price [Euro]": 0.01,
                                    "mass [g]": 0.16,
                                    "delivery time [days]": 3,
                                    "data source": "https://www.bricklink.com/v2/catalog/catalogitem.page?P=3673&name=Technic,%20Pin%20without%20Friction%20Ridges&category=%5BTechnic,%20Pin%5D#T=S&O={%22iconly%22:0}",
                                    "dimension [studs]": 1,
                                    "color": "grey"
                                },
                                "layer": "kpi-COMPONENT"
                            }
                        },
                        {
                            "component": {
                                "uuid": "kpi-078eb2d4-fe0e-46e6-a9d5-dd5b04ef8851",
                                "properties": {
                                    "label": "Technic Pin Secound Right",
                                    "item number": 3673,
                                    "item description": "Technic, Pin without Friction Ridges",
                                    "category": "frame",
                                    "price [Euro]": 0.01,
                                    "mass [g]": 0.16,
                                    "delivery time [days]": 3,
                                    "data source": "https://www.bricklink.com/v2/catalog/catalogitem.page?P=3673&name=Technic,%20Pin%20without%20Friction%20Ridges&category=%5BTechnic,%20Pin%5D#T=S&O={%22iconly%22:0}",
                                    "dimension [studs]": 1,
                                    "color": "grey"
                                },
                                "layer": "kpi-COMPONENT"
                            }
                        },
                        {
                            "component": {
                                "uuid": "kpi-8b1e02a9-8a2e-4345-a446-a382b11ae2cc",
                                "properties": {
                                    "label": "Technic Pin Secound Left",
                                    "item number": 3673,
                                    "item description": "Technic, Pin without Friction Ridges",
                                    "category": "frame",
                                    "price [Euro]": 0.01,
                                    "mass [g]": 0.16,
                                    "delivery time [days]": 3,
                                    "data source": "https://www.bricklink.com/v2/catalog/catalogitem.page?P=3673&name=Technic,%20Pin%20without%20Friction%20Ridges&category=%5BTechnic,%20Pin%5D#T=S&O={%22iconly%22:0}",
                                    "dimension [studs]": 1,
                                    "color": "grey"
                                },
                                "layer": "kpi-COMPONENT"
                            }
                        },
                        {
                            "component": {
                                "uuid": "kpi-5e2bead8-8501-42e1-8a08-137e608ebdd6",
                                "properties": {
                                    "label": "Technic Pin Long Front Right",
                                    "item number": 32556,
                                    "item description": "Technic, Pin 3L without Friction Ridges",
                                    "category": "frame",
                                    "price [Euro]": 0.1,
                                    "mass [g]": 0.25,
                                    "delivery time [days]": 3,
                                    "data source": "https://www.bricklink.com/v2/catalog/catalogitem.page?P=32556&name=Technic,%20Pin%203L%20without%20Friction%20Ridges&category=%5BTechnic,%20Pin%5D#T=S&O={%22iconly%22:0}",
                                    "dimension [studs]": 1,
                                    "color": "grey"
                                },
                                "layer": "kpi-COMPONENT"
                            }
                        },
                        {
                            "component": {
                                "uuid": "kpi-0157ebcb-d083-4193-95c9-5064d51b2068",
                                "properties": {
                                    "label": "Technic Pin Long Front Left",
                                    "item number": 32556,
                                    "item description": "Technic, Pin 3L without Friction Ridges",
                                    "category": "frame",
                                    "price [Euro]": 0.1,
                                    "mass [g]": 0.25,
                                    "delivery time [days]": 3,
                                    "data source": "https://www.bricklink.com/v2/catalog/catalogitem.page?P=32556&name=Technic,%20Pin%203L%20without%20Friction%20Ridges&category=%5BTechnic,%20Pin%5D#T=S&O={%22iconly%22:0}",
                                    "dimension [studs]": 1,
                                    "color": "grey"
                                },
                                "layer": "kpi-COMPONENT"
                            }
                        },
                        {
                            "component": {
                                "uuid": "kpi-2aacb942-4ae7-4d3d-9040-6d00dc06a1cb",
                                "properties": {
                                    "label": "Technic Pin Long Back Right",
                                    "item number": 32556,
                                    "item description": "Technic, Pin 3L without Friction Ridges",
                                    "category": "frame",
                                    "price [Euro]": 0.1,
                                    "mass [g]": 0.25,
                                    "delivery time [days]": 3,
                                    "data source": "https://www.bricklink.com/v2/catalog/catalogitem.page?P=32556&name=Technic,%20Pin%203L%20without%20Friction%20Ridges&category=%5BTechnic,%20Pin%5D#T=S&O={%22iconly%22:0}",
                                    "dimension [studs]": 1,
                                    "color": "grey"
                                },
                                "layer": "kpi-COMPONENT"
                            }
                        },
                        {
                            "component": {
                                "uuid": "kpi-571f47ab-2087-4542-ac41-4ee28d7272c8",
                                "properties": {
                                    "label": "Technic Pin Long Back Left",
                                    "item number": 32556,
                                    "item description": "Technic, Pin 3L without Friction Ridges",
                                    "category": "frame",
                                    "price [Euro]": 0.1,
                                    "mass [g]": 0.25,
                                    "delivery time [days]": 3,
                                    "data source": "https://www.bricklink.com/v2/catalog/catalogitem.page?P=32556&name=Technic,%20Pin%203L%20without%20Friction%20Ridges&category=%5BTechnic,%20Pin%5D#T=S&O={%22iconly%22:0}",
                                    "dimension [studs]": 1,
                                    "color": "grey"
                                },
                                "layer": "kpi-COMPONENT"
                            }
                        },
                        {
                            "component": {
                                "uuid": "kpi-dfecddc1-1f6f-4313-a16d-006cc76fa9a2",
                                "properties": {
                                    "label": "Technic Pin Back Axle Right",
                                    "item number": 3749,
                                    "item description": "Technic, Axle 1L with Pin without Friction Ridges",
                                    "category": "frame",
                                    "price [Euro]": 0.01,
                                    "mass [g]": 0.22,
                                    "delivery time [days]": 5,
                                    "data source": "https://www.bricklink.com/v2/catalog/catalogitem.page?P=3749&name=Technic,%20Axle%20%201L%20with%20Pin%20without%20Friction%20Ridges&category=%5BTechnic,%20Axle%5D#T=S&O={%22iconly%22:0}",
                                    "dimension [studs]": "0,75 x 2 x 0,55",
                                    "color": "grey"
                                },
                                "layer": "kpi-COMPONENT"
                            }
                        },
                        {
                            "component": {
                                "uuid": "kpi-4e87bc9e-339e-47d3-9766-0f44a4aab433",
                                "properties": {
                                    "label": "Technic Pin Back Axle Left",
                                    "item number": 3749,
                                    "item description": "Technic, Axle 1L with Pin without Friction Ridges",
                                    "category": "frame",
                                    "price [Euro]": 0.01,
                                    "mass [g]": 0.22,
                                    "delivery time [days]": 5,
                                    "data source": "https://www.bricklink.com/v2/catalog/catalogitem.page?P=3749&name=Technic,%20Axle%20%201L%20with%20Pin%20without%20Friction%20Ridges&category=%5BTechnic,%20Axle%5D#T=S&O={%22iconly%22:0}",
                                    "dimension [studs]": "0,75 x 2 x 0,55",
                                    "color": "grey"
                                },
                                "layer": "kpi-COMPONENT"
                            }
                        }
                    ],
                    "assemblies": []
                }
            },
            {
                "assembly": {
                    "uuid": "kpi-6dbeaae7-9808-4baf-b9de-50adb38dcd7d",
                    "properties": {
                        "label": "Drive Assembly",
                        "assembly_method": "stick together like lego blocks"
                    },
                    "layer": "kpi-ASSEMBLY",
                    "components": [
                        {
                            "component": {
                                "uuid": "kpi-b5ca5483-947c-415b-91a5-1ac79e94ee45",
                                "properties": {
                                    "label": "Electric Power Batterie",
                                    "item number": "8878-1",
                                    "item description": "Power Functions Rechargeable Battery Box",
                                    "category": "battery",
                                    "price [Euro]": 55,
                                    "mass [g]": 83.94,
                                    "delivery time [days]": 8,
                                    "data source": "https://www.bricklink.com/v2/catalog/catalogitem.page?S=8878-1#T=S&O={%22iconly%22:0}",
                                    "output voltage [V]": 7.4,
                                    "dimensions [cm]": "15 x 15 x 3,5",
                                    "color": "grey"
                                },
                                "layer": "kpi-COMPONENT"
                            }
                        },
                        {
                            "component": {
                                "uuid": "kpi-56092561-36eb-4efd-8e6c-498937a66846",
                                "properties": {
                                    "label": "Electric Power Motor",
                                    "item number": "88003-1",
                                    "item description": "Power Functions L-Motor",
                                    "category": "motor",
                                    "related items": "8881, 8878, 88000",
                                    "idle current [mA]": 120,
                                    "idle speed [rev per min]": 390,
                                    "locking torque [Ncm]": 18,
                                    "price [Euro]": 15,
                                    "mass [g]": 48.0,
                                    "delivery time [days]": 3,
                                    "data source": "https://www.bricklink.com/v2/catalog/catalogitem.page?S=88003-1&name=Power%20Functions%20L-Motor&category=%5BPower%20Functions%5D#T=S&O={%22iconly%22:0}",
                                    "compatible battery": "8881, 8878, 88000",
                                    "input voltage [V]": 9,
                                    "dimensions [cm]": "13 x 11 x 2.5",
                                    "color": "grey"
                                },
                                "layer": "kpi-COMPONENT"
                            }
                        }
                    ],
                    "assemblies": [
                        {
                            "assembly": {
                                "uuid": "kpi-5f8655f5-c5be-4b74-9bdc-2fa5f589861e",
                                "properties": {
                                    "label": "Gears Component",
                                    "assembly_method": "stick together like lego blocks"
                                },
                                "layer": "kpi-SUBASSEMBLY",
                                "components": [
                                    {
                                        "component": {
                                            "uuid": "kpi-f59439de-bed9-44a5-a3f6-4e5ee46a8472",
                                            "properties": {
                                                "label": "Technic Gear Axle",
                                                "item number": 32269,
                                                "item description": "Gear 20 Tooth",
                                                "category": "gear",
                                                "price [Euro]": 0.36,
                                                "mass [g]": 1.4,
                                                "delivery time [days]": 13,
                                                "data source": "https://www.bricklink.com/v2/catalog/catalogitem.page?P=32269#T=C",
                                                "color": "grey"
                                            },
                                            "layer": "kpi-COMPONENT"
                                        }
                                    },
                                    {
                                        "component": {
                                            "uuid": "kpi-3711a2e3-adfa-4222-a6ec-5cf1a65a23e4",
                                            "properties": {
                                                "label": "Technic Gear Motor",
                                                "item number": 32498,
                                                "item description": "Gear 36 Tooth",
                                                "category": "gear",
                                                "price [Euro]": 0.88,
                                                "mass [g]": 3.5,
                                                "delivery time [days]": 12,
                                                "data source": "https://www.bricklink.com/v2/catalog/catalogitem.page?P=32498#T=C",
                                                "color": "grey"
                                            },
                                            "layer": "kpi-COMPONENT"
                                        }
                                    },
                                    {
                                        "component": {
                                            "uuid": "kpi-421a65d4-29cd-4970-b9c5-69a314457a38",
                                            "properties": {
                                                "label": "Technic Bush Gears Axle Right",
                                                "item number": 32123,
                                                "item description": "Technic Bush 1/2 Smooth",
                                                "category": "frame",
                                                "price [Euro]": 0.01,
                                                "mass [g]": 0.01,
                                                "delivery time [days]": 3,
                                                "data source": "https://www.bricklink.com/v2/catalog/catalogitem.page?P=4265c&name=Technic%20Bush%201/2%20Smooth&category=%5BTechnic%5D#T=S&O={%22iconly%22:0}",
                                                "dimension [studs]": 1,
                                                "color": "grey"
                                            },
                                            "layer": "kpi-COMPONENT"
                                        }
                                    },
                                    {
                                        "component": {
                                            "uuid": "kpi-e87a570e-6a29-4f61-943c-3d1515d36cfc",
                                            "properties": {
                                                "label": "Technic Bush Gears Axle Left",
                                                "item number": 32123,
                                                "item description": "Technic Bush 1/2 Smooth",
                                                "category": "frame",
                                                "price [Euro]": 0.01,
                                                "mass [g]": 0.01,
                                                "delivery time [days]": 3,
                                                "data source": "https://www.bricklink.com/v2/catalog/catalogitem.page?P=4265c&name=Technic%20Bush%201/2%20Smooth&category=%5BTechnic%5D#T=S&O={%22iconly%22:0}",
                                                "dimension [studs]": 1,
                                                "color": "grey"
                                            },
                                            "layer": "kpi-COMPONENT"
                                        }
                                    },
                                    {
                                        "component": {
                                            "uuid": "kpi-9801fbe8-8167-4fda-bde7-af90cc688f06",
                                            "properties": {
                                                "label": "Technic Bush Gears Motor Front",
                                                "item number": 32123,
                                                "item description": "Technic Bush 1/2 Smooth",
                                                "category": "frame",
                                                "price [Euro]": 0.01,
                                                "mass [g]": 0.01,
                                                "delivery time [days]": 3,
                                                "data source": "https://www.bricklink.com/v2/catalog/catalogitem.page?P=4265c&name=Technic%20Bush%201/2%20Smooth&category=%5BTechnic%5D#T=S&O={%22iconly%22:0}",
                                                "dimension [studs]": 1,
                                                "color": "grey"
                                            },
                                            "layer": "kpi-COMPONENT"
                                        }
                                    },
                                    {
                                        "component": {
                                            "uuid": "kpi-20d0be76-6961-479b-81c4-1bb79187d336",
                                            "properties": {
                                                "label": "Technic Bush Gears Motor Back",
                                                "item number": 32123,
                                                "item description": "Technic Bush 1/2 Smooth",
                                                "category": "frame",
                                                "price [Euro]": 0.01,
                                                "mass [g]": 0.01,
                                                "delivery time [days]": 3,
                                                "data source": "https://www.bricklink.com/v2/catalog/catalogitem.page?P=4265c&name=Technic%20Bush%201/2%20Smooth&category=%5BTechnic%5D#T=S&O={%22iconly%22:0}",
                                                "dimension [studs]": 1,
                                                "color": "grey"
                                            },
                                            "layer": "kpi-COMPONENT"
                                        }
                                    },
                                    {
                                        "component": {
                                            "uuid": "kpi-0b5cc2a6-fa6f-429a-9ae6-f069e95f8108",
                                            "properties": {
                                                "label": "Technic Axle Gear",
                                                "item number": 32073,
                                                "item description": "Axle 5 studs",
                                                "category": "axle",
                                                "price [Euro]": 0.001,
                                                "mass [g]": 0.66,
                                                "delivery time [days]": 3,
                                                "data source": "https://www.bricklink.com/v2/catalog/catalogitem.page?P=32073#T=S&O={%22iconly%22:0}",
                                                "dimension [studs]": 5,
                                                "color": "grey"
                                            },
                                            "layer": "kpi-COMPONENT"
                                        }
                                    }
                                ],
                                "assemblies": []
                            }
                        }
                    ]
                }
            },
            {
                "assembly": {
                    "uuid": "kpi-3ae0b540-d4f3-471e-9ac9-980c05afa411",
                    "properties": {
                        "label": "Chassis Assembly",
                        "assembly_method": "stick together like lego blocks"
                    },
                    "layer": "kpi-ASSEMBLY",
                    "components": [],
                    "assemblies": [
                        {
                            "assembly": {
                                "uuid": "kpi-ae8eb02f-20c5-41ea-a057-d00bc1e0298d",
                                "properties": {
                                    "label": "Front Axle",
                                    "assembly_method": "stick together like lego blocks"
                                },
                                "layer": "kpi-SUBASSEMBLY",
                                "components": [
                                    {
                                        "component": {
                                            "uuid": "kpi-4d7a9bfa-df58-4e48-8331-fab7318c03a3",
                                            "properties": {
                                                "label": "Technic Axle Front",
                                                "item number": 50451,
                                                "item description": "Axle 16 studs",
                                                "category": "axle",
                                                "price [Euro]": 0.75,
                                                "mass [g]": 2.37,
                                                "delivery time [days]": 3,
                                                "data source": "https://www.bricklink.com/v2/catalog/catalogitem.page?P=50451#T=S&O={%22iconly%22:0}",
                                                "dimension [studs]": 16,
                                                "color": "grey"
                                            },
                                            "layer": "kpi-COMPONENT"
                                        }
                                    },
                                    {
                                        "component": {
                                            "uuid": "kpi-e006fc8e-4aac-4435-8943-608102a3e662",
                                            "properties": {
                                                "label": "Wheel Front Right",
                                                "item number": "56904c02",
                                                "item description": "wheel 43,2",
                                                "category": "wheel",
                                                "related items": 30699,
                                                "price [Euro]": 0.11,
                                                "mass [g]": 13.0,
                                                "delivery time [days]": 5,
                                                "data source": "https://www.bricklink.com/v2/catalog/catalogitem.page?P=56904c02#T=C",
                                                "diameter [mm]": 43.2,
                                                "color": "lavender"
                                            },
                                            "layer": "kpi-COMPONENT"
                                        }
                                    },
                                    {
                                        "component": {
                                            "uuid": "kpi-859c125d-5824-418b-a78c-db3b687e03a8",
                                            "properties": {
                                                "label": "Wheel Front Left",
                                                "item number": "56904c02",
                                                "item description": "wheel 43,2",
                                                "category": "wheel",
                                                "related items": 30699,
                                                "price [Euro]": 0.11,
                                                "mass [g]": 13.0,
                                                "delivery time [days]": 5,
                                                "data source": "https://www.bricklink.com/v2/catalog/catalogitem.page?P=56904c02#T=C",
                                                "diameter [mm]": 43.2,
                                                "color": "lavender"
                                            },
                                            "layer": "kpi-COMPONENT"
                                        }
                                    }
                                ],
                                "assemblies": []
                            }
                        },
                        {
                            "assembly": {
                                "uuid": "kpi-52e3e45f-1198-4fbd-ae6f-f21b6033a46b",
                                "properties": {
                                    "label": "Back Axle",
                                    "assembly_method": "stick together like lego blocks"
                                },
                                "layer": "kpi-SUBASSEMBLY",
                                "components": [
                                    {
                                        "component": {
                                            "uuid": "kpi-c7e3bcab-ad24-4523-a345-0bd8504d45e2",
                                            "properties": {
                                                "label": "Technic Axle Back",
                                                "item number": 50451,
                                                "item description": "Axle 16 studs",
                                                "category": "axle",
                                                "price [Euro]": 0.75,
                                                "mass [g]": 2.37,
                                                "delivery time [days]": 3,
                                                "data source": "https://www.bricklink.com/v2/catalog/catalogitem.page?P=50451#T=S&O={%22iconly%22:0}",
                                                "dimension [studs]": 16,
                                                "color": "grey"
                                            },
                                            "layer": "kpi-COMPONENT"
                                        }
                                    },
                                    {
                                        "component": {
                                            "uuid": "kpi-66337f63-9ab8-433e-af67-6f8d13f17094",
                                            "properties": {
                                                "label": "Wheel Back Right",
                                                "item number": "56904c02",
                                                "item description": "wheel 43,2",
                                                "category": "wheel",
                                                "related items": 30699,
                                                "price [Euro]": 0.11,
                                                "mass [g]": 13.0,
                                                "delivery time [days]": 5,
                                                "data source": "https://www.bricklink.com/v2/catalog/catalogitem.page?P=56904c02#T=C",
                                                "diameter [mm]": 43.2,
                                                "color": "lavender"
                                            },
                                            "layer": "kpi-COMPONENT"
                                        }
                                    },
                                    {
                                        "component": {
                                            "uuid": "kpi-d207db68-17ee-48e8-9b32-5b9310a83c2a",
                                            "properties": {
                                                "label": "Wheel Back Left",
                                                "item number": "56904c02",
                                                "item description": "wheel 43,2",
                                                "category": "wheel",
                                                "related items": 30699,
                                                "price [Euro]": 0.11,
                                                "mass [g]": 13.0,
                                                "delivery time [days]": 5,
                                                "data source": "https://www.bricklink.com/v2/catalog/catalogitem.page?P=56904c02#T=C",
                                                "diameter [mm]": 43.2,
                                                "color": "lavender"
                                            },
                                            "layer": "kpi-COMPONENT"
                                        }
                                    }
                                ],
                                "assemblies": []
                            }
                        }
                    ]
                }
            }
        ]
    }
}