{
	"JSON": {
		"ID": "1ee82f6b-6a1b-666d-9b57-45070437eb3b",
		"label": "",
		"comment": "UUID6 is used"
	},
	"group": {
		"number": "12",
		"author": "Keanu Engel",
		"experiment": "Kaloriemetrie"
	}
}