{
	"JSON": {
		"ID": "1ee82f6e-50a6-6910-86c9-f337f351948c",
		"label": "",
		"comment": "UUID6 is used"
	},
	"probe": {
		"metadata": "300",
		"info": "300ml heißes Wasser in einer Tasse wird an der Umgebung abkühlen gelassen"
	}
}
