{
	"JSON": {
		"ID": "1eeaf34e-6054-614a-bd63-5cf06bb238d8",
		"label": "",
		"comment": "UUID6 is used"
	},
	"general": {
		"researcher": "JunghyunSeo",
		"experiment": "home_experiment_lavalrotor"
	}
}