{
	"JSON": {
		"ID": "xxxxxxxx-xxxx-xxxx-xxxx-xxxx(UUID)xx",
		"label": "",
		"comment": "UUID6 is used"
	},
    "comment": "here you can write down something important about this setup file",
    "info": "List below ALL components, you used in your experiment. By using the UUID there is no possibility to mix something up.",
	"setup": {
		"xxxxxxxx-xxxx-xxxx-xxxx-xxxx(UUID)xx": {
            "type": "group_info",
			"name": "group_info",
            "comment": ""
        },
		"xxxxxxxx-xxxx-xxxx-xxxx-xxxx(UUID)xy": {
            "type": "instrument",
			"name": "raspberry_pi",
            "comment": ""
        },
		"xxxxxxxx-xxxx-xxxx-xxxx-xxxx(UUID)xz": {
            "type": "sensor",
			"name": "use this field to name the sensor, that it is understandable where you used it. Exapmle: temperature_cup or temperature_environment",
            "comment": ""
        },
		"xxxxxxxx-xxxx-xxxx-xxxx-xxxx(UUID)yy": {
            "type": "probe",
			"name": "probe_description",
            "comment": ""
        },
		"add_more_here_if_you_need": {
			"type": "choose your own type, if you miss one",
			"name": "",
			"comment": ""
		}
	}
}