{
	"JSON": {
		"ID": "xxxxxxxx-xxxx-xxxx-xxxx-xxxx(UUID)xx",
		"label": "",
		"comment": "UUID6 is used"
	},
	"probe": {
		"metadata": "define your own metadata here",
		"info": "think about all necessary things you should write down, that someone else can understand what you were doing"
	}
}