{
    "JSON": {
        "ID": "1eeaee67-8162-63b0-b230-2afc7b9d69ee",
        "label": "setup_compressor",
        "comment": "auto generated with s_create_json_setup_from_template.py"
    },
    "setup": {
        "1ee846ef-4df0-632a-bfdb-ef2ea3181b39": {
            "type": "general",
            "name": "general_info",
            "comment": ""
        },
        "1ee846f1-b588-6d3c-9659-7c3266d530e8": {
            "type": "instrument",
            "name": "raspberry_pi",
            "comment": ""
        },
        "1ee847be-fddd-6ee4-892a-68c4555b0981": {
            "type": "sensor",
            "name": "accelerometer",
            "range": {
                "min": -2,
                "max": 2,
                "units": "standard_gravity"
            },
            "frequency": {
                "value": 800,
                "units": "Hertz"
            },
            "comment": ""
        },
        "1eeaee59-a874-6cf0-b557-1abda2fc28d5": {
            "type": "probe",
            "name": "handy",
            "comment": ""
        }
    }
}