{
	"JSON": {
		"ID": "1ee82db3-b603-6cad-bf03-e916d610feeb",
		"label": "",
		"comment": "UUID6 is used"
	},
	"probe": {
		"metadata": "300 ml heißes Wasser und 300 ml kaltes Wasser",
		"info": "Temperaturen wurden 15 sekunden lang seperat gemessen und nach insgesamt 30 sekunden zusammengemischt"
	}
}