{
	"JSON": {
		"ID": "1ee822dc-24f4-6abb-82d6-07327bc507c1",
		"label": "",
		"comment": "UUID6 is used"
	},
    "comment": "here you can write down something important about this setup file",
    "info": "List below ALL components, you used in your experiment. By using the UUID there is no possibility to mix something up.",
	"setup": {
		"1ee82da6-05e3-6744-a5ca-ef90ef9a121f": {
            "type": "group_info",
			"name": "group_info",
            "comment": ""
        },
		"1ee82da9-6de8-6a0b-a307-5c1d4eabc161": {
            "type": "instrument",
			"name": "raspberry_pi",
            "comment": ""
        },
		"1ee822cb-e29f-6a7f-8e1f-ecc9f433cf9e": {
            "type": "sensor",
			"name": "temperature_environment",
            "comment": "sensor 1"
        },
        "1ee822cc-8cfc-68bc-bdcb-5fcdd9fe6243": {
            "type": "sensor",
			"name": "temperature_cup",
            "comment": "sensor 2"
        },
            "1ee82db5-0954-65e3-97ff-f4088ca8efbc": {
            "type": "probe",
			"name": "probe_description",
            "comment": ""
		}
	}
}