name;email;orcid;org_ror;wikidata_id;confirmation
Amirpasha Mozaffari;a.mozaffari@fz-juelich.de;0000-0001-6719-0425;02nv7yv05;
Christopher Purr;christopher.purr@uni-hamburg.de;0000-0002-9376-432X;00g30e956;
Claudia Börner;leitung-ikmz@b-tu.de;0000-0002-9914-5060;02wxx3e24;;email_2023-09-06
Claus Weiland;claus.weiland@senckenberg.de;0000-0003-0351-6523;00xmqmx64;
David Hecker;david.hecker@dlr.de;0000-0003-3836-2800;04bwf3e34;
Fabian Gans;fgans@bgc-jena.mpg.de;0000-0001-9614-0435;051yxp643;;email_2023-08-11
Frank Kaspar;frank.kaspar@dwd.de;0000-0001-8819-8450;02nrqs528;
Gauvain Wiemer;wiemer@allianz-meeresforschung.de;0000-0003-4420-5318;;Q65233647;email_2023-08-14
Gotthard Meinel;g.meinel@ioer.de;0000-0002-9201-7664;02t26g637;
Hela Mehrtens;hmehrtens@geomar.de;0000-0002-4526-2472;02h2x0161;
Hildegard Gödde;hildegard.goedde@geo-x.net;;;Q115265089;email_2023-08-24
Jan Philipp Dietrich;dietrich@pik-potsdam.de;0000-0002-4309-6431;03e8s1d88;email_2023-08-17
Jörn Quedenau;joern.quedenau@iass-potsdam.de;0000-0002-2737-2897;01vvnmw35;
Kirsten Elger;kelger@gfz-potsdam.de;0000-0001-5140-8602;;Q47491582;email_2023-08-11
Lorenz Reimer;lorenz.reimer@dsmz.de;0000-0002-7805-0660;02tyer376;;email_2023-08-14
Markus Stocker;markus.stocker@tib.eu;0000-0001-5492-3212;04aj4c181;;email_2023-08-11
Nicole Richter;n.richter@nug.rwth-aachen.de;0000-0001-5713-6708;04xfq0f34;
Christin Keller;christin.keller@dainst.de;0000-0002-5727-0226;041qv0h25;
Rico Hengst;rico.hengst@tropos.de;0000-0001-8994-5868;03a5xsc56;email_2023-08-14
Sami Domisch;sami.domisch@igb-berlin.de;0000-0002-8127-9335;01nftxb06;
Sibylle Haßler;sibylle.hassler@kit.edu;0000-0001-5411-8491;04t3en479;
Stephan Hachinger;stephan.hachinger@lrz.de;0000-0001-8341-1478;05558nw16;
Susanne Tamm;susanne.tamm@bsh.de;0000-0002-3382-1118;03ycvrj88;
Thorsten Agemar;thorsten.agemar@leibniz-liag.de;0000-0002-0100-0470;05txczf44;;email_2023-08-17
Wolfgang zu Castell;wolfgang.castell@gfz-potsdam.de;0000-0003-2820-6564;04z8jg394;;email_2023-08-23
Jan Bumberger;jan.bumberger@ufz.de;0000-0003-3780-8663;000h6jb29;;email_2023-08-17
Andreas Hübner;andreas.huebner@fu-berlin.de;0000-0001-7342-9789;046ak2485;;email_2023-08-17
Eric Habiryayo;eric.habiryayo@bgr.de;;04d77de73;;email_2023-09-05
Falko Glöckler;falko.gloeckler@mfn.berlin;0000-0002-7127-2738;052d1a351;
Hannes Thiemann;thiemann@dkrz.de;0000-0002-2329-8511;03ztgj037;;email_2023-08-14
Jörg Seegert;joerg.seegert@tu-dresden.de;0000-0001-9357-2830;;Q112117161;phone_2023-11-15
Jörg Seegert;joerg.seegert@tu-dresden.de;0000-0001-9357-2830;042aqky30;
Dominik Hezel;dominik.hezel@em.uni-frankfurt.de;0000-0002-5059-2281;04cvxnb49;;email_2023-08-20
Peter Valena;peter.valena@gda.bayern.de;0000-0003-2673-2974;01hq2jk95;;email_2023-08-14
Bodo Bookhagen;bodo.bookhagen@uni-potsdam.de;0000-0003-1323-6453;03bnmw459;;email_2023-08-11
Carsten Keßler;carsten.kessler@hs-bochum.de;0000-0002-9724-820X;04x02q560;;email_2023-08-15
Christiane Schmullius;c.schmullius@uni-jena.de;0000-0001-6182-1249;05qpz1x62;
Edzer Pebesma;edzer.pebesma@uni-muenster.de;0000-0001-8049-7069;00pd74e08;
Gerhard Wörner;gwoerne@gwdg.de;0000-0003-1110-8976;01y9bpm73;
Nikolai Svoboda;nikolai.svoboda@zalf.de;0000-0003-3860-4400;01ygyzs83;
Heiner Igel;heiner.igel@lmu.de;0000-0002-7242-6399;05591te55;
Klaus Greve;klaus.greve@uni-bonn.de;0000-0001-6463-6161;041nas322;
Martin Kada;martin.kada@tu-berlin.de;0000-0002-7490-7452;03v4gjf40;
Martin Werner;martin.werner@tum.de;0000-0002-6951-8022;02kkvpp62;
Michal Kucera;mkucera@marum.de;0000-0002-7817-9018;04ers2y35;
Nguyen Xuan Thinh;nguyen.thinh@tu-dortmund.de;0000-0002-5134-3463;01k97gp34;
Patrick Hostert;patrick.hostert@geo.hu-berlin.de;0000-0002-5730-5484;01hcx6992;;email_2023-08-29
Peter Dannenberg;p.dannenberg@uni-koeln.de;0000-0002-4159-6635;00rcxh774;
Stephan Frickenhaus;stephan.frickenhaus@awi.de;0000-0002-0356-9791;032e6b942;
Thomas Walter;thomas.walter@uni-tuebingen.de;0000-0002-8656-2340;03a1kwz48;
Vikram Unnithan;v.unnithan@jacobs-university.de;0000-0002-4656-3824;02yrs2n53;
Annette Eicker;annette.eicker@hcu-hamburg.de;0000-0002-9087-1445;01fzsd381;
Jörg Benndorf;joerg.benndorf@mabb.tu-freiberg.de;0000-0002-2002-8639;031vc2293;;email_2023-08-15
Monika Sester;monika.sester@ikg.uni-hannover.de;0000-0002-6656-8809;0304hq317;
Peter F. Pelz;peter.pelz@fst.tu-darmstadt.de;0000-0002-0195-627X;05n911h24;
Johannes Barth;johannes.barth@fau.de;0000-0002-3494-4507;00f7hpc57;
Serena Coetzee;serenacoetzee@unu.edu;0000-0001-8683-8047;03xp99m49;;email_2023-08-11
Thilo Paul-Stüve;paul-stueve@rz.uni-kiel.de;0000-0001-7451-0976;04v76ef78;;email_2023-09-08
Tim Schürmann;kstgdide@bkg.bund.de;0000-0002-4074-1423;01q6zce06;;email_2023-09-07
Ulrike Kleeberg;ulrike.kleeberg@hereon.de;0000-0002-9170-1739;03qjp1d79;
Veronika Grupp;veronika.grupp@uni-leipzig.de;0000-0003-4017-2467;03s7gtk40;
