{
    "assembly": {
        "uuid": "kpi-187d9eab-2255-4d65-81a9-4dbb811348f5",
        "properties": {
            "label": "car 2",
            "manufacturer": "Jonathan Kollmann",
            "assembly_method": "connect the motor assembly and the battery with the chassis",
            "total price [Euro]": 24.65,
            "price performance ratio [Euro/g]": 0.08,
            "delivery time [days]": 11
        },
        "layer": "kpi-SYSTEM",
        "components": [
            {
                "component": {
                    "uuid": "kpi-d8cf1513-9953-426f-bad8-3bde53be5bfd",
                    "properties": {
                        "label": "battery",
                        "item number": "2847c01",
                        "item description": "Electric 9V Battery Box",
                        "category": "battery",
                        "price [Euro]": 2,
                        "mass [g]": 172.7,
                        "delivery time [days]": 3,
                        "data source": "https://www.bricklink.com/v2/catalog/catalogitem.page?P=2847c01&name=Electric%209V%20Battery%20Box%204%20x%2014%20x%204%20with%20Red%20Buttons%20and%20Contact%20Plate%20with%20Dark%20Gray%20Base%20(2846%20/%202847c00)&category=%5BElectric,%20Battery%20Box%5D#T=S&O={%22iconly%22:0}",
                        "output voltage [V]": 9.0,
                        "dimensions [cm]": "11,2 x 3,2 x 3,2",
                        "color": "light grey"
                    },
                    "layer": "kpi-COMPONENT"
                }
            }
        ],
        "assemblies": [
            {
                "assembly": {
                    "uuid": "kpi-fb77190f-0d7c-4338-87d9-cd0d9e2c783d",
                    "properties": {
                        "label": "chassis assembly",
                        "assembly_method": "put the axles trough the body, the bushes, the gear and the body subassembly in the right order"
                    },
                    "layer": "kpi-SUBASSEMBLY",
                    "components": [
                        {
                            "component": {
                                "uuid": "kpi-2a5c00f0-f60e-40fb-855a-5beb22f4f7a8",
                                "properties": {
                                    "label": "little bush 1",
                                    "item number": 32123,
                                    "item description": "Technic Bush 1/2 Smooth",
                                    "category": "frame",
                                    "price [Euro]": 0.01,
                                    "mass [g]": 0.01,
                                    "delivery time [days]": 3,
                                    "data source": "https://www.bricklink.com/v2/catalog/catalogitem.page?P=4265c&name=Technic%20Bush%201/2%20Smooth&category=%5BTechnic%5D#T=S&O={%22iconly%22:0}",
                                    "dimension [studs]": 1,
                                    "color": "yellow"
                                },
                                "layer": "kpi-COMPONENT"
                            }
                        },
                        {
                            "component": {
                                "uuid": "kpi-8d390f32-9d5b-44d8-b760-e048b7904219",
                                "properties": {
                                    "label": "little bush 2",
                                    "item number": 32123,
                                    "item description": "Technic Bush 1/2 Smooth",
                                    "category": "frame",
                                    "price [Euro]": 0.01,
                                    "mass [g]": 0.01,
                                    "delivery time [days]": 3,
                                    "data source": "https://www.bricklink.com/v2/catalog/catalogitem.page?P=4265c&name=Technic%20Bush%201/2%20Smooth&category=%5BTechnic%5D#T=S&O={%22iconly%22:0}",
                                    "dimension [studs]": 1,
                                    "color": "yellow"
                                },
                                "layer": "kpi-COMPONENT"
                            }
                        },
                        {
                            "component": {
                                "uuid": "kpi-c22df00c-4763-4db1-99ae-b9219a51d2c7",
                                "properties": {
                                    "label": "little bush 3",
                                    "item number": 32123,
                                    "item description": "Technic Bush 1/2 Smooth",
                                    "category": "frame",
                                    "price [Euro]": 0.01,
                                    "mass [g]": 0.01,
                                    "delivery time [days]": 3,
                                    "data source": "https://www.bricklink.com/v2/catalog/catalogitem.page?P=4265c&name=Technic%20Bush%201/2%20Smooth&category=%5BTechnic%5D#T=S&O={%22iconly%22:0}",
                                    "dimension [studs]": 1,
                                    "color": "yellow"
                                },
                                "layer": "kpi-COMPONENT"
                            }
                        },
                        {
                            "component": {
                                "uuid": "kpi-3c6f468f-ee47-43bd-a4f8-9dbd052d1362",
                                "properties": {
                                    "label": "little bush 4",
                                    "item number": 32123,
                                    "item description": "Technic Bush 1/2 Smooth",
                                    "category": "frame",
                                    "price [Euro]": 0.01,
                                    "mass [g]": 0.01,
                                    "delivery time [days]": 3,
                                    "data source": "https://www.bricklink.com/v2/catalog/catalogitem.page?P=4265c&name=Technic%20Bush%201/2%20Smooth&category=%5BTechnic%5D#T=S&O={%22iconly%22:0}",
                                    "dimension [studs]": 1,
                                    "color": "yellow"
                                },
                                "layer": "kpi-COMPONENT"
                            }
                        },
                        {
                            "component": {
                                "uuid": "kpi-8dd6bacb-6e42-4416-8f30-72e8970e2c10",
                                "properties": {
                                    "label": "little bush 5",
                                    "item number": 32123,
                                    "item description": "Technic Bush 1/2 Smooth",
                                    "category": "frame",
                                    "price [Euro]": 0.01,
                                    "mass [g]": 0.01,
                                    "delivery time [days]": 3,
                                    "data source": "https://www.bricklink.com/v2/catalog/catalogitem.page?P=4265c&name=Technic%20Bush%201/2%20Smooth&category=%5BTechnic%5D#T=S&O={%22iconly%22:0}",
                                    "dimension [studs]": 1,
                                    "color": "yellow"
                                },
                                "layer": "kpi-COMPONENT"
                            }
                        },
                        {
                            "component": {
                                "uuid": "kpi-e36a93f0-697a-4a97-b332-d89aeb16ffc8",
                                "properties": {
                                    "label": "little bush 6",
                                    "item number": 32123,
                                    "item description": "Technic Bush 1/2 Smooth",
                                    "category": "frame",
                                    "price [Euro]": 0.01,
                                    "mass [g]": 0.01,
                                    "delivery time [days]": 3,
                                    "data source": "https://www.bricklink.com/v2/catalog/catalogitem.page?P=4265c&name=Technic%20Bush%201/2%20Smooth&category=%5BTechnic%5D#T=S&O={%22iconly%22:0}",
                                    "dimension [studs]": 1,
                                    "color": "yellow"
                                },
                                "layer": "kpi-COMPONENT"
                            }
                        },
                        {
                            "component": {
                                "uuid": "kpi-fc5354e9-e862-438e-890c-7fcebc204fba",
                                "properties": {
                                    "label": "big bush 1",
                                    "item number": 3713,
                                    "item description": "Technic Bush",
                                    "category": "frame",
                                    "price [Euro]": 0.01,
                                    "mass [g]": 0.14,
                                    "delivery time [days]": 3,
                                    "data source": "https://www.bricklink.com/v2/catalog/catalogitem.page?P=3713&name=Technic%20Bush&category=%5BTechnic%5D#T=S&O={%22iconly%22:0}",
                                    "dimension [studs]": 1,
                                    "color": "red"
                                },
                                "layer": "kpi-COMPONENT"
                            }
                        },
                        {
                            "component": {
                                "uuid": "kpi-42dd60d3-faa4-4e56-87a7-1530f9740bfa",
                                "properties": {
                                    "label": "big bush 2",
                                    "item number": 3713,
                                    "item description": "Technic Bush",
                                    "category": "frame",
                                    "price [Euro]": 0.01,
                                    "mass [g]": 0.14,
                                    "delivery time [days]": 3,
                                    "data source": "https://www.bricklink.com/v2/catalog/catalogitem.page?P=3713&name=Technic%20Bush&category=%5BTechnic%5D#T=S&O={%22iconly%22:0}",
                                    "dimension [studs]": 1,
                                    "color": "red"
                                },
                                "layer": "kpi-COMPONENT"
                            }
                        },
                        {
                            "component": {
                                "uuid": "kpi-154d7cf1-74df-460d-b04b-cbda2f0491fe",
                                "properties": {
                                    "label": "front axle",
                                    "item number": 23948,
                                    "item description": "Axle 11 studs",
                                    "category": "axle",
                                    "price [Euro]": 0.15,
                                    "mass [g]": 1.65,
                                    "delivery time [days]": 3,
                                    "data source": "https://www.bricklink.com/v2/catalog/catalogitem.page?P=23948#T=S&O={%22iconly%22:0}",
                                    "dimension [studs]": 11,
                                    "color": "black"
                                },
                                "layer": "kpi-COMPONENT"
                            }
                        },
                        {
                            "component": {
                                "uuid": "kpi-c26d83d6-f74e-4de9-a59d-0e270cc89184",
                                "properties": {
                                    "label": "back axle",
                                    "item number": 50451,
                                    "item description": "Axle 16 studs",
                                    "category": "axle",
                                    "price [Euro]": 0.75,
                                    "mass [g]": 2.37,
                                    "delivery time [days]": 3,
                                    "data source": "https://www.bricklink.com/v2/catalog/catalogitem.page?P=50451#T=S&O={%22iconly%22:0}",
                                    "dimension [studs]": 16,
                                    "color": "black"
                                },
                                "layer": "kpi-COMPONENT"
                            }
                        },
                        {
                            "component": {
                                "uuid": "kpi-fbc389e9-c53a-4632-a52d-5cb9b45bcfb3",
                                "properties": {
                                    "label": "wheel 1",
                                    "item number": "56904c02",
                                    "item description": "wheel 43,2",
                                    "category": "wheel",
                                    "related items": 30699,
                                    "price [Euro]": 0.11,
                                    "mass [g]": 13.0,
                                    "delivery time [days]": 5,
                                    "data source": "https://www.bricklink.com/v2/catalog/catalogitem.page?P=56904c02#T=C",
                                    "diameter [mm]": 43.2,
                                    "color": "red"
                                },
                                "layer": "kpi-COMPONENT"
                            }
                        },
                        {
                            "component": {
                                "uuid": "kpi-096d6d20-8c6d-4672-9242-700a98824ee6",
                                "properties": {
                                    "label": "wheel 2",
                                    "item number": "56904c02",
                                    "item description": "wheel 43,2",
                                    "category": "wheel",
                                    "related items": 30699,
                                    "price [Euro]": 0.11,
                                    "mass [g]": 13.0,
                                    "delivery time [days]": 5,
                                    "data source": "https://www.bricklink.com/v2/catalog/catalogitem.page?P=56904c02#T=C",
                                    "diameter [mm]": 43.2,
                                    "color": "red"
                                },
                                "layer": "kpi-COMPONENT"
                            }
                        },
                        {
                            "component": {
                                "uuid": "kpi-b4331578-08d8-44b1-848c-4d86c6c36c07",
                                "properties": {
                                    "label": "wheel 3",
                                    "item number": "56904c02",
                                    "item description": "wheel 43,2",
                                    "category": "wheel",
                                    "related items": 30699,
                                    "price [Euro]": 0.11,
                                    "mass [g]": 13.0,
                                    "delivery time [days]": 5,
                                    "data source": "https://www.bricklink.com/v2/catalog/catalogitem.page?P=56904c02#T=C",
                                    "diameter [mm]": 43.2,
                                    "color": "red"
                                },
                                "layer": "kpi-COMPONENT"
                            }
                        },
                        {
                            "component": {
                                "uuid": "kpi-ff184310-eaa9-4553-9ef2-ab3f69e4c4f9",
                                "properties": {
                                    "label": "wheel 4",
                                    "item number": "56904c02",
                                    "item description": "wheel 43,2",
                                    "category": "wheel",
                                    "related items": 30699,
                                    "price [Euro]": 0.11,
                                    "mass [g]": 13.0,
                                    "delivery time [days]": 5,
                                    "data source": "https://www.bricklink.com/v2/catalog/catalogitem.page?P=56904c02#T=C",
                                    "diameter [mm]": 43.2,
                                    "color": "red"
                                },
                                "layer": "kpi-COMPONENT"
                            }
                        },
                        {
                            "component": {
                                "uuid": "kpi-dd7cd87c-5f1c-4ca9-a928-8f2354cfb34b",
                                "properties": {
                                    "label": "axle gear",
                                    "item number": 3647,
                                    "item description": "Gear 8 Tooth",
                                    "category": "gear",
                                    "price [Euro]": 0.14,
                                    "mass [g]": 0.16,
                                    "delivery time [days]": 11,
                                    "data source": "https://www.bricklink.com/v2/catalog/catalogitem.page?P=3647#T=C",
                                    "color": "dark grey"
                                },
                                "layer": "kpi-COMPONENT"
                            }
                        }
                    ],
                    "assemblies": [
                        {
                            "assembly": {
                                "uuid": "kpi-f0152a0f-8438-4822-83ef-ed0ac967f368",
                                "properties": {
                                    "label": "body subassembly",
                                    "assembly_method": "connect the frames by using the pins"
                                },
                                "layer": "kpi-SUBASSEMBLY",
                                "components": [
                                    {
                                        "component": {
                                            "uuid": "kpi-ab341296-017e-4a43-8bbe-b5730de24f0f",
                                            "properties": {
                                                "label": "front frame",
                                                "item number": 32532,
                                                "item description": "Technic, Brick 6 x 8 Open Center",
                                                "category": "frame",
                                                "price [Euro]": 0.18,
                                                "mass [g]": 8.0,
                                                "delivery time [days]": 3,
                                                "data source": "https://www.bricklink.com/v2/catalog/catalogitem.page?P=32532#T=C",
                                                "dimension [studs]": "6 x 8 x 1",
                                                "color": "blue"
                                            },
                                            "layer": "kpi-COMPONENT"
                                        }
                                    },
                                    {
                                        "component": {
                                            "uuid": "kpi-72ec3dca-dfe6-462a-848e-45f17fd82632",
                                            "properties": {
                                                "label": "middle frame",
                                                "item number": 32532,
                                                "item description": "Technic, Brick 6 x 8 Open Center",
                                                "category": "frame",
                                                "price [Euro]": 0.18,
                                                "mass [g]": 8.0,
                                                "delivery time [days]": 3,
                                                "data source": "https://www.bricklink.com/v2/catalog/catalogitem.page?P=32532#T=C",
                                                "dimension [studs]": "6 x 8 x 1",
                                                "color": "blue"
                                            },
                                            "layer": "kpi-COMPONENT"
                                        }
                                    },
                                    {
                                        "component": {
                                            "uuid": "kpi-9f701250-cbca-414c-8ec9-f31ccd81b0ca",
                                            "properties": {
                                                "label": "back frame 1",
                                                "item number": 32531,
                                                "item description": "Technic, Brick 4 x 6 Open Center",
                                                "category": "frame",
                                                "price [Euro]": 0.1,
                                                "mass [g]": 5.0,
                                                "delivery time [days]": 3,
                                                "data source": "https://www.bricklink.com/v2/catalog/catalogitem.page?P=32531&idColor=11#T=C&C=11",
                                                "dimension [studs]": "4 x 6 x 1",
                                                "color": "blue"
                                            },
                                            "layer": "kpi-COMPONENT"
                                        }
                                    },
                                    {
                                        "component": {
                                            "uuid": "kpi-4b373537-c172-4b70-81df-5f175af37d0a",
                                            "properties": {
                                                "label": "back frame 2",
                                                "item number": 32531,
                                                "item description": "Technic, Brick 4 x 6 Open Center",
                                                "category": "frame",
                                                "price [Euro]": 0.1,
                                                "mass [g]": 5.0,
                                                "delivery time [days]": 3,
                                                "data source": "https://www.bricklink.com/v2/catalog/catalogitem.page?P=32531&idColor=11#T=C&C=11",
                                                "dimension [studs]": "4 x 6 x 1",
                                                "color": "blue"
                                            },
                                            "layer": "kpi-COMPONENT"
                                        }
                                    },
                                    {
                                        "component": {
                                            "uuid": "kpi-adf1efc7-54de-4315-83c4-ae4e274ffcc5",
                                            "properties": {
                                                "label": "back frame 3",
                                                "item number": 32531,
                                                "item description": "Technic, Brick 4 x 6 Open Center",
                                                "category": "frame",
                                                "price [Euro]": 0.1,
                                                "mass [g]": 5.0,
                                                "delivery time [days]": 3,
                                                "data source": "https://www.bricklink.com/v2/catalog/catalogitem.page?P=32531&idColor=11#T=C&C=11",
                                                "dimension [studs]": "4 x 6 x 1",
                                                "color": "blue"
                                            },
                                            "layer": "kpi-COMPONENT"
                                        }
                                    },
                                    {
                                        "component": {
                                            "uuid": "kpi-9c1a8b74-3363-496e-b829-05e06d158d6f",
                                            "properties": {
                                                "label": "pin 1",
                                                "item number": 3673,
                                                "item description": "Technic, Pin without Friction Ridges",
                                                "category": "frame",
                                                "price [Euro]": 0.01,
                                                "mass [g]": 0.16,
                                                "delivery time [days]": 3,
                                                "data source": "https://www.bricklink.com/v2/catalog/catalogitem.page?P=3673&name=Technic,%20Pin%20without%20Friction%20Ridges&category=%5BTechnic,%20Pin%5D#T=S&O={%22iconly%22:0}",
                                                "dimension [studs]": 1,
                                                "color": "light grey"
                                            },
                                            "layer": "kpi-COMPONENT"
                                        }
                                    },
                                    {
                                        "component": {
                                            "uuid": "kpi-bde073d2-0f6b-40f4-aeac-63665c8747f0",
                                            "properties": {
                                                "label": "pin 2",
                                                "item number": 3673,
                                                "item description": "Technic, Pin without Friction Ridges",
                                                "category": "frame",
                                                "price [Euro]": 0.01,
                                                "mass [g]": 0.16,
                                                "delivery time [days]": 3,
                                                "data source": "https://www.bricklink.com/v2/catalog/catalogitem.page?P=3673&name=Technic,%20Pin%20without%20Friction%20Ridges&category=%5BTechnic,%20Pin%5D#T=S&O={%22iconly%22:0}",
                                                "dimension [studs]": 1,
                                                "color": "light grey"
                                            },
                                            "layer": "kpi-COMPONENT"
                                        }
                                    },
                                    {
                                        "component": {
                                            "uuid": "kpi-6e6a1c5b-f96e-4e25-82cb-939c2dfb1a7a",
                                            "properties": {
                                                "label": "pin 3",
                                                "item number": 3673,
                                                "item description": "Technic, Pin without Friction Ridges",
                                                "category": "frame",
                                                "price [Euro]": 0.01,
                                                "mass [g]": 0.16,
                                                "delivery time [days]": 3,
                                                "data source": "https://www.bricklink.com/v2/catalog/catalogitem.page?P=3673&name=Technic,%20Pin%20without%20Friction%20Ridges&category=%5BTechnic,%20Pin%5D#T=S&O={%22iconly%22:0}",
                                                "dimension [studs]": 1,
                                                "color": "light grey"
                                            },
                                            "layer": "kpi-COMPONENT"
                                        }
                                    },
                                    {
                                        "component": {
                                            "uuid": "kpi-dbda092a-7463-4e90-a556-f9fd9e7d6775",
                                            "properties": {
                                                "label": "pin 4",
                                                "item number": 3673,
                                                "item description": "Technic, Pin without Friction Ridges",
                                                "category": "frame",
                                                "price [Euro]": 0.01,
                                                "mass [g]": 0.16,
                                                "delivery time [days]": 3,
                                                "data source": "https://www.bricklink.com/v2/catalog/catalogitem.page?P=3673&name=Technic,%20Pin%20without%20Friction%20Ridges&category=%5BTechnic,%20Pin%5D#T=S&O={%22iconly%22:0}",
                                                "dimension [studs]": 1,
                                                "color": "light grey"
                                            },
                                            "layer": "kpi-COMPONENT"
                                        }
                                    },
                                    {
                                        "component": {
                                            "uuid": "kpi-ea94b262-ad98-41f6-913b-828b6f9ff595",
                                            "properties": {
                                                "label": "pin 5",
                                                "item number": 3673,
                                                "item description": "Technic, Pin without Friction Ridges",
                                                "category": "frame",
                                                "price [Euro]": 0.01,
                                                "mass [g]": 0.16,
                                                "delivery time [days]": 3,
                                                "data source": "https://www.bricklink.com/v2/catalog/catalogitem.page?P=3673&name=Technic,%20Pin%20without%20Friction%20Ridges&category=%5BTechnic,%20Pin%5D#T=S&O={%22iconly%22:0}",
                                                "dimension [studs]": 1,
                                                "color": "light grey"
                                            },
                                            "layer": "kpi-COMPONENT"
                                        }
                                    },
                                    {
                                        "component": {
                                            "uuid": "kpi-1e00cd13-74fd-4711-9224-fd136b9889c3",
                                            "properties": {
                                                "label": "pin 6",
                                                "item number": 3673,
                                                "item description": "Technic, Pin without Friction Ridges",
                                                "category": "frame",
                                                "price [Euro]": 0.01,
                                                "mass [g]": 0.16,
                                                "delivery time [days]": 3,
                                                "data source": "https://www.bricklink.com/v2/catalog/catalogitem.page?P=3673&name=Technic,%20Pin%20without%20Friction%20Ridges&category=%5BTechnic,%20Pin%5D#T=S&O={%22iconly%22:0}",
                                                "dimension [studs]": 1,
                                                "color": "light grey"
                                            },
                                            "layer": "kpi-COMPONENT"
                                        }
                                    },
                                    {
                                        "component": {
                                            "uuid": "kpi-805c8259-18d5-4a42-acfe-82944ac78050",
                                            "properties": {
                                                "label": "pin 7",
                                                "item number": 3673,
                                                "item description": "Technic, Pin without Friction Ridges",
                                                "category": "frame",
                                                "price [Euro]": 0.01,
                                                "mass [g]": 0.16,
                                                "delivery time [days]": 3,
                                                "data source": "https://www.bricklink.com/v2/catalog/catalogitem.page?P=3673&name=Technic,%20Pin%20without%20Friction%20Ridges&category=%5BTechnic,%20Pin%5D#T=S&O={%22iconly%22:0}",
                                                "dimension [studs]": 1,
                                                "color": "light grey"
                                            },
                                            "layer": "kpi-COMPONENT"
                                        }
                                    },
                                    {
                                        "component": {
                                            "uuid": "kpi-63d683fb-7a76-40f7-b426-49d063f36fe9",
                                            "properties": {
                                                "label": "pin 8",
                                                "item number": 3673,
                                                "item description": "Technic, Pin without Friction Ridges",
                                                "category": "frame",
                                                "price [Euro]": 0.01,
                                                "mass [g]": 0.16,
                                                "delivery time [days]": 3,
                                                "data source": "https://www.bricklink.com/v2/catalog/catalogitem.page?P=3673&name=Technic,%20Pin%20without%20Friction%20Ridges&category=%5BTechnic,%20Pin%5D#T=S&O={%22iconly%22:0}",
                                                "dimension [studs]": 1,
                                                "color": "light grey"
                                            },
                                            "layer": "kpi-COMPONENT"
                                        }
                                    },
                                    {
                                        "component": {
                                            "uuid": "kpi-c654b3fc-acab-4cb8-baa7-c43cd2d9d0da",
                                            "properties": {
                                                "label": "pin 9",
                                                "item number": 3673,
                                                "item description": "Technic, Pin without Friction Ridges",
                                                "category": "frame",
                                                "price [Euro]": 0.01,
                                                "mass [g]": 0.16,
                                                "delivery time [days]": 3,
                                                "data source": "https://www.bricklink.com/v2/catalog/catalogitem.page?P=3673&name=Technic,%20Pin%20without%20Friction%20Ridges&category=%5BTechnic,%20Pin%5D#T=S&O={%22iconly%22:0}",
                                                "dimension [studs]": 1,
                                                "color": "light grey"
                                            },
                                            "layer": "kpi-COMPONENT"
                                        }
                                    }
                                ],
                                "assemblies": []
                            }
                        }
                    ]
                }
            },
            {
                "assembly": {
                    "uuid": "kpi-34ed1335-257c-4e8b-a5aa-706e8abe5818",
                    "properties": {
                        "label": "motor assembly",
                        "assembly_method": "put the axle into the motor, then add the bushes and the gear"
                    },
                    "layer": "kpi-SUBASSEMBLY",
                    "components": [
                        {
                            "component": {
                                "uuid": "kpi-528fbc39-bde8-4e7c-a707-ec2ce6f44798",
                                "properties": {
                                    "label": "motor",
                                    "item number": "8883-1",
                                    "item description": "Power Functions M-Motor",
                                    "category": "motor",
                                    "related items": "8881, 8878, 45517, 88000",
                                    "idle current [mA]": 65,
                                    "idle speed [rev per min]": 405,
                                    "locking torque [Ncm]": 11,
                                    "price [Euro]": 20,
                                    "mass [g]": 35.0,
                                    "delivery time [days]": 5,
                                    "data source": "https://www.bricklink.com/v2/catalog/catalogitem.page?S=8883-1&name=Power%20Functions%20M-Motor&category=%5BPower%20Functions%5D#T=S&O={%22iconly%22:0}",
                                    "compatible battery": "8881, 8878, 45517, 88000",
                                    "input voltage [V]": 9,
                                    "dimensions [cm]": "13.8 x 11.9 x 2.3",
                                    "color": "light grey"
                                },
                                "layer": "kpi-COMPONENT"
                            }
                        },
                        {
                            "component": {
                                "uuid": "kpi-be9cf8e4-00e1-458a-a5fe-9375310fd2b8",
                                "properties": {
                                    "label": "motor axle",
                                    "item number": 32073,
                                    "item description": "Axle 5 studs",
                                    "category": "axle",
                                    "price [Euro]": 0.001,
                                    "mass [g]": 0.66,
                                    "delivery time [days]": 3,
                                    "data source": "https://www.bricklink.com/v2/catalog/catalogitem.page?P=32073#T=S&O={%22iconly%22:0}",
                                    "dimension [studs]": 5,
                                    "color": "black"
                                },
                                "layer": "kpi-COMPONENT"
                            }
                        },
                        {
                            "component": {
                                "uuid": "kpi-046a5beb-d597-48aa-b6cd-1f85c0545172",
                                "properties": {
                                    "label": "motor bush",
                                    "item number": 32123,
                                    "item description": "Technic Bush 1/2 Smooth",
                                    "category": "frame",
                                    "price [Euro]": 0.01,
                                    "mass [g]": 0.01,
                                    "delivery time [days]": 3,
                                    "data source": "https://www.bricklink.com/v2/catalog/catalogitem.page?P=4265c&name=Technic%20Bush%201/2%20Smooth&category=%5BTechnic%5D#T=S&O={%22iconly%22:0}",
                                    "dimension [studs]": 1,
                                    "color": "yellow"
                                },
                                "layer": "kpi-COMPONENT"
                            }
                        },
                        {
                            "component": {
                                "uuid": "kpi-a7244ea1-2444-4b12-b1d9-bfe2aa2e173c",
                                "properties": {
                                    "label": "motor gear",
                                    "item number": 3648,
                                    "item description": "Gear 24 Tooth",
                                    "category": "gear",
                                    "price [Euro]": 0.32,
                                    "mass [g]": 1.17,
                                    "delivery time [days]": 11,
                                    "data source": "https://www.bricklink.com/v2/catalog/catalogitem.page?P=3648#T=C",
                                    "color": "light grey"
                                },
                                "layer": "kpi-COMPONENT"
                            }
                        },
                        {
                            "component": {
                                "uuid": "kpi-b85acb98-bd22-479d-a3c6-854b3e61cdd1",
                                "properties": {
                                    "label": "gear bush",
                                    "item number": 3713,
                                    "item description": "Technic Bush",
                                    "category": "frame",
                                    "price [Euro]": 0.01,
                                    "mass [g]": 0.14,
                                    "delivery time [days]": 3,
                                    "data source": "https://www.bricklink.com/v2/catalog/catalogitem.page?P=3713&name=Technic%20Bush&category=%5BTechnic%5D#T=S&O={%22iconly%22:0}",
                                    "dimension [studs]": 1,
                                    "color": "red"
                                },
                                "layer": "kpi-COMPONENT"
                            }
                        }
                    ],
                    "assemblies": []
                }
            }
        ]
    }
}