{
	"JSON": {
		"ID": "1ee7f265-383a-6731-8b98-2126e6711b85",
		"label": "",
		"comment": "UUID6 is used"
	},
	"sensor": {
		"name": "Temperature_Sensor_1",
		"type": "DS18B20",
		"manufacturer": "keyestudio",
		"serial": "3ce10457714d",
		"comment": "",
		"range": {
			"min": -55,
			"max": 125,
			"units": "degree_celsius"
		},
		"accuracy": {
			"value": 0.5,
			"type": "absolute(relative/absolute/fromMaximum)",
			"unit": "degree_celsius(degree_celsius/percent)"
		}
	}
}
