{
	"JSON": {
		"ID": "1ee84571-a529-6a57-8b21-9ca95870eab9",
		"label": "",
		"comment": "UUID6 is used"
	},
    "comment": "here you can write down something important about this setup file",
    "info": "List below ALL components, you used in your experiment. By using the UUID there is no possibility to mix something up.",
	"setup": {
		"1ee84573-9a22-6e6b-a32c-401f54d019e6": {
            "type": "group_info",
			"name": "group_info",
            "comment": "49"
        },
		"1ee84572-70d6-6221-8b76-9ab717e5c743": {
            "type": "instrument",
			"name": "raspberry_pi",
            "comment": ""
        },
		"1ee7f265-383a-6731-8b98-2126e6711b85": {
            "type": "sensor",
			"name": "temperature_cup",
            "comment": "sensor 1"     
        },            
		"1ee7f266-937f-6479-b639-73dc121f7d8a": {
            "type": "sensor",
			"name": "temperature_environment",
            "comment": "sensor 2"
        },
		"1ee8456f-c782-6370-9557-c297fc8ed88c": {
            "type": "probe",
			"name": "newton",
            "comment": ""
		}
	}
}