{
	"JSON": {
		"ID": "1ee84570-6c00-63cf-802b-fd78daa2ee6a",
		"label": "a",
		"comment": "UUID6 is used"
	},
    "comment": "here you can write down something important about this setup file",
    "info": "List below ALL components, you used in your experiment. By using the UUID there is no possibility to mix something up.",
	"setup": {
		"1ee84573-9a22-6e6b-a32c-401f54d019e6": {
            "type": "group_info",
			"name": "group_info",
            "comment": "49"
        },
		"1ee84572-70d6-6221-8b76-9ab717e5c743": {
            "type": "instrument",
			"name": "raspberry_pi",
            "comment": ""
        },
		"1ee7f265-383a-6731-8b98-2126e6711b85": {
            "type": "sensor",
			"name": "temperature_cup_hot",
            "comment": "sensor 1"
        },            
 		"1ee7f266-937f-6479-b639-73dc121f7d8a": {
            "type": "sensor",
			"name": "temperature_cup_cold",
            "comment": "sensor 2"          
        },
		"1ee8456c-cc71-6de4-94a5-9c092cc5696e": {
            "type": "probe",
			"name": "capacity",
            "comment": ""
        }
	}
}