﻿ID,"Vollständiger Name",Matrikelnummer,Status,Bewertung,"Status des Bewertungsworkflows","Bewertung kann geändert werden","Zuletzt geändert (Abgabe)","Zuletzt geändert (Bewertung)","Feedback als Kommentar"
Teilnehmer/in436452,"Nachname, Vorname",123456,"Zur Bewertung abgegeben - Unbewertet",,Unbewertet,Ja,"Montag, 18. Mai 2020, 10:11",-,
Teilnehmer/in238289,"Noch, Jemand",987654,"Keine Abgabe - Unbewertet",,Unbewertet,Ja,-,"Samstag, 16. Mai 2020, 12:15",-,
