                  epoch,         train/box_loss,         train/cls_loss,         train/dfl_loss,   metrics/precision(B),      metrics/recall(B),       metrics/mAP50(B),    metrics/mAP50-95(B),           val/box_loss,           val/cls_loss,           val/dfl_loss,                 lr/pg0,                 lr/pg1,                 lr/pg2
                      1,                  6.347,                 13.592,                 4.1947,                      0,                      0,                      0,                      0,                 6.6881,                 11.547,                 4.1594,                      0,                      0,                      0
                      2,                 6.3311,                 19.272,                 4.1619,                      0,                      0,                      0,                      0,                 6.6881,                 11.546,                 4.1589,             1.9802e-05,             1.9802e-05,             1.9802e-05
                      3,                 6.4171,                 13.758,                 4.2761,                      0,                      0,                      0,                      0,                 6.6881,                 11.547,                 4.1586,             3.9208e-05,             3.9208e-05,             3.9208e-05
                      4,                 6.3248,                 18.405,                 4.2983,                      0,                      0,                      0,                      0,                 6.6881,                 11.547,                 4.1595,             5.8218e-05,             5.8218e-05,             5.8218e-05
                      5,                 6.6184,                 35.916,                 4.2892,                      0,                      0,                      0,                      0,                 6.6881,                 11.547,                 4.1594,             7.6832e-05,             7.6832e-05,             7.6832e-05
                      6,                 6.1086,                 17.813,                 4.2065,                      0,                      0,                      0,                      0,                 6.6881,                 11.547,                 4.1596,              9.505e-05,              9.505e-05,              9.505e-05
                      7,                 6.4909,                 14.895,                 4.3121,                      0,                      0,                      0,                      0,                 6.6878,                 11.545,                 4.1595,             0.00011287,             0.00011287,             0.00011287
                      8,                 6.3438,                  21.18,                 4.1965,                      0,                      0,                      0,                      0,                 6.6878,                 11.545,                 4.1598,              0.0001303,              0.0001303,              0.0001303
                      9,                 6.6327,                 16.763,                  4.324,                      0,                      0,                      0,                      0,                 6.6878,                 11.545,                 4.1598,             0.00014733,             0.00014733,             0.00014733
                     10,                 6.7493,                 27.257,                 4.3855,                      0,                      0,                      0,                      0,                 6.6878,                 11.545,                 4.1602,             0.00016396,             0.00016396,             0.00016396
                     11,                 6.6685,                 20.233,                 4.2224,                      0,                      0,                      0,                      0,                 6.6874,                 11.547,                 4.1602,              0.0001802,              0.0001802,              0.0001802
                     12,                 6.4536,                 23.271,                  4.314,                      0,                      0,                      0,                      0,                 6.6874,                 11.548,                  4.161,             0.00019604,             0.00019604,             0.00019604
                     13,                  6.021,                 11.456,                 4.1577,                      0,                      0,                      0,                      0,                 6.6874,                 11.554,                 4.1606,             0.00021149,             0.00021149,             0.00021149
                     14,                 6.3579,                 18.025,                 4.1034,                      0,                      0,                      0,                      0,                 6.6874,                 11.555,                 4.1617,             0.00022654,             0.00022654,             0.00022654
                     15,                 6.3062,                 17.803,                 4.0943,                      0,                      0,                      0,                      0,                  6.688,                 11.563,                 4.1631,             0.00024119,             0.00024119,             0.00024119
                     16,                 6.3579,                 14.828,                 4.2302,                      0,                      0,                      0,                      0,                 6.6882,                 11.568,                 4.1646,             0.00025545,             0.00025545,             0.00025545
                     17,                 6.3768,                 10.386,                 4.0473,                      0,                      0,                      0,                      0,                 6.6882,                 11.571,                 4.1661,             0.00026931,             0.00026931,             0.00026931
                     18,                 6.6138,                 14.039,                 3.9716,                      0,                      0,                      0,                      0,                 6.6882,                 11.571,                 4.1661,             0.00028278,             0.00028278,             0.00028278
                     19,                 6.4455,                 11.281,                 3.9716,                      0,                      0,                      0,                      0,                 6.6901,                 11.598,                  4.169,             0.00029585,             0.00029585,             0.00029585
                     20,                 5.7177,                 9.2197,                 3.8252,                      0,                      0,                      0,                      0,                 6.6901,                 11.598,                  4.169,             0.00030852,             0.00030852,             0.00030852
                     21,                 5.9273,                 12.748,                 3.7205,                      0,                      0,                      0,                      0,                 6.6912,                 11.459,                 4.1734,              0.0003208,              0.0003208,              0.0003208
                     22,                 6.0377,                 9.4771,                 3.8033,                      0,                      0,                      0,                      0,                 6.6912,                 11.459,                 4.1734,             0.00033268,             0.00033268,             0.00033268
                     23,                 6.1566,                 14.997,                 3.7088,                      0,                      0,                      0,                      0,                 6.6942,                 11.356,                 4.1782,             0.00034417,             0.00034417,             0.00034417
                     24,                 6.3421,                 8.9358,                 3.8145,                      0,                      0,                      0,                      0,                 6.6942,                 11.356,                 4.1782,             0.00035526,             0.00035526,             0.00035526
                     25,                 5.9814,                 7.4021,                  3.674,                      0,                      0,                      0,                      0,                 6.6949,                 11.203,                 4.1827,             0.00036595,             0.00036595,             0.00036595
                     26,                 5.8612,                 7.1185,                 3.5651,                      0,                      0,                      0,                      0,                 6.6949,                 11.203,                 4.1827,             0.00037625,             0.00037625,             0.00037625
                     27,                 5.0675,                 7.8425,                 3.7968,                      0,                      0,                      0,                      0,                  6.697,                 11.006,                 4.1898,             0.00038615,             0.00038615,             0.00038615
                     28,                  3.752,                  5.893,                 3.5455,                      0,                      0,                      0,                      0,                  6.697,                 11.006,                 4.1898,             0.00039566,             0.00039566,             0.00039566
                     29,                 4.5237,                 5.5627,                  3.593,                      0,                      0,                      0,                      0,                 6.6998,                 10.779,                 4.1975,             0.00040477,             0.00040477,             0.00040477
                     30,                 5.0895,                 5.5949,                 3.4548,                      0,                      0,                      0,                      0,                 6.6998,                 10.779,                 4.1975,             0.00041348,             0.00041348,             0.00041348
                     31,                 3.9258,                  6.298,                 3.5532,                      0,                      0,                      0,                      0,                  6.704,                 10.501,                 4.2083,              0.0004218,              0.0004218,              0.0004218
                     32,                 4.0616,                 4.9657,                 3.2588,                      0,                      0,                      0,                      0,                  6.704,                 10.501,                 4.2083,             0.00042972,             0.00042972,             0.00042972
                     33,                 4.0281,                 5.3465,                 3.3705,                      0,                      0,                      0,                      0,                 6.7082,                 9.6373,                  4.224,             0.00043725,             0.00043725,             0.00043725
                     34,                 4.2164,                 4.2563,                 3.3458,                      0,                      0,                      0,                      0,                 6.7082,                 9.6373,                  4.224,             0.00044438,             0.00044438,             0.00044438
                     35,                 4.0673,                 4.1633,                 3.3047,                      0,                      0,                      0,                      0,                 6.7141,                 9.4765,                  4.241,             0.00045111,             0.00045111,             0.00045111
                     36,                 4.1633,                 5.1334,                 3.0705,                      0,                      0,                      0,                      0,                 6.7141,                 9.4765,                  4.241,             0.00045745,             0.00045745,             0.00045745
                     37,                 4.6979,                 5.0208,                 3.1511,                      0,                      0,                      0,                      0,                 6.7162,                 8.5265,                 4.2454,             0.00046339,             0.00046339,             0.00046339
                     38,                 4.1473,                 4.4784,                 2.9667,                      0,                      0,                      0,                      0,                 6.7162,                 8.5265,                 4.2454,             0.00046894,             0.00046894,             0.00046894
                     39,                 3.6295,                 4.8429,                 3.0693,                      0,                      0,                      0,                      0,                 6.7173,                 8.5607,                 4.2522,             0.00047409,             0.00047409,             0.00047409
                     40,                 4.1298,                 4.7988,                 3.0739,                      0,                      0,                      0,                      0,                 6.7173,                 8.5607,                 4.2522,             0.00047884,             0.00047884,             0.00047884
                     41,                 4.1986,                 4.1152,                 2.9985,                      0,                      0,                      0,                      0,                 6.7206,                  8.686,                 4.2579,              0.0004832,              0.0004832,              0.0004832
                     42,                 3.3384,                 3.9149,                 3.1408,                      0,                      0,                      0,                      0,                 6.7206,                  8.686,                 4.2579,             0.00048716,             0.00048716,             0.00048716
                     43,                 2.8727,                 5.7378,                 2.9835,                      0,                      0,                      0,                      0,                 6.7218,                 8.8373,                 4.2629,             0.00049073,             0.00049073,             0.00049073
                     44,                 3.0789,                 4.1725,                 2.9543,                      0,                      0,                      0,                      0,                 6.7218,                 8.8373,                 4.2629,              0.0004939,              0.0004939,              0.0004939
                     45,                 2.8717,                 3.9445,                 2.7449,                      0,                      0,                      0,                      0,                 6.7246,                  6.385,                 4.2728,             0.00049667,             0.00049667,             0.00049667
                     46,                 3.5011,                 3.7885,                 2.7697,                      0,                      0,                      0,                      0,                 6.7246,                  6.385,                 4.2728,             0.00049905,             0.00049905,             0.00049905
                     47,                 3.3089,                 3.4523,                 2.7631,                      0,                      0,                      0,                      0,                   6.73,                 5.8636,                 4.2941,             0.00050103,             0.00050103,             0.00050103
                     48,                 2.9199,                 3.0835,                 2.5664,                      0,                      0,                      0,                      0,                   6.73,                 5.8636,                 4.2941,             0.00050262,             0.00050262,             0.00050262
                     49,                 3.1064,                 3.2683,                 2.5864,                      0,                      0,                      0,                      0,                 6.7344,                 5.8741,                 4.3066,             0.00050381,             0.00050381,             0.00050381
                     50,                 3.8308,                 4.1135,                 2.4732,                      0,                      0,                      0,                      0,                 6.7344,                 5.8741,                 4.3066,              0.0005046,              0.0005046,              0.0005046
                     51,                 4.0377,                 4.0877,                 2.7272,                      0,                      0,                      0,                      0,                 6.7401,                 5.7734,                 4.3261,               0.000505,               0.000505,               0.000505
                     52,                 4.1876,                 4.1668,                 2.7653,                      0,                      0,                      0,                      0,                 6.7401,                 5.7734,                 4.3261,               0.000505,               0.000505,               0.000505
                     53,                 3.1394,                 3.1801,                   2.59,                      0,                      0,                      0,                      0,                 6.7401,                 5.7734,                 4.3261,             0.00050461,             0.00050461,             0.00050461
                     54,                 2.9732,                 3.2837,                 2.5511,                      0,                      0,                      0,                      0,                 6.7393,                 5.7991,                 4.3228,             0.00050382,             0.00050382,             0.00050382
                     55,                 3.3347,                  3.288,                 2.4736,                      0,                      0,                      0,                      0,                 6.7393,                 5.7991,                 4.3228,             0.00050263,             0.00050263,             0.00050263
                     56,                  3.081,                 3.5134,                 2.4442,                      0,                      0,                      0,                      0,                 6.7393,                 5.7991,                 4.3228,             0.00050105,             0.00050105,             0.00050105
                     57,                 2.6169,                 3.0497,                 2.4104,                      0,                      0,                      0,                      0,                 6.7309,                 6.0132,                  4.296,             0.00049907,             0.00049907,             0.00049907
                     58,                 2.7149,                 2.6543,                  2.553,                      0,                      0,                      0,                      0,                 6.7309,                 6.0132,                  4.296,              0.0004967,              0.0004967,              0.0004967
                     59,                 2.9663,                 3.0044,                 2.2453,                      0,                      0,                      0,                      0,                 6.7309,                 6.0132,                  4.296,             0.00049393,             0.00049393,             0.00049393
                     60,                 3.1735,                 3.1134,                 2.5486,                      0,                      0,                      0,                      0,                 6.7147,                 6.1063,                 4.2382,             0.00049076,             0.00049076,             0.00049076
                     61,                  2.836,                 3.3476,                 2.2259,                      0,                      0,                      0,                      0,                 6.7147,                 6.1063,                 4.2382,              0.0004872,              0.0004872,              0.0004872
                     62,                 2.3821,                  2.869,                 2.2754,                      0,                      0,                      0,                      0,                 6.7147,                 6.1063,                 4.2382,             0.00048324,             0.00048324,             0.00048324
                     63,                 2.8728,                 3.5269,                   2.54,                      0,                      0,                      0,                      0,                 6.6881,                 6.1648,                 4.1566,             0.00047889,             0.00047889,             0.00047889
                     64,                 3.1805,                 2.6748,                  2.351,                      0,                      0,                      0,                      0,                 6.6881,                 6.1648,                 4.1566,             0.00047414,             0.00047414,             0.00047414
                     65,                 2.2979,                 3.2374,                 2.5572,                      0,                      0,                      0,                      0,                 6.6881,                 6.1648,                 4.1566,             0.00046899,             0.00046899,             0.00046899
                     66,                 2.9011,                 3.2169,                 2.3314,                      0,                      0,                      0,                      0,                 6.6579,                 6.1846,                 4.0728,             0.00046345,             0.00046345,             0.00046345
                     67,                 2.5453,                 3.9067,                 2.3525,                      0,                      0,                      0,                      0,                 6.6579,                 6.1846,                 4.0728,             0.00045751,             0.00045751,             0.00045751
                     68,                 3.8467,                 3.9043,                 2.2844,                      0,                      0,                      0,                      0,                 6.6579,                 6.1846,                 4.0728,             0.00045118,             0.00045118,             0.00045118
                     69,                  3.472,                 3.7914,                 2.2105,                      0,                      0,                      0,                      0,                 6.6347,                 6.1498,                 4.0156,             0.00044445,             0.00044445,             0.00044445
                     70,                 2.3851,                 3.1278,                 2.2202,                      0,                      0,                      0,                      0,                 6.6347,                 6.1498,                 4.0156,             0.00043732,             0.00043732,             0.00043732
                     71,                 2.3984,                  3.393,                 2.4141,                      0,                      0,                      0,                      0,                 6.6347,                 6.1498,                 4.0156,              0.0004298,              0.0004298,              0.0004298
                     72,                 2.9676,                 3.1022,                  2.324,                      0,                      0,                      0,                      0,                 6.6365,                 6.1436,                 4.0211,             0.00042188,             0.00042188,             0.00042188
                     73,                 2.8014,                 2.3226,                 2.5415,                      0,                      0,                      0,                      0,                 6.6365,                 6.1436,                 4.0211,             0.00041357,             0.00041357,             0.00041357
                     74,                 3.0752,                   2.82,                 2.4601,                      0,                      0,                      0,                      0,                 6.6365,                 6.1436,                 4.0211,             0.00040486,             0.00040486,             0.00040486
                     75,                 2.8669,                  2.584,                 2.5087,                      0,                      0,                      0,                      0,                 6.6467,                 6.2194,                 4.0495,             0.00039575,             0.00039575,             0.00039575
                     76,                 2.4889,                  3.267,                 2.2441,                      0,                      0,                      0,                      0,                 6.6467,                 6.2194,                 4.0495,             0.00038625,             0.00038625,             0.00038625
                     77,                 2.6254,                 3.6825,                  2.255,                      0,                      0,                      0,                      0,                 6.6467,                 6.2194,                 4.0495,             0.00037635,             0.00037635,             0.00037635
                     78,                 3.0968,                 3.1529,                 2.6989,                      0,                      0,                      0,                      0,                 6.6614,                 6.3616,                 4.0879,             0.00036606,             0.00036606,             0.00036606
                     79,                 2.2179,                  3.312,                 2.0417,                      0,                      0,                      0,                      0,                 6.6614,                 6.3616,                 4.0879,             0.00035537,             0.00035537,             0.00035537
                     80,                 2.2173,                 2.7878,                 2.1354,                      0,                      0,                      0,                      0,                 6.6614,                 6.3616,                 4.0879,             0.00034428,             0.00034428,             0.00034428
                     81,                 2.3311,                 3.0015,                 2.3622,                      0,                      0,                      0,                      0,                 6.6738,                 6.4076,                  4.123,              0.0003328,              0.0003328,              0.0003328
                     82,                 2.4964,                 3.0351,                 1.9955,                      0,                      0,                      0,                      0,                 6.6738,                 6.4076,                  4.123,             0.00032092,             0.00032092,             0.00032092
                     83,                   2.14,                 2.4503,                 1.9375,                      0,                      0,                      0,                      0,                 6.6738,                 6.4076,                  4.123,             0.00030865,             0.00030865,             0.00030865
                     84,                 2.1894,                 2.8707,                 2.0128,                      0,                      0,                      0,                      0,                 6.6788,                 6.4328,                 4.1385,             0.00029598,             0.00029598,             0.00029598
                     85,                   2.51,                 2.8365,                 2.1861,                      0,                      0,                      0,                      0,                 6.6788,                 6.4328,                 4.1385,             0.00028291,             0.00028291,             0.00028291
                     86,                 2.1362,                 2.5232,                 2.0277,                      0,                      0,                      0,                      0,                 6.6788,                 6.4328,                 4.1385,             0.00026945,             0.00026945,             0.00026945
                     87,                  2.007,                 2.5875,                 2.0466,                      0,                      0,                      0,                      0,                 6.6788,                 6.4328,                 4.1385,             0.00025559,             0.00025559,             0.00025559
                     88,                 2.3375,                 2.6981,                 2.1604,                      0,                      0,                      0,                      0,                 6.6741,                 6.4247,                  4.124,             0.00024134,             0.00024134,             0.00024134
                     89,                 2.2329,                 2.5689,                 1.8848,                      0,                      0,                      0,                      0,                 6.6741,                 6.4247,                  4.124,             0.00022669,             0.00022669,             0.00022669
                     90,                 2.1608,                 2.4116,                 2.0398,                      0,                      0,                      0,                      0,                 6.6741,                 6.4247,                  4.124,             0.00021164,             0.00021164,             0.00021164
                     91,                 2.0248,                 2.8348,                 2.2883,                      0,                      0,                      0,                      0,                 6.6741,                 6.4247,                  4.124,              0.0001962,              0.0001962,              0.0001962
                     92,                   2.14,                 3.0701,                 2.1742,                      0,                      0,                      0,                      0,                 6.6726,                 6.3959,                 4.1198,             0.00018036,             0.00018036,             0.00018036
                     93,                 2.0157,                 2.9564,                 2.2568,                      0,                      0,                      0,                      0,                 6.6726,                 6.3959,                 4.1198,             0.00016413,             0.00016413,             0.00016413
                     94,                 2.0756,                 2.7585,                 2.1378,                      0,                      0,                      0,                      0,                 6.6726,                 6.3959,                 4.1198,              0.0001475,              0.0001475,              0.0001475
                     95,                 1.9218,                 2.9765,                  2.286,                      0,                      0,                      0,                      0,                 6.6726,                 6.3959,                 4.1198,             0.00013047,             0.00013047,             0.00013047
                     96,                 1.9833,                 2.7056,                 1.9898,                      0,                      0,                      0,                      0,                 6.6669,                 6.3487,                  4.105,             0.00011305,             0.00011305,             0.00011305
                     97,                 2.0442,                  2.774,                 2.1349,                      0,                      0,                      0,                      0,                 6.6669,                 6.3487,                  4.105,             9.5232e-05,             9.5232e-05,             9.5232e-05
                     98,                 2.2255,                 2.7271,                 2.2231,                      0,                      0,                      0,                      0,                 6.6669,                 6.3487,                  4.105,             7.7018e-05,             7.7018e-05,             7.7018e-05
                     99,                 2.2241,                 3.2385,                 2.2165,                      0,                      0,                      0,                      0,                 6.6669,                 6.3487,                  4.105,             5.8408e-05,             5.8408e-05,             5.8408e-05
                    100,                 2.1287,                 3.1957,                 2.1972,                      0,                      0,                      0,                      0,                 6.6646,                 6.3176,                  4.099,             3.9402e-05,             3.9402e-05,             3.9402e-05
