{
    "assembly": {
        "uuid": "kpi-0cef5d9c-1bbd-4081-b659-64191f0abcf3",
        "properties": {
            "label": "vehicle_2",
            "manufacturer": "Jonas_Dietrich",
            "comment": "Play cheaper now",
            "mass [g]": 317.3300000000001,
            "price[Euro]": 35.580999999999996,
            "delivery time [days]": 11,
            "Mass per price [g/Euro]": 8.91852393131166
        },
        "layer": "kpi-SYSTEM",
        "components": [],
        "assemblies": [
            {
                "assembly": {
                    "uuid": "kpi-6ec3fe1d-be00-4c32-9a36-347501b90991",
                    "properties": {
                        "label": "undercarriage2_assembly",
                        "assembly_method": "stick together like lego blocks"
                    },
                    "layer": "kpi-SUBASSEMBLY",
                    "components": [
                        {
                            "component": {
                                "uuid": "kpi-216a4d45-286b-4e73-83d2-7cae32461e63",
                                "properties": {
                                    "label": "front_left_frame2",
                                    "item number": 32531,
                                    "item description": "Technic, Brick 4 x 6 Open Center",
                                    "category": "frame",
                                    "price [Euro]": 0.1,
                                    "mass [g]": 5.0,
                                    "delivery time [days]": 3,
                                    "data source": "https://www.bricklink.com/v2/catalog/catalogitem.page?P=32531&idColor=11#T=C&C=11",
                                    "dimension [studs]": "4 x 6 x 1",
                                    "color": "red"
                                },
                                "layer": "kpi-COMPONENT"
                            }
                        },
                        {
                            "component": {
                                "uuid": "kpi-33220b17-dc87-41b9-a810-8642d99920c8",
                                "properties": {
                                    "label": "front_right_frame2",
                                    "item number": 32531,
                                    "item description": "Technic, Brick 4 x 6 Open Center",
                                    "category": "frame",
                                    "price [Euro]": 0.1,
                                    "mass [g]": 5.0,
                                    "delivery time [days]": 3,
                                    "data source": "https://www.bricklink.com/v2/catalog/catalogitem.page?P=32531&idColor=11#T=C&C=11",
                                    "dimension [studs]": "4 x 6 x 1",
                                    "color": "red"
                                },
                                "layer": "kpi-COMPONENT"
                            }
                        },
                        {
                            "component": {
                                "uuid": "kpi-6410155e-4fd0-4732-8909-10a51affbcb2",
                                "properties": {
                                    "label": "back_left_frame2",
                                    "item number": 32531,
                                    "item description": "Technic, Brick 4 x 6 Open Center",
                                    "category": "frame",
                                    "price [Euro]": 0.1,
                                    "mass [g]": 5.0,
                                    "delivery time [days]": 3,
                                    "data source": "https://www.bricklink.com/v2/catalog/catalogitem.page?P=32531&idColor=11#T=C&C=11",
                                    "dimension [studs]": "4 x 6 x 1",
                                    "color": "red"
                                },
                                "layer": "kpi-COMPONENT"
                            }
                        },
                        {
                            "component": {
                                "uuid": "kpi-af93509f-8d37-4ee6-aa5f-b5a2572db374",
                                "properties": {
                                    "label": "back_right_frame2",
                                    "item number": 32531,
                                    "item description": "Technic, Brick 4 x 6 Open Center",
                                    "category": "frame",
                                    "price [Euro]": 0.1,
                                    "mass [g]": 5.0,
                                    "delivery time [days]": 3,
                                    "data source": "https://www.bricklink.com/v2/catalog/catalogitem.page?P=32531&idColor=11#T=C&C=11",
                                    "dimension [studs]": "4 x 6 x 1",
                                    "color": "red"
                                },
                                "layer": "kpi-COMPONENT"
                            }
                        },
                        {
                            "component": {
                                "uuid": "kpi-1fb34f18-3d6a-4ca8-986c-e9685b8b4ad9",
                                "properties": {
                                    "label": "front_middel_pin2",
                                    "item number": 3673,
                                    "item description": "Technic, Pin without Friction Ridges",
                                    "category": "frame",
                                    "price [Euro]": 0.01,
                                    "mass [g]": 0.16,
                                    "delivery time [days]": 3,
                                    "data source": "https://www.bricklink.com/v2/catalog/catalogitem.page?P=3673&name=Technic,%20Pin%20without%20Friction%20Ridges&category=%5BTechnic,%20Pin%5D#T=S&O={%22iconly%22:0}",
                                    "dimension [studs]": 1,
                                    "color": "grey"
                                },
                                "layer": "kpi-COMPONENT"
                            }
                        },
                        {
                            "component": {
                                "uuid": "kpi-a954a38a-b4e2-4f00-b524-dd407c5edc29",
                                "properties": {
                                    "label": "left_pin2",
                                    "item number": 3673,
                                    "item description": "Technic, Pin without Friction Ridges",
                                    "category": "frame",
                                    "price [Euro]": 0.01,
                                    "mass [g]": 0.16,
                                    "delivery time [days]": 3,
                                    "data source": "https://www.bricklink.com/v2/catalog/catalogitem.page?P=3673&name=Technic,%20Pin%20without%20Friction%20Ridges&category=%5BTechnic,%20Pin%5D#T=S&O={%22iconly%22:0}",
                                    "dimension [studs]": 1,
                                    "color": "grey"
                                },
                                "layer": "kpi-COMPONENT"
                            }
                        },
                        {
                            "component": {
                                "uuid": "kpi-173ab14b-2cd8-46ea-ae84-f954ec0c0d55",
                                "properties": {
                                    "label": "right_pin2",
                                    "item number": 3673,
                                    "item description": "Technic, Pin without Friction Ridges",
                                    "category": "frame",
                                    "price [Euro]": 0.01,
                                    "mass [g]": 0.16,
                                    "delivery time [days]": 3,
                                    "data source": "https://www.bricklink.com/v2/catalog/catalogitem.page?P=3673&name=Technic,%20Pin%20without%20Friction%20Ridges&category=%5BTechnic,%20Pin%5D#T=S&O={%22iconly%22:0}",
                                    "dimension [studs]": 1,
                                    "color": "grey"
                                },
                                "layer": "kpi-COMPONENT"
                            }
                        },
                        {
                            "component": {
                                "uuid": "kpi-a0b541c9-aee2-422e-b84c-723485aa9e29",
                                "properties": {
                                    "label": "back_middel_pin2",
                                    "item number": 3673,
                                    "item description": "Technic, Pin without Friction Ridges",
                                    "category": "frame",
                                    "price [Euro]": 0.01,
                                    "mass [g]": 0.16,
                                    "delivery time [days]": 3,
                                    "data source": "https://www.bricklink.com/v2/catalog/catalogitem.page?P=3673&name=Technic,%20Pin%20without%20Friction%20Ridges&category=%5BTechnic,%20Pin%5D#T=S&O={%22iconly%22:0}",
                                    "dimension [studs]": 1,
                                    "color": "grey"
                                },
                                "layer": "kpi-COMPONENT"
                            }
                        }
                    ],
                    "assemblies": []
                }
            },
            {
                "assembly": {
                    "uuid": "kpi-8ec910a4-2dbc-4882-a0a6-b28e64755c6c",
                    "properties": {
                        "label": "front_axle2_assembly",
                        "assembly_method": "stick together like lego blocks"
                    },
                    "layer": "kpi-SUBASSEMBLY",
                    "components": [
                        {
                            "component": {
                                "uuid": "kpi-3d5500b8-7f82-4d2b-9296-fbd988e1fdab",
                                "properties": {
                                    "label": "front_axle2",
                                    "item number": 50451,
                                    "item description": "Axle 16 studs",
                                    "category": "axle",
                                    "price [Euro]": 0.75,
                                    "mass [g]": 2.37,
                                    "delivery time [days]": 3,
                                    "data source": "https://www.bricklink.com/v2/catalog/catalogitem.page?P=50451#T=S&O={%22iconly%22:0}",
                                    "dimension [studs]": 16,
                                    "color": "grey"
                                },
                                "layer": "kpi-COMPONENT"
                            }
                        },
                        {
                            "component": {
                                "uuid": "kpi-131464d0-57b4-4c1d-8319-3dc907de9c11",
                                "properties": {
                                    "label": "front_left_wheel2",
                                    "item number": "41896c04",
                                    "item description": "wheel 56",
                                    "category": "wheel",
                                    "related items": 41897,
                                    "price [Euro]": 0.45,
                                    "mass [g]": 23.0,
                                    "delivery time [days]": 5,
                                    "data source": "https://www.bricklink.com/v2/catalog/catalogitem.page?P=41896c04#T=C",
                                    "diameter [mm]": 56.0,
                                    "color": "grey"
                                },
                                "layer": "kpi-COMPONENT"
                            }
                        },
                        {
                            "component": {
                                "uuid": "kpi-c0bff1d0-f625-4cb3-98fd-da92edeb62b7",
                                "properties": {
                                    "label": "front_right_wheel2",
                                    "item number": "41896c04",
                                    "item description": "wheel 56",
                                    "category": "wheel",
                                    "related items": 41897,
                                    "price [Euro]": 0.45,
                                    "mass [g]": 23.0,
                                    "delivery time [days]": 5,
                                    "data source": "https://www.bricklink.com/v2/catalog/catalogitem.page?P=41896c04#T=C",
                                    "diameter [mm]": 56.0,
                                    "color": "grey"
                                },
                                "layer": "kpi-COMPONENT"
                            }
                        }
                    ],
                    "assemblies": []
                }
            },
            {
                "assembly": {
                    "uuid": "kpi-e62e75ef-f2de-4035-bc29-efec94820081",
                    "properties": {
                        "label": "back_axle2_assembly",
                        "assembly_method": "stick together like lego blocks"
                    },
                    "layer": "kpi-SUBASSEMBLY",
                    "components": [
                        {
                            "component": {
                                "uuid": "kpi-cc259703-b64e-47e0-bdb7-eafefbd8f04a",
                                "properties": {
                                    "label": "back_axle2",
                                    "item number": 50451,
                                    "item description": "Axle 16 studs",
                                    "category": "axle",
                                    "price [Euro]": 0.75,
                                    "mass [g]": 2.37,
                                    "delivery time [days]": 3,
                                    "data source": "https://www.bricklink.com/v2/catalog/catalogitem.page?P=50451#T=S&O={%22iconly%22:0}",
                                    "dimension [studs]": 16,
                                    "color": "grey"
                                },
                                "layer": "kpi-COMPONENT"
                            }
                        },
                        {
                            "component": {
                                "uuid": "kpi-a40a9223-cb38-49a6-93d6-d93c896a7a8e",
                                "properties": {
                                    "label": "back_left_wheel2",
                                    "item number": "56904c02",
                                    "item description": "wheel 43,2",
                                    "category": "wheel",
                                    "related items": 30699,
                                    "price [Euro]": 0.11,
                                    "mass [g]": 13.0,
                                    "delivery time [days]": 5,
                                    "data source": "https://www.bricklink.com/v2/catalog/catalogitem.page?P=56904c02#T=C",
                                    "diameter [mm]": 43.2,
                                    "color": "grey"
                                },
                                "layer": "kpi-COMPONENT"
                            }
                        },
                        {
                            "component": {
                                "uuid": "kpi-3c2857d1-3ef2-4020-ab18-97ff778e8d04",
                                "properties": {
                                    "label": "back_right_wheel2",
                                    "item number": "56904c02",
                                    "item description": "wheel 43,2",
                                    "category": "wheel",
                                    "related items": 30699,
                                    "price [Euro]": 0.11,
                                    "mass [g]": 13.0,
                                    "delivery time [days]": 5,
                                    "data source": "https://www.bricklink.com/v2/catalog/catalogitem.page?P=56904c02#T=C",
                                    "diameter [mm]": 43.2,
                                    "color": "grey"
                                },
                                "layer": "kpi-COMPONENT"
                            }
                        },
                        {
                            "component": {
                                "uuid": "kpi-a7d0f664-189e-4dc1-95db-691654415f57",
                                "properties": {
                                    "label": "back_axle_minigear_gear2",
                                    "item number": 3647,
                                    "item description": "Gear 8 Tooth",
                                    "category": "gear",
                                    "price [Euro]": 0.14,
                                    "mass [g]": 0.16,
                                    "delivery time [days]": 11,
                                    "data source": "https://www.bricklink.com/v2/catalog/catalogitem.page?P=3647#T=C",
                                    "color": "grey"
                                },
                                "layer": "kpi-COMPONENT"
                            }
                        }
                    ],
                    "assemblies": []
                }
            },
            {
                "assembly": {
                    "uuid": "kpi-12d2c3c4-2001-4c1f-9a34-8c7834de2490",
                    "properties": {
                        "label": "box_batteries2_assembly",
                        "assembly_method": "stick together like lego blocks"
                    },
                    "layer": "kpi-SUBASSEMBLY",
                    "components": [
                        {
                            "component": {
                                "uuid": "kpi-187e0d83-1905-477c-bc57-4d4812d463c3",
                                "properties": {
                                    "label": "box_batteries2",
                                    "item number": "8881-1",
                                    "item description": "Power Functions Battery Box",
                                    "category": "battery",
                                    "price [Euro]": 12,
                                    "mass [g]": 179.4,
                                    "delivery time [days]": 3,
                                    "data source": "https://www.bricklink.com/v2/catalog/catalogitem.page?S=8881-1#T=S&O={%22iconly%22:0}",
                                    "output voltage [V]": 9.0,
                                    "dimensions [cm]": "8,8 x 6,3 x 3,2",
                                    "color": "grey"
                                },
                                "layer": "kpi-COMPONENT"
                            }
                        },
                        {
                            "component": {
                                "uuid": "kpi-ec6fe10b-344c-4bbe-9d81-2f3fbb2ef3cb",
                                "properties": {
                                    "label": "batteri_front_frame2",
                                    "item number": 3701,
                                    "item description": "Technic, Brick 1 x 4 with Holes",
                                    "category": "frame",
                                    "price [Euro]": 0.01,
                                    "mass [g]": 1.46,
                                    "delivery time [days]": 3,
                                    "data source": "https://www.bricklink.com/v2/catalog/catalogitem.page?P=3701#T=C",
                                    "dimension [studs]": "1 x 4 x 1",
                                    "color": "grey"
                                },
                                "layer": "kpi-COMPONENT"
                            }
                        },
                        {
                            "component": {
                                "uuid": "kpi-5f09062b-f69a-468f-871f-6f316db50780",
                                "properties": {
                                    "label": "batteri_back_frame2",
                                    "item number": 3701,
                                    "item description": "Technic, Brick 1 x 4 with Holes",
                                    "category": "frame",
                                    "price [Euro]": 0.01,
                                    "mass [g]": 1.46,
                                    "delivery time [days]": 3,
                                    "data source": "https://www.bricklink.com/v2/catalog/catalogitem.page?P=3701#T=C",
                                    "dimension [studs]": "1 x 4 x 1",
                                    "color": "grey"
                                },
                                "layer": "kpi-COMPONENT"
                            }
                        },
                        {
                            "component": {
                                "uuid": "kpi-cd3c5270-f6f5-4e99-8faf-baa32182eb2d",
                                "properties": {
                                    "label": "batteri_front_left_pin2",
                                    "item number": 3673,
                                    "item description": "Technic, Pin without Friction Ridges",
                                    "category": "frame",
                                    "price [Euro]": 0.01,
                                    "mass [g]": 0.16,
                                    "delivery time [days]": 3,
                                    "data source": "https://www.bricklink.com/v2/catalog/catalogitem.page?P=3673&name=Technic,%20Pin%20without%20Friction%20Ridges&category=%5BTechnic,%20Pin%5D#T=S&O={%22iconly%22:0}",
                                    "dimension [studs]": 1,
                                    "color": "grey"
                                },
                                "layer": "kpi-COMPONENT"
                            }
                        },
                        {
                            "component": {
                                "uuid": "kpi-4fc3c75a-3f41-46f5-a48b-050d7f8de96d",
                                "properties": {
                                    "label": "batteri_front_right_pin2",
                                    "item number": 3673,
                                    "item description": "Technic, Pin without Friction Ridges",
                                    "category": "frame",
                                    "price [Euro]": 0.01,
                                    "mass [g]": 0.16,
                                    "delivery time [days]": 3,
                                    "data source": "https://www.bricklink.com/v2/catalog/catalogitem.page?P=3673&name=Technic,%20Pin%20without%20Friction%20Ridges&category=%5BTechnic,%20Pin%5D#T=S&O={%22iconly%22:0}",
                                    "dimension [studs]": 1,
                                    "color": "grey"
                                },
                                "layer": "kpi-COMPONENT"
                            }
                        },
                        {
                            "component": {
                                "uuid": "kpi-becb7127-514e-450d-818b-0ce99937065a",
                                "properties": {
                                    "label": "batteri_back_left_pin2",
                                    "item number": 3673,
                                    "item description": "Technic, Pin without Friction Ridges",
                                    "category": "frame",
                                    "price [Euro]": 0.01,
                                    "mass [g]": 0.16,
                                    "delivery time [days]": 3,
                                    "data source": "https://www.bricklink.com/v2/catalog/catalogitem.page?P=3673&name=Technic,%20Pin%20without%20Friction%20Ridges&category=%5BTechnic,%20Pin%5D#T=S&O={%22iconly%22:0}",
                                    "dimension [studs]": 1,
                                    "color": "grey"
                                },
                                "layer": "kpi-COMPONENT"
                            }
                        },
                        {
                            "component": {
                                "uuid": "kpi-e78ce033-5135-4dc3-a9fc-8a6bbda12e8d",
                                "properties": {
                                    "label": "batteri_back_right_pin2",
                                    "item number": 3673,
                                    "item description": "Technic, Pin without Friction Ridges",
                                    "category": "frame",
                                    "price [Euro]": 0.01,
                                    "mass [g]": 0.16,
                                    "delivery time [days]": 3,
                                    "data source": "https://www.bricklink.com/v2/catalog/catalogitem.page?P=3673&name=Technic,%20Pin%20without%20Friction%20Ridges&category=%5BTechnic,%20Pin%5D#T=S&O={%22iconly%22:0}",
                                    "dimension [studs]": 1,
                                    "color": "grey"
                                },
                                "layer": "kpi-COMPONENT"
                            }
                        }
                    ],
                    "assemblies": []
                }
            },
            {
                "assembly": {
                    "uuid": "kpi-f88e49a8-cf1b-45db-bee3-bfd5a7f5a37a",
                    "properties": {
                        "label": "motor_axle2_assembly",
                        "assembly_method": "stick together like lego blocks"
                    },
                    "layer": "kpi-SUBASSEMBLY",
                    "components": [
                        {
                            "component": {
                                "uuid": "kpi-d55ba009-9b59-4220-9182-920a383b9e09",
                                "properties": {
                                    "label": "motor_axle2",
                                    "item number": 32073,
                                    "item description": "Axle 5 studs",
                                    "category": "axle",
                                    "price [Euro]": 0.001,
                                    "mass [g]": 0.66,
                                    "delivery time [days]": 3,
                                    "data source": "https://www.bricklink.com/v2/catalog/catalogitem.page?P=32073#T=S&O={%22iconly%22:0}",
                                    "dimension [studs]": 5,
                                    "color": "grey"
                                },
                                "layer": "kpi-COMPONENT"
                            }
                        },
                        {
                            "component": {
                                "uuid": "kpi-38580c59-aad5-43fc-ab7f-839c283c408f",
                                "properties": {
                                    "label": "motor_gear2",
                                    "item number": 3648,
                                    "item description": "Gear 24 Tooth",
                                    "category": "gear",
                                    "price [Euro]": 0.32,
                                    "mass [g]": 1.17,
                                    "delivery time [days]": 11,
                                    "data source": "https://www.bricklink.com/v2/catalog/catalogitem.page?P=3648#T=C",
                                    "color": "grey"
                                },
                                "layer": "kpi-COMPONENT"
                            }
                        },
                        {
                            "component": {
                                "uuid": "kpi-87863f28-3440-405d-92bd-3da0d6b51626",
                                "properties": {
                                    "label": "motor_motors2",
                                    "item number": "8883-1",
                                    "item description": "Power Functions M-Motor",
                                    "category": "motor",
                                    "related items": "8881, 8878, 45517, 88000",
                                    "idle current [mA]": 65,
                                    "idle speed [rev per min]": 405,
                                    "locking torque [Ncm]": 11,
                                    "price [Euro]": 20,
                                    "mass [g]": 35.0,
                                    "delivery time [days]": 5,
                                    "data source": "https://www.bricklink.com/v2/catalog/catalogitem.page?S=8883-1&name=Power%20Functions%20M-Motor&category=%5BPower%20Functions%5D#T=S&O={%22iconly%22:0}",
                                    "compatible battery": "8881, 8878, 45517, 88000",
                                    "input voltage [V]": 9,
                                    "dimensions [cm]": "13.8 x 11.9 x 2.3",
                                    "color": "grey"
                                },
                                "layer": "kpi-COMPONENT"
                            }
                        }
                    ],
                    "assemblies": []
                }
            }
        ]
    }
}